cxf-notifications mailing list archives

Site index · List index
Message view « Date » · « Thread »
Top « Date » · « Thread »
From Apache Jenkins Server <jenk...@builds.apache.org>
Subject Build failed in Jenkins: CXF-DOSGi #1109
Date Mon, 25 Jul 2016 14:07:18 GMT
See <https://builds.apache.org/job/CXF-DOSGi/1109/changes>

Changes:

[chris] [CXF-5107] Remove old intentmanager methods

------------------------------------------
[...truncated 117 lines...]
[INFO] Downloaded: http://repository.apache.org/snapshots/org/apache/maven/plugins/maven-deploy-plugin/maven-metadata.xml
(460 B at 0.2 KB/sec)
[INFO] 
[INFO] --- maven-clean-plugin:2.5:clean (default-clean) @ cxf-dosgi-ri-decorator ---
[INFO] Deleting <https://builds.apache.org/job/CXF-DOSGi/ws/decorator/target>
[INFO] 
[INFO] --- maven-checkstyle-plugin:2.17:checkstyle (validate) @ cxf-dosgi-ri-decorator ---
[INFO] Starting audit...
Audit done.
[WARNING] Unable to locate Source XRef to link to - DISABLED
[INFO] 
[INFO] --- maven-jaxb2-plugin:0.9.1:generate (default) @ cxf-dosgi-ri-decorator ---
[INFO] Sources are not up-to-date; XJC execution will be executed.
[INFO] 
[INFO] --- maven-remote-resources-plugin:1.5:process (default) @ cxf-dosgi-ri-decorator ---
[INFO] 
[INFO] --- maven-resources-plugin:2.5:resources (default-resources) @ cxf-dosgi-ri-decorator
---
[debug] execute contextualize
[INFO] Using 'UTF-8' encoding to copy filtered resources.
[INFO] Copying 1 resource
[INFO] Copying 1 resource
[INFO] Copying 3 resources
[INFO] 
[INFO] --- maven-compiler-plugin:3.5.1:compile (default-compile) @ cxf-dosgi-ri-decorator
---
[INFO] Changes detected - recompiling the module!
[INFO] Compiling 14 source files to <https://builds.apache.org/job/CXF-DOSGi/ws/decorator/target/classes>
[INFO] 
[INFO] --- maven-resources-plugin:2.5:testResources (default-testResources) @ cxf-dosgi-ri-decorator
---
[debug] execute contextualize
[INFO] Using 'UTF-8' encoding to copy filtered resources.
[INFO] Copying 10 resources
[INFO] Copying 3 resources
[INFO] 
[INFO] --- maven-compiler-plugin:3.5.1:testCompile (default-testCompile) @ cxf-dosgi-ri-decorator
---
[INFO] Changes detected - recompiling the module!
[INFO] Compiling 4 source files to <https://builds.apache.org/job/CXF-DOSGi/ws/decorator/target/test-classes>
[INFO] 
[INFO] --- maven-surefire-plugin:2.8.1:test (default-test) @ cxf-dosgi-ri-decorator ---
[INFO] Surefire report directory: <https://builds.apache.org/job/CXF-DOSGi/ws/decorator/target/surefire-reports>

-------------------------------------------------------
 T E S T S
-------------------------------------------------------
Running org.apache.cxf.dosgi.dsw.decorator.ServiceDecoratorBundleListenerTest
SLF4J: Failed to load class "org.slf4j.impl.StaticLoggerBinder".
SLF4J: Defaulting to no-operation (NOP) logger implementation
SLF4J: See http://www.slf4j.org/codes.html#StaticLoggerBinder for further details.
Tests run: 1, Failures: 0, Errors: 0, Skipped: 0, Time elapsed: 0.377 sec
Running org.apache.cxf.dosgi.dsw.decorator.InterfaceRuleTest
Tests run: 8, Failures: 0, Errors: 0, Skipped: 0, Time elapsed: 0.026 sec
Running org.apache.cxf.dosgi.dsw.decorator.ServiceDecoratorImplTest
Tests run: 9, Failures: 0, Errors: 0, Skipped: 0, Time elapsed: 0.198 sec
Running org.apache.cxf.dosgi.dsw.decorator.DecorationParserTest
Tests run: 2, Failures: 0, Errors: 0, Skipped: 0, Time elapsed: 0.028 sec

Results :

Tests run: 20, Failures: 0, Errors: 0, Skipped: 0

[JENKINS] Recording test results
[INFO] 
[INFO] --- maven-bundle-plugin:3.2.0:bundle (default-bundle) @ cxf-dosgi-ri-decorator ---
[INFO] 
[INFO] --- maven-bundle-plugin:3.2.0:baseline (baseline) @ cxf-dosgi-ri-decorator ---
[INFO] Skipping Baseline execution
[INFO] 
[INFO] --- maven-install-plugin:2.5.2:install (default-install) @ cxf-dosgi-ri-decorator ---
[INFO] Installing <https://builds.apache.org/job/CXF-DOSGi/ws/decorator/target/cxf-dosgi-ri-decorator-2.0-SNAPSHOT.jar>
to /home/jenkins/.m2/repository/org/apache/cxf/dosgi/cxf-dosgi-ri-decorator/2.0-SNAPSHOT/cxf-dosgi-ri-decorator-2.0-SNAPSHOT.jar
[INFO] Installing <https://builds.apache.org/job/CXF-DOSGi/ws/decorator/pom.xml> to
/home/jenkins/.m2/repository/org/apache/cxf/dosgi/cxf-dosgi-ri-decorator/2.0-SNAPSHOT/cxf-dosgi-ri-decorator-2.0-SNAPSHOT.pom
[INFO] 
[INFO] --- maven-bundle-plugin:3.2.0:install (default-install) @ cxf-dosgi-ri-decorator ---
[INFO] Local OBR update disabled (enable with -DobrRepository)
[INFO]                                                                         
[INFO] ------------------------------------------------------------------------
[INFO] Building CXF dOSGi Common 2.0-SNAPSHOT
[INFO] ------------------------------------------------------------------------
[INFO] Downloading: http://repository.apache.org/snapshots/org/apache/cxf/cxf-core/3.1.7-SNAPSHOT/maven-metadata.xml
[INFO] Downloaded: http://repository.apache.org/snapshots/org/apache/cxf/cxf-core/3.1.7-SNAPSHOT/maven-metadata.xml
(2 KB at 9.0 KB/sec)
[INFO] Downloading: http://repository.apache.org/snapshots/org/apache/cxf/cxf-core/3.1.7-SNAPSHOT/cxf-core-3.1.7-20160725.140508-328.pom
[INFO] Downloaded: http://repository.apache.org/snapshots/org/apache/cxf/cxf-core/3.1.7-SNAPSHOT/cxf-core-3.1.7-20160725.140508-328.pom
(19 KB at 238.0 KB/sec)
[INFO] Downloading: http://repository.apache.org/snapshots/org/apache/cxf/cxf-parent/3.1.7-SNAPSHOT/maven-metadata.xml
[INFO] Downloaded: http://repository.apache.org/snapshots/org/apache/cxf/cxf-parent/3.1.7-SNAPSHOT/maven-metadata.xml
(605 B at 7.0 KB/sec)
[INFO] Downloading: http://repository.apache.org/snapshots/org/apache/cxf/cxf-parent/3.1.7-SNAPSHOT/cxf-parent-3.1.7-20160725.140351-333.pom
[INFO] Downloading: http://repository.apache.org/snapshots/org/apache/cxf/cxf-rt-transports-http/3.1.7-SNAPSHOT/maven-metadata.xml
[INFO] Downloaded: http://repository.apache.org/snapshots/org/apache/cxf/cxf-rt-transports-http/3.1.7-SNAPSHOT/maven-metadata.xml
(2 KB at 0.1 KB/sec)
[INFO] Downloading: http://repository.apache.org/snapshots/org/apache/cxf/cxf-rt-transports-http/3.1.7-SNAPSHOT/cxf-rt-transports-http-3.1.7-20160725.063006-305.pom
[INFO] ------------------------------------------------------------------------
[INFO] Reactor Summary:
[INFO] 
[INFO] Distributed OSGI Reference Implementation .......... SUCCESS [  4.966 s]
[INFO] Distributed OSGI Reference Implementation Parent ... SUCCESS [  5.850 s]
[INFO] CXF dOSGi Service decorator support ................ SUCCESS [01:53 min]
[INFO] CXF dOSGi Common ................................... FAILURE [ 28.219 s]
[INFO] CXF dOSGi provider ws .............................. SKIPPED
[INFO] CXF dOSGi provider rs .............................. SKIPPED
[INFO] Distributed OSGI Greeter Bundles ................... SKIPPED
[INFO] Distributed OSGI Greeter Interface Bundle .......... SKIPPED
[INFO] Distributed OSGI Greeter Implementation Bundle ..... SKIPPED
[INFO] Distributed OSGI Greeter Bundle Client ............. SKIPPED
[INFO] Distributed OSGI Greeter REST Interface ............ SKIPPED
[INFO] Distributed OSGI Greeter REST ...................... SKIPPED
[INFO] Distributed OSGI Greeter REST Impl ................. SKIPPED
[INFO] Distributed OSGI Greeter REST Client ............... SKIPPED
[INFO] Distributed OSGI DS Sample ......................... SKIPPED
[INFO] Distributed OSGI DS Sample Interface ............... SKIPPED
[INFO] Distributed OSGI DS Sample Impl .................... SKIPPED
[INFO] Distributed OSGI DS Client ......................... SKIPPED
[INFO] Distributed OSGI Security Sample Bundle ............ SKIPPED
[INFO] Distributed OSGI RI Sample Bundles ................. SKIPPED
[INFO] Distributed OSGI Distribution Parent ............... SKIPPED
[INFO] CXF DOSGI Karaf Features ........................... SKIPPED
[INFO] Distributed OSGI Multi-Bundle Distribution ......... SKIPPED
[INFO] cxf-dosgi-ri-repository ............................ SKIPPED
[INFO] Distributed OSGI Source Distribution ............... SKIPPED
[INFO] Distributed OSGi System Tests Multi-Bundle ......... SKIPPED
[INFO] Distributed OSGi System Tests ...................... SKIPPED
[INFO] ------------------------------------------------------------------------
[INFO] BUILD FAILURE
[INFO] ------------------------------------------------------------------------
[INFO] Total time: 03:29 min
[INFO] Finished at: 2016-07-25T14:06:57+00:00
[INFO] Final Memory: 42M/308M
[INFO] ------------------------------------------------------------------------
[ERROR] Failed to execute goal on project cxf-dosgi-ri-common: Could not resolve dependencies
for project org.apache.cxf.dosgi:cxf-dosgi-ri-common:bundle:2.0-SNAPSHOT: Failed to collect
dependencies at org.apache.cxf:cxf-core:jar:3.1.7-SNAPSHOT: Failed to read artifact descriptor
for org.apache.cxf:cxf-core:jar:3.1.7-SNAPSHOT: Could not transfer artifact org.apache.cxf:cxf-parent:pom:3.1.7-20160725.140351-333
from/to Nexus (http://repository.apache.org/snapshots): Failed to transfer file: http://repository.apache.org/snapshots/org/apache/cxf/cxf-parent/3.1.7-SNAPSHOT/cxf-parent-3.1.7-20160725.140351-333.pom.
Return code is: 502 , ReasonPhrase:Proxy Error. -> [Help 1]
org.apache.maven.lifecycle.LifecycleExecutionException: Failed to execute goal on project
cxf-dosgi-ri-common: Could not resolve dependencies for project org.apache.cxf.dosgi:cxf-dosgi-ri-common:bundle:2.0-SNAPSHOT:
Failed to collect dependencies at org.apache.cxf:cxf-core:jar:3.1.7-SNAPSHOT
	at org.apache.maven.lifecycle.internal.LifecycleDependencyResolver.getDependencies(LifecycleDependencyResolver.java:220)
	at org.apache.maven.lifecycle.internal.LifecycleDependencyResolver.resolveProjectDependencies(LifecycleDependencyResolver.java:127)
	at org.apache.maven.lifecycle.internal.MojoExecutor.ensureDependenciesAreResolved(MojoExecutor.java:257)
	at org.apache.maven.lifecycle.internal.MojoExecutor.execute(MojoExecutor.java:200)
	at org.apache.maven.lifecycle.internal.MojoExecutor.execute(MojoExecutor.java:153)
	at org.apache.maven.lifecycle.internal.MojoExecutor.execute(MojoExecutor.java:145)
	at org.apache.maven.lifecycle.internal.LifecycleModuleBuilder.buildProject(LifecycleModuleBuilder.java:116)
	at org.apache.maven.lifecycle.internal.LifecycleModuleBuilder.buildProject(LifecycleModuleBuilder.java:80)
	at org.apache.maven.lifecycle.internal.builder.singlethreaded.SingleThreadedBuilder.build(SingleThreadedBuilder.java:51)
	at org.apache.maven.lifecycle.internal.LifecycleStarter.execute(LifecycleStarter.java:120)
	at org.apache.maven.DefaultMaven.doExecute(DefaultMaven.java:355)
	at org.apache.maven.DefaultMaven.execute(DefaultMaven.java:155)
	at org.jvnet.hudson.maven3.launcher.Maven32Launcher.main(Maven32Launcher.java:132)
	at sun.reflect.NativeMethodAccessorImpl.invoke0(Native Method)
	at sun.reflect.NativeMethodAccessorImpl.invoke(NativeMethodAccessorImpl.java:57)
	at sun.reflect.DelegatingMethodAccessorImpl.invoke(DelegatingMethodAccessorImpl.java:43)
	at java.lang.reflect.Method.invoke(Method.java:606)
	at org.codehaus.plexus.classworlds.launcher.Launcher.launchStandard(Launcher.java:330)
	at org.codehaus.plexus.classworlds.launcher.Launcher.launch(Launcher.java:238)
	at jenkins.maven3.agent.Maven32Main.launch(Maven32Main.java:186)
	at sun.reflect.NativeMethodAccessorImpl.invoke0(Native Method)
	at sun.reflect.NativeMethodAccessorImpl.invoke(NativeMethodAccessorImpl.java:57)
	at sun.reflect.DelegatingMethodAccessorImpl.invoke(DelegatingMethodAccessorImpl.java:43)
	at java.lang.reflect.Method.invoke(Method.java:606)
	at hudson.maven.Maven3Builder.call(Maven3Builder.java:136)
	at hudson.maven.Maven3Builder.call(Maven3Builder.java:71)
	at hudson.remoting.UserRequest.perform(UserRequest.java:120)
	at hudson.remoting.UserRequest.perform(UserRequest.java:48)
	at hudson.remoting.Request$2.run(Request.java:326)
	at hudson.remoting.InterceptingExecutorService$1.call(InterceptingExecutorService.java:68)
	at java.util.concurrent.FutureTask.run(FutureTask.java:262)
	at java.util.concurrent.ThreadPoolExecutor.runWorker(ThreadPoolExecutor.java:1145)
	at java.util.concurrent.ThreadPoolExecutor$Worker.run(ThreadPoolExecutor.java:615)
	at java.lang.Thread.run(Thread.java:745)
Caused by: org.apache.maven.project.DependencyResolutionException: Could not resolve dependencies
for project org.apache.cxf.dosgi:cxf-dosgi-ri-common:bundle:2.0-SNAPSHOT: Failed to collect
dependencies at org.apache.cxf:cxf-core:jar:3.1.7-SNAPSHOT
	at org.apache.maven.project.DefaultProjectDependenciesResolver.resolve(DefaultProjectDependenciesResolver.java:180)
	at org.apache.maven.lifecycle.internal.LifecycleDependencyResolver.getDependencies(LifecycleDependencyResolver.java:195)
	... 33 more
Caused by: org.eclipse.aether.collection.DependencyCollectionException: Failed to collect
dependencies at org.apache.cxf:cxf-core:jar:3.1.7-SNAPSHOT
	at org.eclipse.aether.internal.impl.DefaultDependencyCollector.collectDependencies(DefaultDependencyCollector.java:291)
	at org.eclipse.aether.internal.impl.DefaultRepositorySystem.collectDependencies(DefaultRepositorySystem.java:316)
	at org.apache.maven.project.DefaultProjectDependenciesResolver.resolve(DefaultProjectDependenciesResolver.java:172)
	... 34 more
Caused by: org.eclipse.aether.resolution.ArtifactDescriptorException: Failed to read artifact
descriptor for org.apache.cxf:cxf-core:jar:3.1.7-SNAPSHOT
	at org.apache.maven.repository.internal.DefaultArtifactDescriptorReader.loadPom(DefaultArtifactDescriptorReader.java:337)
	at org.apache.maven.repository.internal.DefaultArtifactDescriptorReader.readArtifactDescriptor(DefaultArtifactDescriptorReader.java:217)
	at org.eclipse.aether.internal.impl.DefaultDependencyCollector.resolveCachedArtifactDescriptor(DefaultDependencyCollector.java:525)
	at org.eclipse.aether.internal.impl.DefaultDependencyCollector.getArtifactDescriptorResult(DefaultDependencyCollector.java:509)
	at org.eclipse.aether.internal.impl.DefaultDependencyCollector.processDependency(DefaultDependencyCollector.java:409)
	at org.eclipse.aether.internal.impl.DefaultDependencyCollector.processDependency(DefaultDependencyCollector.java:363)
	at org.eclipse.aether.internal.impl.DefaultDependencyCollector.process(DefaultDependencyCollector.java:351)
	at org.eclipse.aether.internal.impl.DefaultDependencyCollector.collectDependencies(DefaultDependencyCollector.java:254)
	... 36 more
Caused by: org.apache.maven.model.resolution.UnresolvableModelException: Could not transfer
artifact org.apache.cxf:cxf-parent:pom:3.1.7-20160725.140351-333 from/to Nexus (http://repository.apache.org/snapshots):
Failed to transfer file: http://repository.apache.org/snapshots/org/apache/cxf/cxf-parent/3.1.7-SNAPSHOT/cxf-parent-3.1.7-20160725.140351-333.pom.
Return code is: 502 , ReasonPhrase:Proxy Error.
	at org.apache.maven.repository.internal.DefaultModelResolver.resolveModel(DefaultModelResolver.java:177)
	at org.apache.maven.repository.internal.DefaultModelResolver.resolveModel(DefaultModelResolver.java:226)
	at org.apache.maven.model.building.DefaultModelBuilder.readParentExternally(DefaultModelBuilder.java:899)
	at org.apache.maven.model.building.DefaultModelBuilder.readParent(DefaultModelBuilder.java:751)
	at org.apache.maven.model.building.DefaultModelBuilder.build(DefaultModelBuilder.java:309)
	at org.apache.maven.repository.internal.DefaultArtifactDescriptorReader.loadPom(DefaultArtifactDescriptorReader.java:328)
	... 43 more
Caused by: org.eclipse.aether.resolution.ArtifactResolutionException: Could not transfer artifact
org.apache.cxf:cxf-parent:pom:3.1.7-20160725.140351-333 from/to Nexus (http://repository.apache.org/snapshots):
Failed to transfer file: http://repository.apache.org/snapshots/org/apache/cxf/cxf-parent/3.1.7-SNAPSHOT/cxf-parent-3.1.7-20160725.140351-333.pom.
Return code is: 502 , ReasonPhrase:Proxy Error.
	at org.eclipse.aether.internal.impl.DefaultArtifactResolver.resolve(DefaultArtifactResolver.java:444)
	at org.eclipse.aether.internal.impl.DefaultArtifactResolver.resolveArtifacts(DefaultArtifactResolver.java:246)
	at org.eclipse.aether.internal.impl.DefaultArtifactResolver.resolveArtifact(DefaultArtifactResolver.java:223)
	at org.apache.maven.repository.internal.DefaultModelResolver.resolveModel(DefaultModelResolver.java:173)
	... 48 more
Caused by: org.eclipse.aether.transfer.ArtifactTransferException: Could not transfer artifact
org.apache.cxf:cxf-parent:pom:3.1.7-20160725.140351-333 from/to Nexus (http://repository.apache.org/snapshots):
Failed to transfer file: http://repository.apache.org/snapshots/org/apache/cxf/cxf-parent/3.1.7-SNAPSHOT/cxf-parent-3.1.7-20160725.140351-333.pom.
Return code is: 502 , ReasonPhrase:Proxy Error.
	at org.eclipse.aether.connector.basic.ArtifactTransportListener.transferFailed(ArtifactTransportListener.java:43)
	at org.eclipse.aether.connector.basic.BasicRepositoryConnector$TaskRunner.run(BasicRepositoryConnector.java:355)
	at org.eclipse.aether.util.concurrency.RunnableErrorForwarder$1.run(RunnableErrorForwarder.java:67)
	at org.eclipse.aether.connector.basic.BasicRepositoryConnector$DirectExecutor.execute(BasicRepositoryConnector.java:581)
	at org.eclipse.aether.connector.basic.BasicRepositoryConnector.get(BasicRepositoryConnector.java:249)
	at org.eclipse.aether.internal.impl.DefaultArtifactResolver.performDownloads(DefaultArtifactResolver.java:520)
	at org.eclipse.aether.internal.impl.DefaultArtifactResolver.resolve(DefaultArtifactResolver.java:421)
	... 51 more
Caused by: org.apache.maven.wagon.TransferFailedException: Failed to transfer file: http://repository.apache.org/snapshots/org/apache/cxf/cxf-parent/3.1.7-SNAPSHOT/cxf-parent-3.1.7-20160725.140351-333.pom.
Return code is: 502 , ReasonPhrase:Proxy Error.
	at org.apache.maven.wagon.providers.http.AbstractHttpClientWagon.fillInputData(AbstractHttpClientWagon.java:1039)
	at org.apache.maven.wagon.providers.http.AbstractHttpClientWagon.fillInputData(AbstractHttpClientWagon.java:977)
	at org.apache.maven.wagon.StreamWagon.getInputStream(StreamWagon.java:116)
	at org.apache.maven.wagon.StreamWagon.getIfNewer(StreamWagon.java:88)
	at org.apache.maven.wagon.StreamWagon.get(StreamWagon.java:61)
	at org.eclipse.aether.transport.wagon.WagonTransporter$GetTaskRunner.run(WagonTransporter.java:560)
	at org.eclipse.aether.transport.wagon.WagonTransporter.execute(WagonTransporter.java:427)
	at org.eclipse.aether.transport.wagon.WagonTransporter.get(WagonTransporter.java:404)
	at org.eclipse.aether.connector.basic.BasicRepositoryConnector$GetTaskRunner.runTask(BasicRepositoryConnector.java:447)
	at org.eclipse.aether.connector.basic.BasicRepositoryConnector$TaskRunner.run(BasicRepositoryConnector.java:350)
	... 56 more
[ERROR] 
[ERROR] Re-run Maven using the -X switch to enable full debug logging.
[ERROR] 
[ERROR] For more information about the errors and possible solutions, please read the following
articles:
[ERROR] [Help 1] http://cwiki.apache.org/confluence/display/MAVEN/DependencyResolutionException
[ERROR] 
[ERROR] After correcting the problems, you can resume the build with the command
[ERROR]   mvn <goals> -rf :cxf-dosgi-ri-common
[JENKINS] Archiving <https://builds.apache.org/job/CXF-DOSGi/ws/samples/greeter/client/pom.xml>
to org.apache.cxf.dosgi.samples/cxf-dosgi-ri-samples-greeter-client/2.0-SNAPSHOT/cxf-dosgi-ri-samples-greeter-client-2.0-SNAPSHOT.pom
[JENKINS] Archiving <https://builds.apache.org/job/CXF-DOSGi/ws/parent/pom.xml> to org.apache.cxf.dosgi/cxf-dosgi-ri-parent/2.0-SNAPSHOT/cxf-dosgi-ri-parent-2.0-SNAPSHOT.pom
[JENKINS] Archiving <https://builds.apache.org/job/CXF-DOSGi/ws/samples/ds/impl/pom.xml>
to org.apache.cxf.dosgi.samples/cxf-dosgi-ri-samples-ds-impl/2.0-SNAPSHOT/cxf-dosgi-ri-samples-ds-impl-2.0-SNAPSHOT.pom
[JENKINS] Archiving <https://builds.apache.org/job/CXF-DOSGi/ws/pom.xml> to org.apache.cxf.dosgi/cxf-dosgi-ri/2.0-SNAPSHOT/cxf-dosgi-ri-2.0-SNAPSHOT.pom
[JENKINS] Archiving <https://builds.apache.org/job/CXF-DOSGi/ws/distribution/multi-bundle/pom.xml>
to org.apache.cxf.dosgi/cxf-dosgi-ri-multibundle-distribution/2.0-SNAPSHOT/cxf-dosgi-ri-multibundle-distribution-2.0-SNAPSHOT.pom
[JENKINS] Archiving <https://builds.apache.org/job/CXF-DOSGi/ws/samples/greeter_rest/impl/pom.xml>
to org.apache.cxf.dosgi.samples/cxf-dosgi-ri-samples-greeter-rest-impl/2.0-SNAPSHOT/cxf-dosgi-ri-samples-greeter-rest-impl-2.0-SNAPSHOT.pom
[JENKINS] Archiving <https://builds.apache.org/job/CXF-DOSGi/ws/provider-rs/pom.xml>
to org.apache.cxf.dosgi/cxf-dosgi-ri-provider-rs/2.0-SNAPSHOT/cxf-dosgi-ri-provider-rs-2.0-SNAPSHOT.pom
[JENKINS] Archiving <https://builds.apache.org/job/CXF-DOSGi/ws/samples/greeter_rest/pom.xml>
to org.apache.cxf.dosgi.samples/cxf-dosgi-ri-samples-greeter-rest-parent/2.0-SNAPSHOT/cxf-dosgi-ri-samples-greeter-rest-parent-2.0-SNAPSHOT.pom
[JENKINS] Archiving <https://builds.apache.org/job/CXF-DOSGi/ws/samples/pom.xml> to
org.apache.cxf.dosgi.samples/cxf-dosgi-ri-samples/2.0-SNAPSHOT/cxf-dosgi-ri-samples-2.0-SNAPSHOT.pom
[JENKINS] Archiving <https://builds.apache.org/job/CXF-DOSGi/ws/samples/ds/pom.xml>
to org.apache.cxf.dosgi.samples/cxf-dosgi-ri-samples-ds-parent/2.0-SNAPSHOT/cxf-dosgi-ri-samples-ds-parent-2.0-SNAPSHOT.pom
[JENKINS] Archiving <https://builds.apache.org/job/CXF-DOSGi/ws/provider-ws/pom.xml>
to org.apache.cxf.dosgi/cxf-dosgi-ri-provider-ws/2.0-SNAPSHOT/cxf-dosgi-ri-provider-ws-2.0-SNAPSHOT.pom
[JENKINS] Archiving <https://builds.apache.org/job/CXF-DOSGi/ws/itests/pom.xml> to org.apache.cxf.dosgi.systests/cxf-dosgi-ri-itests/2.0-SNAPSHOT/cxf-dosgi-ri-itests-2.0-SNAPSHOT.pom
[JENKINS] Archiving <https://builds.apache.org/job/CXF-DOSGi/ws/itests/multi-bundle/pom.xml>
to org.apache.cxf.dosgi.systests/cxf-dosgi-ri-itests-multibundle/2.0-SNAPSHOT/cxf-dosgi-ri-itests-multibundle-2.0-SNAPSHOT.pom
[JENKINS] Archiving <https://builds.apache.org/job/CXF-DOSGi/ws/samples/security_filter/pom.xml>
to org.apache.cxf.dosgi.samples/cxf-dosgi-ri-samples-security/2.0-SNAPSHOT/cxf-dosgi-ri-samples-security-2.0-SNAPSHOT.pom
[JENKINS] Archiving <https://builds.apache.org/job/CXF-DOSGi/ws/distribution/sources/pom.xml>
to org.apache.cxf.dosgi/cxf-dosgi-ri-source-distribution/2.0-SNAPSHOT/cxf-dosgi-ri-source-distribution-2.0-SNAPSHOT.pom
[JENKINS] Archiving <https://builds.apache.org/job/CXF-DOSGi/ws/samples/greeter/interface/pom.xml>
to org.apache.cxf.dosgi.samples/cxf-dosgi-ri-samples-greeter-interface/2.0-SNAPSHOT/cxf-dosgi-ri-samples-greeter-interface-2.0-SNAPSHOT.pom
[JENKINS] Archiving <https://builds.apache.org/job/CXF-DOSGi/ws/samples/greeter/pom.xml>
to org.apache.cxf.dosgi.samples/cxf-dosgi-ri-samples-greeter-parent/2.0-SNAPSHOT/cxf-dosgi-ri-samples-greeter-parent-2.0-SNAPSHOT.pom
[JENKINS] Archiving <https://builds.apache.org/job/CXF-DOSGi/ws/decorator/pom.xml> to
org.apache.cxf.dosgi/cxf-dosgi-ri-decorator/2.0-SNAPSHOT/cxf-dosgi-ri-decorator-2.0-SNAPSHOT.pom
[JENKINS] Archiving <https://builds.apache.org/job/CXF-DOSGi/ws/decorator/target/cxf-dosgi-ri-decorator-2.0-SNAPSHOT.jar>
to org.apache.cxf.dosgi/cxf-dosgi-ri-decorator/2.0-SNAPSHOT/cxf-dosgi-ri-decorator-2.0-SNAPSHOT.jar
[JENKINS] Archiving <https://builds.apache.org/job/CXF-DOSGi/ws/samples/greeter_rest/client/pom.xml>
to org.apache.cxf.dosgi.samples/cxf-dosgi-ri-samples-greeter-rest-client/2.0-SNAPSHOT/cxf-dosgi-ri-samples-greeter-rest-client-2.0-SNAPSHOT.pom
[JENKINS] Archiving <https://builds.apache.org/job/CXF-DOSGi/ws/distribution/repository/pom.xml>
to org.apache.cxf.dosgi/cxf-dosgi-ri-repository/2.0-SNAPSHOT/cxf-dosgi-ri-repository-2.0-SNAPSHOT.pom
[JENKINS] Archiving <https://builds.apache.org/job/CXF-DOSGi/ws/distribution/pom.xml>
to org.apache.cxf.dosgi/cxf-dosgi-ri-distribution-parent/2.0-SNAPSHOT/cxf-dosgi-ri-distribution-parent-2.0-SNAPSHOT.pom
[JENKINS] Archiving <https://builds.apache.org/job/CXF-DOSGi/ws/common/pom.xml> to org.apache.cxf.dosgi/cxf-dosgi-ri-common/2.0-SNAPSHOT/cxf-dosgi-ri-common-2.0-SNAPSHOT.pom
[JENKINS] Archiving <https://builds.apache.org/job/CXF-DOSGi/ws/samples/ds/interface/pom.xml>
to org.apache.cxf.dosgi.samples/cxf-dosgi-ri-samples-ds-interface/2.0-SNAPSHOT/cxf-dosgi-ri-samples-ds-interface-2.0-SNAPSHOT.pom
[JENKINS] Archiving <https://builds.apache.org/job/CXF-DOSGi/ws/samples/greeter/impl/pom.xml>
to org.apache.cxf.dosgi.samples/cxf-dosgi-ri-samples-greeter-impl/2.0-SNAPSHOT/cxf-dosgi-ri-samples-greeter-impl-2.0-SNAPSHOT.pom
[JENKINS] Archiving <https://builds.apache.org/job/CXF-DOSGi/ws/samples/greeter_rest/interface/pom.xml>
to org.apache.cxf.dosgi.samples/cxf-dosgi-ri-samples-greeter-rest-interface/2.0-SNAPSHOT/cxf-dosgi-ri-samples-greeter-rest-interface-2.0-SNAPSHOT.pom
[JENKINS] Archiving <https://builds.apache.org/job/CXF-DOSGi/ws/samples/ds/client/pom.xml>
to org.apache.cxf.dosgi.samples/cxf-dosgi-ri-samples-ds-client/2.0-SNAPSHOT/cxf-dosgi-ri-samples-ds-client-2.0-SNAPSHOT.pom
[JENKINS] Archiving <https://builds.apache.org/job/CXF-DOSGi/ws/distribution/features/pom.xml>
to org.apache.cxf.dosgi/cxf-dosgi/2.0-SNAPSHOT/cxf-dosgi-2.0-SNAPSHOT.pom
channel stopped

Mime
View raw message