cxf-notifications mailing list archives

Site index · List index
Message view « Date » · « Thread »
Top « Date » · « Thread »
From Apache Jenkins Server <jenk...@builds.apache.org>
Subject Build failed in Jenkins: CXF-3.1-deploy #518
Date Tue, 17 May 2016 00:52:17 GMT
See <https://builds.apache.org/job/CXF-3.1-deploy/518/>

------------------------------------------
[...truncated 34012 lines...]
[INFO] Apache CXF Runtime JiBX DataBinding ................ SUCCESS [  6.451 s]
[INFO] Apache CXF Databinding Runtime ..................... SUCCESS [  0.414 s]
[INFO] Apache CXF Runtime Object Binding .................. SUCCESS [  3.047 s]
[INFO] Apache CXF Runtime Colocated Binding ............... SUCCESS [  2.693 s]
[INFO] Apache CXF Runtime Bindings ........................ SUCCESS [  0.717 s]
[INFO] Apache CXF Runtime Clustering ...................... SUCCESS [  3.604 s]
[INFO] Apache CXF JAX-RS Client ........................... SUCCESS [  6.384 s]
[INFO] Apache CXF Advanced Logging Feature ................ SUCCESS [  3.270 s]
[INFO] Apache CXF Metrics Feature ......................... SUCCESS [  2.923 s]
[INFO] Apache CXF Throttling Feature ...................... SUCCESS [  2.496 s]
[INFO] Apache CXF Features Runtime ........................ SUCCESS [  0.487 s]
[INFO] Apache CXF Runtime JavaScript Frontend ............. SUCCESS [  4.210 s]
[INFO] Apache CXF Frontend Runtime ........................ SUCCESS [  3.389 s]
[INFO] Apache CXF Runtime Security functionality .......... SUCCESS [  2.831 s]
[INFO] Apache CXF Runtime SAML Security functionality ..... SUCCESS [  7.986 s]
[INFO] Apache CXF Runtime WS MetadataExchange ............. SUCCESS [  2.704 s]
[INFO] Apache CXF Runtime WS Security ..................... SUCCESS [ 13.949 s]
[INFO] Apache CXF Runtime WS Reliable Messaging ........... SUCCESS [  7.869 s]
[INFO] Apache CXF Runtime WS Eventing ..................... SUCCESS [  4.378 s]
[INFO] Apache CXF Web Services Runtime .................... SUCCESS [  0.407 s]
[INFO] Apache CXF JAX-RS Servlet Container Initializer .... SUCCESS [  2.380 s]
[INFO] Apache CXF JAX-RS Extensions: Search ............... SUCCESS [ 26.361 s]
[INFO] Apache CXF RS XML Security ......................... SUCCESS [  5.261 s]
[INFO] Apache CXF Runtime JOSE Core ....................... SUCCESS [  7.330 s]
[INFO] Apache CXF Runtime JOSE JAX-RS ..................... SUCCESS [  3.733 s]
[INFO] Apache CXF Rest Runtime ............................ SUCCESS [  0.409 s]
[INFO] Apache CXF Rest Security Runtime ................... SUCCESS [  0.251 s]
[INFO] Apache CXF JOSE Security parent .................... SUCCESS [  0.361 s]
[INFO] Apache CXF Runtime RS Security OAuth Parent ........ SUCCESS [  0.379 s]
[INFO] Apache CXF Runtime OAuth 1.0a ...................... SUCCESS [  3.674 s]
[INFO] Apache CXF Runtime OAuth 2.0 ....................... SUCCESS [ 12.920 s]
[INFO] Apache CXF Runtime OAuth 2.0 SAML .................. SUCCESS [  4.417 s]
[INFO] Apache CXF RS SSO SAML ............................. SUCCESS [  5.340 s]
[INFO] Apache CXF Runtime OpenId Connect .................. SUCCESS [  4.220 s]
[INFO] Apache CXF RS Cross-Origin Resource Sharing ........ SUCCESS [  2.509 s]
[INFO] Apache CXF Runtime Web Management .................. SUCCESS [ 34.853 s]
[INFO] Apache CXF Runtime JavaScript Client Generator Tests SUCCESS [  1.239 s]
[INFO] Apache CXF JCA Connection .......................... SUCCESS [  5.228 s]
[INFO] Apache CXF CDI Integration ......................... SUCCESS [  3.245 s]
[INFO] Apache CXF Distributed Tracing using Apache HTrace . SUCCESS [  3.580 s]
[INFO] Apache CXF Spring Boot Autoconfigure ............... SUCCESS [  3.097 s]
[INFO] Apache CXF Spring Boot Starter JAX-WS .............. SUCCESS [  6.851 s]
[INFO] Apache CXF Spring Boot Starter JAX-RS .............. SUCCESS [  1.013 s]
[INFO] Apache CXF Integration ............................. SUCCESS [  0.296 s]
[INFO] Apache CXF Spring Boot Integration ................. SUCCESS [  0.378 s]
[INFO] Apache CXF Java2WS Maven2 Plugin ................... SUCCESS [ 10.847 s]
[INFO] Apache CXF Java2WADL Maven2 Plugin ................. SUCCESS [  9.146 s]
[INFO] Apache CXF WADL2Java Code Generation Maven2 Plugin . SUCCESS [  5.896 s]
[INFO] Apache CXF CORBA Tools Maven2 Plugins .............. SUCCESS [  4.018 s]
[INFO] Apache CXF Archetype - Simple JAX-WS Java First .... SUCCESS [  4.020 s]
[INFO] Apache CXF Archetype - Simple JAX-RS webapp ........ SUCCESS [  4.239 s]
[INFO] Apache CXF Maven Archetypes ........................ SUCCESS [  1.021 s]
[INFO] Apache CXF STS Core ................................ SUCCESS [ 13.398 s]
[INFO] Apache CXF STS war deployment ...................... SUCCESS [ 10.096 s]
[INFO] Apache CXF STS basic systests ...................... SUCCESS [  7.479 s]
[INFO] Apache CXF STS advanced systests ................... SUCCESS [  5.531 s]
[INFO] Apache CXF STS test OSGi deployment ................ SUCCESS [  3.175 s]
[INFO] Apache CXF STS test Karaf Features ................. SUCCESS [  5.607 s]
[INFO] Apache CXF Karaf Parent ............................ SUCCESS [  0.392 s]
[INFO] Apache CXF Karaf Features .......................... SUCCESS [  3.880 s]
[INFO] Apache CXF Karaf Commands .......................... SUCCESS [  4.573 s]
[INFO] Apache CXF STS Integration Tests ................... SUCCESS [  6.645 s]
[INFO] Apache CXF Services ................................ SUCCESS [  1.901 s]
[INFO] Apache CXF STS service ............................. SUCCESS [  0.489 s]
[INFO] Apache CXF STS systests ............................ SUCCESS [  0.236 s]
[INFO] Apache CXF WSN API ................................. SUCCESS [  9.583 s]
[INFO] Apache CXF WSN Core ................................ SUCCESS [  7.575 s]
[INFO] Apache CXF WSN OSGi ................................ SUCCESS [  2.648 s]
[INFO] Apache CXF WSN service ............................. SUCCESS [  0.748 s]
[INFO] Apache CXF WS-Discovery API ........................ SUCCESS [  5.977 s]
[INFO] Apache CXF WS-Discovery Service .................... SUCCESS [  1.167 s]
[INFO] Apache CXF WS-Discovery ............................ SUCCESS [  0.597 s]
[INFO] Apache CXF XKMS Common ............................. SUCCESS [  9.396 s]
[INFO] Apache CXF XKMS X509 Handlers ...................... SUCCESS [ 13.516 s]
[INFO] Apache CXF XKMS Service ............................ SUCCESS [  3.066 s]
[INFO] Apache CXF XKMS Client ............................. SUCCESS [  3.486 s]
[INFO] Apache CXF XKMS Karaf Features ..................... SUCCESS [  1.354 s]
[INFO] Apache CXF XKMS OSGi deployment .................... SUCCESS [  1.742 s]
[INFO] Apache CXF XKMS LDAP repository .................... SUCCESS [  3.153 s]
[INFO] Apache CXF XKMS Service war deployment ............. SUCCESS [  7.192 s]
[INFO] Apache CXF XKMS Integration Tests .................. SUCCESS [  1.634 s]
[INFO] Apache CXF XKMS .................................... SUCCESS [  0.432 s]
[INFO] Apache CXF Bundle Parent ........................... SUCCESS [  0.787 s]
[INFO] Apache CXF Compatibility Bundle Jar ................ SUCCESS [  1.938 s]
[INFO] Apache CXF :: OSGi :: Integration Tests ............ SUCCESS [ 19.173 s]
[INFO] Apache CXF :: OSGi :: Integration Tests pure felix . SUCCESS [  6.432 s]
[INFO] Apache CXF OSGi parent ............................. SUCCESS [  0.421 s]
[INFO] Apache CXF Container Integration System Tests ...... SUCCESS [  0.310 s]
[INFO] Apache CXF Container Integration Test Webapp ....... SUCCESS [  3.228 s]
[INFO] Apache CXF Container Integration Test Grizzly ...... SUCCESS [ 20.093 s]
[INFO] Apache CXF Uncategorized System Tests .............. SUCCESS [  9.002 s]
[INFO] Apache CXF Transport System Tests .................. SUCCESS [  3.099 s]
[INFO] Apache CXF Transport SSL3 System Tests ............. SUCCESS [  1.742 s]
[INFO] Apache CXF Transport System Tests JMS .............. SUCCESS [  4.375 s]
[INFO] Apache CXF JAX-WS System Tests ..................... SUCCESS [  5.465 s]
[INFO] Apache CXF Databinding System Tests ................ SUCCESS [  8.066 s]
[INFO] Apache CXF JAX-RS System Tests ..................... SUCCESS [  9.228 s]
[INFO] Apache CXF WS-* Specifications System Tests ........ SUCCESS [  5.801 s]
[INFO] Apache CXF WS-RM Specifications System Tests ....... SUCCESS [  1.551 s]
[INFO] Apache CXF WS-Security System Tests ................ SUCCESS [  8.434 s]
[INFO] Apache CXF WS-Security Interop System Tests ........ SUCCESS [ 10.479 s]
[INFO] Apache CXF Kerberos Integration System Tests ....... SUCCESS [ 15.054 s]
[INFO] Apache CXF JAX-RS System Advanced Security Tests ... SUCCESS [  2.322 s]
[INFO] Test for writing wsdl to repo ...................... SUCCESS [  6.596 s]
[INFO] Test for generating code from wsdl in repo ......... SUCCESS [  9.751 s]
[INFO] Apache CXF System Tests ............................ SUCCESS [  0.642 s]
[INFO] Apache CXF System Tests for Maven Plugins .......... SUCCESS [  0.514 s]
[INFO] Apache CXF CDI Integration System Tests ............ SUCCESS [  4.917 s]
[INFO] Apache CXF Servlet Container Initializer Integration System Tests SUCCESS [  1.642
s]
[INFO] Apache CXF Distributed Tracing Integration System Tests SUCCESS [  1.555 s]
[INFO] Apache CXF JiBX Integration System Tests ........... SUCCESS [  0.699 s]
[INFO] Apache CXF JAX-RS JiBX System Tests ................ SUCCESS [  6.907 s]
[INFO] Apache CXF Data Binding JiBX System Tests .......... SUCCESS [  7.026 s]
[INFO] Apache CXF Manifest Jar ............................ SUCCESS [  3.300 s]
[INFO] Apache CXF JavaDoc ................................. SUCCESS [02:13 min]
[INFO] Apache CXF Samples ................................. SUCCESS [  0.657 s]
[INFO] Colocated Demo using Document/Literal Style ........ SUCCESS [  4.530 s]
[INFO] JavaScript Client Demo using Document/Literal Style  FAILURE [  0.013 s]
[INFO] Generated JavaScript Sample using JAX-WS and JSR-181 SKIPPED
[INFO] Java First demo service using the JAXWSFactoryBeans  SKIPPED
[INFO] Java First demo using JMS .......................... SKIPPED
[INFO] JAX-RS Content Negotiation Demo .................... SKIPPED
[INFO] JAX-RS Basic Demo With HTTPS communications ........ SKIPPED
[INFO] JAX-RS Basic Demo .................................. SKIPPED
[INFO] JAX-RS WebSocket Demo .............................. SKIPPED
[INFO] JAX-RS Basic Demo .................................. SKIPPED
[INFO] JAX-RS Swagger Demo ................................ SKIPPED
[INFO] JAX-RS Swagger2 Demo ............................... SKIPPED
[INFO] JAX-RS Swagger2 WebApp Demo ........................ SKIPPED
[INFO] CXF JAX-RS Swagger2 Blueprint Demo ................. SKIPPED
[INFO] JAX-RS Basic Oidc Demo ............................. SKIPPED
[INFO] JAX-RS Big Query Demo .............................. SKIPPED
[INFO] CXF sample using a callback object ................. SKIPPED
[INFO] WSDL first demo using BARE Style in XML Binding (pure XML over HTTP) SKIPPED
[INFO] JAX-WS Dispatch/Provider Demo ...................... SKIPPED
[INFO] WSDL first demo using Document/Literal Style and XMLBeans DataBinding SKIPPED
[INFO] WSDL first demo using SOAP12 in Document/Literal Style SKIPPED
[INFO] CXF Dynamic Client Sample .......................... SKIPPED
[INFO] JMS Transport Queue Demo using Document-Literal Style SKIPPED
[INFO] WSDL first demo using the jms transport and jmsConfigFeature SKIPPED
[INFO] RESTful Hello World Demo ........................... SKIPPED
[INFO] WSDL first demo using Document/Literal Style ....... SKIPPED
[INFO] CXF sample using the Aegis Binding without any webservice SKIPPED
[INFO] Java First demo using JAX-WS APIs .................. SKIPPED
[INFO] WS-RM Demo ......................................... SKIPPED
[INFO] CXF Sample of Stream GZIP Interceptor .............. SKIPPED
[INFO] Spring HTTP Sample ................................. SKIPPED
[INFO] Spring HTTP Servlet demo with ruby support ......... SKIPPED
[INFO] Spring HTTP Servlet demo with groovy support ....... SKIPPED
[INFO] Hello world javascript demo ........................ SKIPPED
[INFO] CXF WS-Security UT Demo ............................ SKIPPED
[INFO] CXF WS-Security Signature Encryption Demo .......... SKIPPED
[INFO] CXF WS-SecurityPolicy Signature Encryption Demo .... SKIPPED
[INFO] WS-SecurityPolicy UT Demo .......................... SKIPPED
[INFO] MTOM Demo for SWA and XOP .......................... SKIPPED
[INFO] JAX-WS Asynchronous Demo using Document/Literal Style SKIPPED
[INFO] Java First POJO Sample ............................. SKIPPED
[INFO] WS-Policy Demo ..................................... SKIPPED
[INFO] Hello World Client Demo using JavaScript ........... SKIPPED
[INFO] WSDL first demo using HTTPS ........................ SKIPPED
[INFO] WS-Addressing Demo ................................. SKIPPED
[INFO] Sample using SOAP Headers .......................... SKIPPED
[INFO] SOAP/JMS Transport Specification Demo using Document-Literal Style SKIPPED
[INFO] CXF sample using WRAPPED Style in XML Binding (pure XML over HTTP) SKIPPED
[INFO] CXF sample using code first POJO's and the Aegis Binding SKIPPED
[INFO] Sample of JAX-* Service Using an Aegis Client ...... SKIPPED
[INFO] JAX-WS Handler Demo ................................ SKIPPED
[INFO] WSDL first demo using RPC-Literal Style ............ SKIPPED
[INFO] JMS Transport Publish/Subscribe Demo using Document-Literal Style SKIPPED
[INFO] JAX-RS Spring Security Demo ........................ SKIPPED
[INFO] Apache CXF Samples LogBrowser ...................... SKIPPED
[INFO] Apache CXF Samples LogBrowser Blueprint ............ SKIPPED
[INFO] WS-Notification Demo ............................... SKIPPED
[INFO] CXF STS Demo ....................................... SKIPPED
[INFO] Bank sample using JAX-WS API's to talk via CORBA/IIOP SKIPPED
[INFO] Bank sample using JAX-WS API's to talk via CORBA/IIOP SKIPPED
[INFO] hello-world sample using JAX-WS API's to talk via CORBA/IIOP SKIPPED
[INFO] OAuth 1.0a server .................................. SKIPPED
[INFO] OAuth 1.0a client .................................. SKIPPED
[INFO] JAX-RS Minimal OSGI Demo ........................... SKIPPED
[INFO] WS-Discovery Sample ................................ SKIPPED
[INFO] WS-Eventing Demo ................................... SKIPPED
[INFO] Demo using the throttling feature .................. SKIPPED
[INFO] JAX-RS Demo Using Distributed Tracing with Apache HTrace SKIPPED
[INFO] Apache CXF Distribution ............................ SKIPPED
[INFO] ------------------------------------------------------------------------
[INFO] BUILD FAILURE
[INFO] ------------------------------------------------------------------------
[INFO] Total time: 19:44 min
[INFO] Finished at: 2016-05-17T00:52:05+00:00
[INFO] Final Memory: 332M/795M
[INFO] ------------------------------------------------------------------------
[ERROR] Failed to execute goal org.apache.cxf:cxf-codegen-plugin:3.1.7-SNAPSHOT:wsdl2java
(generate-sources) on project js_browser_client_simple: Execution generate-sources of goal
org.apache.cxf:cxf-codegen-plugin:3.1.7-SNAPSHOT:wsdl2java failed: A required class was missing
while executing org.apache.cxf:cxf-codegen-plugin:3.1.7-SNAPSHOT:wsdl2java: org/apache/commons/logging/LogFactory
[ERROR] -----------------------------------------------------
[ERROR] realm =    plugin>org.apache.cxf:cxf-codegen-plugin:3.1.7-SNAPSHOT-1150468830
[ERROR] strategy = org.codehaus.plexus.classworlds.strategy.SelfFirstStrategy
[ERROR] urls[0] = file:/x1/jenkins/jenkins-slave/workspace/CXF-3.1-deploy/maven-plugins/codegen-plugin/target/cxf-codegen-plugin-3.1.7-SNAPSHOT.jar
[ERROR] urls[1] = <https://builds.apache.org/job/CXF-3.1-deploy/ws/.repository/org/apache/maven/shared/maven-artifact-resolver/1.0/maven-artifact-resolver-1.0.jar>
[ERROR] urls[2] = <https://builds.apache.org/job/CXF-3.1-deploy/ws/.repository/org/codehaus/plexus/plexus-utils/2.0.5/plexus-utils-2.0.5.jar>
[ERROR] urls[3] = <https://builds.apache.org/job/CXF-3.1-deploy/ws/.repository/org/codehaus/plexus/plexus-archiver/1.2/plexus-archiver-1.2.jar>
[ERROR] urls[4] = <https://builds.apache.org/job/CXF-3.1-deploy/ws/.repository/org/codehaus/plexus/plexus-io/1.0.1/plexus-io-1.0.1.jar>
[ERROR] urls[5] = file:/x1/jenkins/jenkins-slave/workspace/CXF-3.1-deploy/core/target/cxf-core-3.1.7-SNAPSHOT.jar
[ERROR] urls[6] = <https://builds.apache.org/job/CXF-3.1-deploy/ws/.repository/org/codehaus/woodstox/woodstox-core-asl/4.4.1/woodstox-core-asl-4.4.1.jar>
[ERROR] urls[7] = <https://builds.apache.org/job/CXF-3.1-deploy/ws/.repository/org/codehaus/woodstox/stax2-api/3.1.4/stax2-api-3.1.4.jar>
[ERROR] urls[8] = <https://builds.apache.org/job/CXF-3.1-deploy/ws/.repository/org/apache/ws/xmlschema/xmlschema-core/2.2.1/xmlschema-core-2.2.1.jar>
[ERROR] urls[9] = file:/x1/jenkins/jenkins-slave/workspace/CXF-3.1-deploy/tools/common/target/cxf-tools-common-3.1.7-SNAPSHOT.jar
[ERROR] urls[10] = <https://builds.apache.org/job/CXF-3.1-deploy/ws/.repository/org/apache/velocity/velocity/1.7/velocity-1.7.jar>
[ERROR] urls[11] = <https://builds.apache.org/job/CXF-3.1-deploy/ws/.repository/commons-lang/commons-lang/2.6/commons-lang-2.6.jar>
[ERROR] urls[12] = <https://builds.apache.org/job/CXF-3.1-deploy/ws/.repository/commons-collections/commons-collections/3.2.2/commons-collections-3.2.2.jar>
[ERROR] urls[13] = <https://builds.apache.org/job/CXF-3.1-deploy/ws/.repository/wsdl4j/wsdl4j/1.6.3/wsdl4j-1.6.3.jar>
[ERROR] urls[14] = <https://builds.apache.org/job/CXF-3.1-deploy/ws/.repository/com/sun/xml/bind/jaxb-xjc/2.2.11/jaxb-xjc-2.2.11.jar>
[ERROR] urls[15] = <https://builds.apache.org/job/CXF-3.1-deploy/ws/.repository/com/sun/xml/bind/jaxb-core/2.2.11/jaxb-core-2.2.11.jar>
[ERROR] urls[16] = <https://builds.apache.org/job/CXF-3.1-deploy/ws/.repository/com/sun/xml/bind/jaxb-impl/2.2.11/jaxb-impl-2.2.11.jar>
[ERROR] urls[17] = file:/x1/jenkins/jenkins-slave/workspace/CXF-3.1-deploy/tools/wsdlto/core/target/cxf-tools-wsdlto-core-3.1.7-SNAPSHOT.jar
[ERROR] urls[18] = file:/x1/jenkins/jenkins-slave/workspace/CXF-3.1-deploy/tools/validator/target/cxf-tools-validator-3.1.7-SNAPSHOT.jar
[ERROR] urls[19] = file:/x1/jenkins/jenkins-slave/workspace/CXF-3.1-deploy/rt/bindings/soap/target/cxf-rt-bindings-soap-3.1.7-SNAPSHOT.jar
[ERROR] urls[20] = file:/x1/jenkins/jenkins-slave/workspace/CXF-3.1-deploy/rt/databinding/jaxb/target/cxf-rt-databinding-jaxb-3.1.7-SNAPSHOT.jar
[ERROR] urls[21] = file:/x1/jenkins/jenkins-slave/workspace/CXF-3.1-deploy/rt/wsdl/target/cxf-rt-wsdl-3.1.7-SNAPSHOT.jar
[ERROR] urls[22] = <https://builds.apache.org/job/CXF-3.1-deploy/ws/.repository/org/ow2/asm/asm/5.0.4/asm-5.0.4.jar>
[ERROR] urls[23] = file:/x1/jenkins/jenkins-slave/workspace/CXF-3.1-deploy/tools/wsdlto/databinding/jaxb/target/cxf-tools-wsdlto-databinding-jaxb-3.1.7-SNAPSHOT.jar
[ERROR] urls[24] = file:/x1/jenkins/jenkins-slave/workspace/CXF-3.1-deploy/tools/wsdlto/frontend/jaxws/target/cxf-tools-wsdlto-frontend-jaxws-3.1.7-SNAPSHOT.jar
[ERROR] urls[25] = <https://builds.apache.org/job/CXF-3.1-deploy/ws/.repository/xml-resolver/xml-resolver/1.2/xml-resolver-1.2.jar>
[ERROR] urls[26] = file:/x1/jenkins/jenkins-slave/workspace/CXF-3.1-deploy/tools/wsdlto/frontend/javascript/target/cxf-tools-wsdlto-frontend-javascript-3.1.7-SNAPSHOT.jar
[ERROR] urls[27] = file:/x1/jenkins/jenkins-slave/workspace/CXF-3.1-deploy/rt/javascript/javascript-rt/target/cxf-rt-javascript-3.1.7-SNAPSHOT.jar
[ERROR] urls[28] = <https://builds.apache.org/job/CXF-3.1-deploy/ws/.repository/org/springframework/spring-core/4.1.9.RELEASE/spring-core-4.1.9.RELEASE.jar>
[ERROR] urls[29] = <https://builds.apache.org/job/CXF-3.1-deploy/ws/.repository/org/springframework/spring-beans/4.1.9.RELEASE/spring-beans-4.1.9.RELEASE.jar>
[ERROR] urls[30] = <https://builds.apache.org/job/CXF-3.1-deploy/ws/.repository/org/springframework/spring-context/4.1.9.RELEASE/spring-context-4.1.9.RELEASE.jar>
[ERROR] urls[31] = <https://builds.apache.org/job/CXF-3.1-deploy/ws/.repository/org/springframework/spring-aop/4.1.9.RELEASE/spring-aop-4.1.9.RELEASE.jar>
[ERROR] urls[32] = <https://builds.apache.org/job/CXF-3.1-deploy/ws/.repository/aopalliance/aopalliance/1.0/aopalliance-1.0.jar>
[ERROR] urls[33] = <https://builds.apache.org/job/CXF-3.1-deploy/ws/.repository/org/springframework/spring-expression/4.1.9.RELEASE/spring-expression-4.1.9.RELEASE.jar>
[ERROR] urls[34] = <https://builds.apache.org/job/CXF-3.1-deploy/ws/.repository/org/apache/ant/ant/1.9.6/ant-1.9.6.jar>
[ERROR] urls[35] = <https://builds.apache.org/job/CXF-3.1-deploy/ws/.repository/org/apache/ant/ant-launcher/1.9.6/ant-launcher-1.9.6.jar>
[ERROR] urls[36] = <https://builds.apache.org/job/CXF-3.1-deploy/ws/.repository/org/apache/ant/ant-nodeps/1.8.1/ant-nodeps-1.8.1.jar>
[ERROR] urls[37] = <https://builds.apache.org/job/CXF-3.1-deploy/ws/.repository/org/sonatype/plexus/plexus-build-api/0.0.7/plexus-build-api-0.0.7.jar>
[ERROR] Number of foreign imports: 1
[ERROR] import: Entry[import  from realm ClassRealm[maven.api, parent: null]]
[ERROR] 
[ERROR] -----------------------------------------------------: org.apache.commons.logging.LogFactory
[ERROR] -> [Help 1]
[ERROR] 
[ERROR] To see the full stack trace of the errors, re-run Maven with the -e switch.
[ERROR] Re-run Maven using the -X switch to enable full debug logging.
[ERROR] 
[ERROR] For more information about the errors and possible solutions, please read the following
articles:
[ERROR] [Help 1] http://cwiki.apache.org/confluence/display/MAVEN/PluginContainerException
[ERROR] 
[ERROR] After correcting the problems, you can resume the build with the command
[ERROR]   mvn <goals> -rf :js_browser_client_simple
Build step 'Invoke top-level Maven targets' marked build as failure

Mime
View raw message