cxf-notifications mailing list archives

Site index · List index
Message view « Date » · « Thread »
Top « Date » · « Thread »
From Apache Jenkins Server <jenk...@builds.apache.org>
Subject Build failed in Jenkins: CXF-3.1-deploy #132
Date Tue, 03 May 2016 14:20:02 GMT
See <https://builds.apache.org/job/CXF-3.1-deploy/132/>

------------------------------------------
[...truncated 36717 lines...]
[INFO] Apache CXF Runtime UDP Transport ................... SUCCESS [  3.776 s]
[INFO] Apache CXF Runtime WebSocket Transport ............. SUCCESS [  7.177 s]
[INFO] Apache CXF Runtime ................................. SUCCESS [  0.722 s]
[INFO] Apache CXF Transports Runtime ...................... SUCCESS [  0.270 s]
[INFO] Apache CXF Runtime JiBX DataBinding ................ SUCCESS [  5.774 s]
[INFO] Apache CXF Databinding Runtime ..................... SUCCESS [  0.246 s]
[INFO] Apache CXF Runtime Object Binding .................. SUCCESS [  4.095 s]
[INFO] Apache CXF Runtime Colocated Binding ............... SUCCESS [  6.866 s]
[INFO] Apache CXF Runtime Bindings ........................ SUCCESS [  0.366 s]
[INFO] Apache CXF Runtime Clustering ...................... SUCCESS [  3.488 s]
[INFO] Apache CXF JAX-RS Client ........................... SUCCESS [  5.574 s]
[INFO] Apache CXF Advanced Logging Feature ................ SUCCESS [  3.770 s]
[INFO] Apache CXF Metrics Feature ......................... SUCCESS [  3.212 s]
[INFO] Apache CXF Throttling Feature ...................... SUCCESS [  3.568 s]
[INFO] Apache CXF Features Runtime ........................ SUCCESS [  3.081 s]
[INFO] Apache CXF Runtime JavaScript Frontend ............. SUCCESS [  4.039 s]
[INFO] Apache CXF Frontend Runtime ........................ SUCCESS [  0.372 s]
[INFO] Apache CXF Runtime Security functionality .......... SUCCESS [  8.054 s]
[INFO] Apache CXF Runtime SAML Security functionality ..... SUCCESS [ 10.736 s]
[INFO] Apache CXF Runtime WS MetadataExchange ............. SUCCESS [  2.724 s]
[INFO] Apache CXF Runtime WS Security ..................... SUCCESS [ 14.847 s]
[INFO] Apache CXF Runtime WS Reliable Messaging ........... SUCCESS [ 10.858 s]
[INFO] Apache CXF Runtime WS Eventing ..................... SUCCESS [  4.744 s]
[INFO] Apache CXF Web Services Runtime .................... SUCCESS [  0.661 s]
[INFO] Apache CXF JAX-RS Servlet Container Initializer .... SUCCESS [  4.148 s]
[INFO] Apache CXF JAX-RS Extensions: Search ............... SUCCESS [ 26.707 s]
[INFO] Apache CXF RS XML Security ......................... SUCCESS [  4.407 s]
[INFO] Apache CXF Runtime JOSE Core ....................... SUCCESS [  7.865 s]
[INFO] Apache CXF Runtime JOSE JAX-RS ..................... SUCCESS [  3.209 s]
[INFO] Apache CXF Rest Runtime ............................ SUCCESS [  0.476 s]
[INFO] Apache CXF Rest Security Runtime ................... SUCCESS [  0.237 s]
[INFO] Apache CXF JOSE Security parent .................... SUCCESS [  0.338 s]
[INFO] Apache CXF Runtime RS Security OAuth Parent ........ SUCCESS [  0.254 s]
[INFO] Apache CXF Runtime OAuth 1.0a ...................... SUCCESS [  4.596 s]
[INFO] Apache CXF Runtime OAuth 2.0 ....................... SUCCESS [ 13.058 s]
[INFO] Apache CXF Runtime OAuth 2.0 SAML .................. SUCCESS [  3.352 s]
[INFO] Apache CXF RS SSO SAML ............................. SUCCESS [  4.147 s]
[INFO] Apache CXF Runtime OpenId Connect .................. SUCCESS [  4.258 s]
[INFO] Apache CXF RS Cross-Origin Resource Sharing ........ SUCCESS [  2.633 s]
[INFO] Apache CXF Runtime Web Management .................. SUCCESS [ 43.396 s]
[INFO] Apache CXF Runtime JavaScript Client Generator Tests SUCCESS [  1.944 s]
[INFO] Apache CXF JCA Connection .......................... SUCCESS [  4.984 s]
[INFO] Apache CXF CDI Integration ......................... SUCCESS [  2.922 s]
[INFO] Apache CXF Distributed Tracing using Apache HTrace . SUCCESS [  3.083 s]
[INFO] Apache CXF Integration ............................. SUCCESS [  0.209 s]
[INFO] Apache CXF Java2WS Maven2 Plugin ................... SUCCESS [  2.721 s]
[INFO] Apache CXF Java2WADL Maven2 Plugin ................. SUCCESS [  6.288 s]
[INFO] Apache CXF WADL2Java Code Generation Maven2 Plugin . SUCCESS [  4.080 s]
[INFO] Apache CXF CORBA Tools Maven2 Plugins .............. SUCCESS [  4.490 s]
[INFO] Apache CXF Archetype - Simple JAX-WS Java First .... SUCCESS [ 11.276 s]
[INFO] Apache CXF Archetype - Simple JAX-RS webapp ........ SUCCESS [  0.762 s]
[INFO] Apache CXF Maven Archetypes ........................ SUCCESS [  0.316 s]
[INFO] Apache CXF STS Core ................................ SUCCESS [ 11.587 s]
[INFO] Apache CXF STS war deployment ...................... SUCCESS [ 10.392 s]
[INFO] Apache CXF STS basic systests ...................... SUCCESS [  5.929 s]
[INFO] Apache CXF STS advanced systests ................... SUCCESS [  7.553 s]
[INFO] Apache CXF STS test OSGi deployment ................ SUCCESS [  3.439 s]
[INFO] Apache CXF STS test Karaf Features ................. SUCCESS [  0.383 s]
[INFO] Apache CXF Karaf Parent ............................ SUCCESS [  0.422 s]
[INFO] Apache CXF Karaf Features .......................... SUCCESS [  3.289 s]
[INFO] Apache CXF Karaf Commands .......................... SUCCESS [  3.501 s]
[INFO] Apache CXF STS Integration Tests ................... SUCCESS [  7.558 s]
[INFO] Apache CXF Services ................................ SUCCESS [  0.350 s]
[INFO] Apache CXF STS service ............................. SUCCESS [  0.693 s]
[INFO] Apache CXF STS systests ............................ SUCCESS [  1.044 s]
[INFO] Apache CXF WSN API ................................. SUCCESS [ 12.053 s]
[INFO] Apache CXF WSN Core ................................ SUCCESS [  6.688 s]
[INFO] Apache CXF WSN OSGi ................................ SUCCESS [  2.639 s]
[INFO] Apache CXF WSN service ............................. SUCCESS [  0.438 s]
[INFO] Apache CXF WS-Discovery API ........................ SUCCESS [  7.179 s]
[INFO] Apache CXF WS-Discovery Service .................... SUCCESS [  1.288 s]
[INFO] Apache CXF WS-Discovery ............................ SUCCESS [  0.326 s]
[INFO] Apache CXF XKMS Common ............................. SUCCESS [  9.743 s]
[INFO] Apache CXF XKMS X509 Handlers ...................... SUCCESS [  7.316 s]
[INFO] Apache CXF XKMS Service ............................ SUCCESS [  4.280 s]
[INFO] Apache CXF XKMS Client ............................. SUCCESS [  4.289 s]
[INFO] Apache CXF XKMS Karaf Features ..................... SUCCESS [  1.247 s]
[INFO] Apache CXF XKMS OSGi deployment .................... SUCCESS [  1.111 s]
[INFO] Apache CXF XKMS LDAP repository .................... SUCCESS [  2.985 s]
[INFO] Apache CXF XKMS Service war deployment ............. SUCCESS [  6.131 s]
[INFO] Apache CXF XKMS Integration Tests .................. SUCCESS [  0.800 s]
[INFO] Apache CXF XKMS .................................... SUCCESS [  0.316 s]
[INFO] Apache CXF Bundle Parent ........................... SUCCESS [  0.592 s]
[INFO] Apache CXF Compatibility Bundle Jar ................ SUCCESS [  1.592 s]
[INFO] Apache CXF :: OSGi :: Integration Tests ............ SUCCESS [ 20.500 s]
[INFO] Apache CXF :: OSGi :: Integration Tests pure felix . SUCCESS [  5.313 s]
[INFO] Apache CXF OSGi parent ............................. SUCCESS [  0.286 s]
[INFO] Apache CXF Container Integration System Tests ...... SUCCESS [  0.294 s]
[INFO] Apache CXF Container Integration Test Webapp ....... SUCCESS [  5.042 s]
[INFO] Apache CXF Container Integration Test Grizzly ...... SUCCESS [ 14.590 s]
[INFO] Apache CXF Uncategorized System Tests .............. SUCCESS [  9.656 s]
[INFO] Apache CXF Transport System Tests .................. SUCCESS [  4.212 s]
[INFO] Apache CXF Transport SSL3 System Tests ............. SUCCESS [  2.004 s]
[INFO] Apache CXF Transport System Tests JMS .............. SUCCESS [  5.273 s]
[INFO] Apache CXF JAX-WS System Tests ..................... SUCCESS [  5.818 s]
[INFO] Apache CXF Databinding System Tests ................ SUCCESS [  6.190 s]
[INFO] Apache CXF JAX-RS System Tests ..................... SUCCESS [ 12.177 s]
[INFO] Apache CXF WS-* Specifications System Tests ........ SUCCESS [  5.224 s]
[INFO] Apache CXF WS-RM Specifications System Tests ....... SUCCESS [  1.362 s]
[INFO] Apache CXF WS-Security System Tests ................ SUCCESS [ 10.471 s]
[INFO] Apache CXF WS-Security Interop System Tests ........ SUCCESS [  6.051 s]
[INFO] Apache CXF Kerberos Integration System Tests ....... SUCCESS [ 17.885 s]
[INFO] Apache CXF JAX-RS System Advanced Security Tests ... SUCCESS [  5.545 s]
[INFO] Test for writing wsdl to repo ...................... SUCCESS [  5.285 s]
[INFO] Test for generating code from wsdl in repo ......... SUCCESS [  7.360 s]
[INFO] Apache CXF System Tests ............................ SUCCESS [  0.313 s]
[INFO] Apache CXF System Tests for Maven Plugins .......... SUCCESS [  0.190 s]
[INFO] Apache CXF CDI Integration System Tests ............ SUCCESS [  4.686 s]
[INFO] Apache CXF Servlet Container Initializer Integration System Tests SUCCESS [  1.378
s]
[INFO] Apache CXF Distributed Tracing Integration System Tests SUCCESS [  1.090 s]
[INFO] Apache CXF JiBX Integration System Tests ........... SUCCESS [  0.954 s]
[INFO] Apache CXF JAX-RS JiBX System Tests ................ SUCCESS [  5.770 s]
[INFO] Apache CXF Data Binding JiBX System Tests .......... SUCCESS [  6.282 s]
[INFO] Apache CXF Manifest Jar ............................ SUCCESS [  2.910 s]
[INFO] Apache CXF JavaDoc ................................. SUCCESS [01:55 min]
[INFO] Apache CXF Samples ................................. SUCCESS [  0.635 s]
[INFO] Colocated Demo using Document/Literal Style ........ SUCCESS [  4.360 s]
[INFO] JavaScript Client Demo using Document/Literal Style  FAILURE [  0.013 s]
[INFO] Generated JavaScript Sample using JAX-WS and JSR-181 SKIPPED
[INFO] Java First demo service using the JAXWSFactoryBeans  SKIPPED
[INFO] Java First demo using JMS .......................... SKIPPED
[INFO] JAX-RS Content Negotiation Demo .................... SKIPPED
[INFO] JAX-RS Basic Demo With HTTPS communications ........ SKIPPED
[INFO] JAX-RS Basic Demo .................................. SKIPPED
[INFO] JAX-RS WebSocket Demo .............................. SKIPPED
[INFO] JAX-RS Basic Demo .................................. SKIPPED
[INFO] JAX-RS Swagger Demo ................................ SKIPPED
[INFO] JAX-RS Swagger2 Demo ............................... SKIPPED
[INFO] JAX-RS Swagger2 WebApp Demo ........................ SKIPPED
[INFO] CXF JAX-RS Swagger2 Blueprint Demo ................. SKIPPED
[INFO] JAX-RS Basic Oidc Demo ............................. SKIPPED
[INFO] JAX-RS Big Query Demo .............................. SKIPPED
[INFO] CXF sample using a callback object ................. SKIPPED
[INFO] WSDL first demo using BARE Style in XML Binding (pure XML over HTTP) SKIPPED
[INFO] JAX-WS Dispatch/Provider Demo ...................... SKIPPED
[INFO] WSDL first demo using Document/Literal Style and XMLBeans DataBinding SKIPPED
[INFO] WSDL first demo using SOAP12 in Document/Literal Style SKIPPED
[INFO] CXF Dynamic Client Sample .......................... SKIPPED
[INFO] JMS Transport Queue Demo using Document-Literal Style SKIPPED
[INFO] WSDL first demo using the jms transport and jmsConfigFeature SKIPPED
[INFO] RESTful Hello World Demo ........................... SKIPPED
[INFO] WSDL first demo using Document/Literal Style ....... SKIPPED
[INFO] CXF sample using the Aegis Binding without any webservice SKIPPED
[INFO] Java First demo using JAX-WS APIs .................. SKIPPED
[INFO] WS-RM Demo ......................................... SKIPPED
[INFO] CXF Sample of Stream GZIP Interceptor .............. SKIPPED
[INFO] Spring HTTP Sample ................................. SKIPPED
[INFO] Spring HTTP Servlet demo with ruby support ......... SKIPPED
[INFO] Spring HTTP Servlet demo with groovy support ....... SKIPPED
[INFO] Hello world javascript demo ........................ SKIPPED
[INFO] CXF WS-Security UT Demo ............................ SKIPPED
[INFO] CXF WS-Security Signature Encryption Demo .......... SKIPPED
[INFO] CXF WS-SecurityPolicy Signature Encryption Demo .... SKIPPED
[INFO] WS-SecurityPolicy UT Demo .......................... SKIPPED
[INFO] MTOM Demo for SWA and XOP .......................... SKIPPED
[INFO] JAX-WS Asynchronous Demo using Document/Literal Style SKIPPED
[INFO] Java First POJO Sample ............................. SKIPPED
[INFO] WS-Policy Demo ..................................... SKIPPED
[INFO] Hello World Client Demo using JavaScript ........... SKIPPED
[INFO] WSDL first demo using HTTPS ........................ SKIPPED
[INFO] WS-Addressing Demo ................................. SKIPPED
[INFO] Sample using SOAP Headers .......................... SKIPPED
[INFO] SOAP/JMS Transport Specification Demo using Document-Literal Style SKIPPED
[INFO] CXF sample using WRAPPED Style in XML Binding (pure XML over HTTP) SKIPPED
[INFO] CXF sample using code first POJO's and the Aegis Binding SKIPPED
[INFO] Sample of JAX-* Service Using an Aegis Client ...... SKIPPED
[INFO] JAX-WS Handler Demo ................................ SKIPPED
[INFO] WSDL first demo using RPC-Literal Style ............ SKIPPED
[INFO] JMS Transport Publish/Subscribe Demo using Document-Literal Style SKIPPED
[INFO] JAX-RS Spring Security Demo ........................ SKIPPED
[INFO] Apache CXF Samples LogBrowser ...................... SKIPPED
[INFO] Apache CXF Samples LogBrowser Blueprint ............ SKIPPED
[INFO] WS-Notification Demo ............................... SKIPPED
[INFO] CXF STS Demo ....................................... SKIPPED
[INFO] Bank sample using JAX-WS API's to talk via CORBA/IIOP SKIPPED
[INFO] Bank sample using JAX-WS API's to talk via CORBA/IIOP SKIPPED
[INFO] hello-world sample using JAX-WS API's to talk via CORBA/IIOP SKIPPED
[INFO] OAuth 1.0a server .................................. SKIPPED
[INFO] OAuth 1.0a client .................................. SKIPPED
[INFO] JAX-RS Minimal OSGI Demo ........................... SKIPPED
[INFO] WS-Discovery Sample ................................ SKIPPED
[INFO] WS-Eventing Demo ................................... SKIPPED
[INFO] Demo using the throttling feature .................. SKIPPED
[INFO] JAX-RS Demo Using Distributed Tracing with Apache HTrace SKIPPED
[INFO] Apache CXF Distribution ............................ SKIPPED
[INFO] ------------------------------------------------------------------------
[INFO] BUILD FAILURE
[INFO] ------------------------------------------------------------------------
[INFO] Total time: 18:04 min
[INFO] Finished at: 2016-05-03T14:19:49+00:00
[INFO] Final Memory: 317M/952M
[INFO] ------------------------------------------------------------------------
[ERROR] Failed to execute goal org.apache.cxf:cxf-codegen-plugin:3.1.7-SNAPSHOT:wsdl2java
(generate-sources) on project js_browser_client_simple: Execution generate-sources of goal
org.apache.cxf:cxf-codegen-plugin:3.1.7-SNAPSHOT:wsdl2java failed: A required class was missing
while executing org.apache.cxf:cxf-codegen-plugin:3.1.7-SNAPSHOT:wsdl2java: org/apache/commons/logging/LogFactory
[ERROR] -----------------------------------------------------
[ERROR] realm =    plugin>org.apache.cxf:cxf-codegen-plugin:3.1.7-SNAPSHOT-2011039414
[ERROR] strategy = org.codehaus.plexus.classworlds.strategy.SelfFirstStrategy
[ERROR] urls[0] = file:/x1/jenkins/jenkins-slave/workspace/CXF-3.1-deploy/maven-plugins/codegen-plugin/target/cxf-codegen-plugin-3.1.7-SNAPSHOT.jar
[ERROR] urls[1] = <https://builds.apache.org/job/CXF-3.1-deploy/ws/.repository/org/apache/maven/shared/maven-artifact-resolver/1.0/maven-artifact-resolver-1.0.jar>
[ERROR] urls[2] = <https://builds.apache.org/job/CXF-3.1-deploy/ws/.repository/org/codehaus/plexus/plexus-utils/2.0.5/plexus-utils-2.0.5.jar>
[ERROR] urls[3] = <https://builds.apache.org/job/CXF-3.1-deploy/ws/.repository/org/codehaus/plexus/plexus-archiver/1.2/plexus-archiver-1.2.jar>
[ERROR] urls[4] = <https://builds.apache.org/job/CXF-3.1-deploy/ws/.repository/org/codehaus/plexus/plexus-io/1.0.1/plexus-io-1.0.1.jar>
[ERROR] urls[5] = file:/x1/jenkins/jenkins-slave/workspace/CXF-3.1-deploy/core/target/cxf-core-3.1.7-SNAPSHOT.jar
[ERROR] urls[6] = <https://builds.apache.org/job/CXF-3.1-deploy/ws/.repository/org/codehaus/woodstox/woodstox-core-asl/4.4.1/woodstox-core-asl-4.4.1.jar>
[ERROR] urls[7] = <https://builds.apache.org/job/CXF-3.1-deploy/ws/.repository/org/codehaus/woodstox/stax2-api/3.1.4/stax2-api-3.1.4.jar>
[ERROR] urls[8] = <https://builds.apache.org/job/CXF-3.1-deploy/ws/.repository/org/apache/ws/xmlschema/xmlschema-core/2.2.1/xmlschema-core-2.2.1.jar>
[ERROR] urls[9] = file:/x1/jenkins/jenkins-slave/workspace/CXF-3.1-deploy/tools/common/target/cxf-tools-common-3.1.7-SNAPSHOT.jar
[ERROR] urls[10] = <https://builds.apache.org/job/CXF-3.1-deploy/ws/.repository/org/apache/velocity/velocity/1.7/velocity-1.7.jar>
[ERROR] urls[11] = <https://builds.apache.org/job/CXF-3.1-deploy/ws/.repository/commons-lang/commons-lang/2.6/commons-lang-2.6.jar>
[ERROR] urls[12] = <https://builds.apache.org/job/CXF-3.1-deploy/ws/.repository/commons-collections/commons-collections/3.2.2/commons-collections-3.2.2.jar>
[ERROR] urls[13] = <https://builds.apache.org/job/CXF-3.1-deploy/ws/.repository/wsdl4j/wsdl4j/1.6.3/wsdl4j-1.6.3.jar>
[ERROR] urls[14] = <https://builds.apache.org/job/CXF-3.1-deploy/ws/.repository/com/sun/xml/bind/jaxb-xjc/2.2.11/jaxb-xjc-2.2.11.jar>
[ERROR] urls[15] = <https://builds.apache.org/job/CXF-3.1-deploy/ws/.repository/com/sun/xml/bind/jaxb-core/2.2.11/jaxb-core-2.2.11.jar>
[ERROR] urls[16] = <https://builds.apache.org/job/CXF-3.1-deploy/ws/.repository/com/sun/xml/bind/jaxb-impl/2.2.11/jaxb-impl-2.2.11.jar>
[ERROR] urls[17] = file:/x1/jenkins/jenkins-slave/workspace/CXF-3.1-deploy/tools/wsdlto/core/target/cxf-tools-wsdlto-core-3.1.7-SNAPSHOT.jar
[ERROR] urls[18] = file:/x1/jenkins/jenkins-slave/workspace/CXF-3.1-deploy/tools/validator/target/cxf-tools-validator-3.1.7-SNAPSHOT.jar
[ERROR] urls[19] = file:/x1/jenkins/jenkins-slave/workspace/CXF-3.1-deploy/rt/bindings/soap/target/cxf-rt-bindings-soap-3.1.7-SNAPSHOT.jar
[ERROR] urls[20] = file:/x1/jenkins/jenkins-slave/workspace/CXF-3.1-deploy/rt/databinding/jaxb/target/cxf-rt-databinding-jaxb-3.1.7-SNAPSHOT.jar
[ERROR] urls[21] = file:/x1/jenkins/jenkins-slave/workspace/CXF-3.1-deploy/rt/wsdl/target/cxf-rt-wsdl-3.1.7-SNAPSHOT.jar
[ERROR] urls[22] = <https://builds.apache.org/job/CXF-3.1-deploy/ws/.repository/org/ow2/asm/asm/5.0.4/asm-5.0.4.jar>
[ERROR] urls[23] = file:/x1/jenkins/jenkins-slave/workspace/CXF-3.1-deploy/tools/wsdlto/databinding/jaxb/target/cxf-tools-wsdlto-databinding-jaxb-3.1.7-SNAPSHOT.jar
[ERROR] urls[24] = file:/x1/jenkins/jenkins-slave/workspace/CXF-3.1-deploy/tools/wsdlto/frontend/jaxws/target/cxf-tools-wsdlto-frontend-jaxws-3.1.7-SNAPSHOT.jar
[ERROR] urls[25] = <https://builds.apache.org/job/CXF-3.1-deploy/ws/.repository/xml-resolver/xml-resolver/1.2/xml-resolver-1.2.jar>
[ERROR] urls[26] = file:/x1/jenkins/jenkins-slave/workspace/CXF-3.1-deploy/tools/wsdlto/frontend/javascript/target/cxf-tools-wsdlto-frontend-javascript-3.1.7-SNAPSHOT.jar
[ERROR] urls[27] = file:/x1/jenkins/jenkins-slave/workspace/CXF-3.1-deploy/rt/javascript/javascript-rt/target/cxf-rt-javascript-3.1.7-SNAPSHOT.jar
[ERROR] urls[28] = <https://builds.apache.org/job/CXF-3.1-deploy/ws/.repository/org/springframework/spring-core/4.1.9.RELEASE/spring-core-4.1.9.RELEASE.jar>
[ERROR] urls[29] = <https://builds.apache.org/job/CXF-3.1-deploy/ws/.repository/org/springframework/spring-beans/4.1.9.RELEASE/spring-beans-4.1.9.RELEASE.jar>
[ERROR] urls[30] = <https://builds.apache.org/job/CXF-3.1-deploy/ws/.repository/org/springframework/spring-context/4.1.9.RELEASE/spring-context-4.1.9.RELEASE.jar>
[ERROR] urls[31] = <https://builds.apache.org/job/CXF-3.1-deploy/ws/.repository/org/springframework/spring-aop/4.1.9.RELEASE/spring-aop-4.1.9.RELEASE.jar>
[ERROR] urls[32] = <https://builds.apache.org/job/CXF-3.1-deploy/ws/.repository/aopalliance/aopalliance/1.0/aopalliance-1.0.jar>
[ERROR] urls[33] = <https://builds.apache.org/job/CXF-3.1-deploy/ws/.repository/org/springframework/spring-expression/4.1.9.RELEASE/spring-expression-4.1.9.RELEASE.jar>
[ERROR] urls[34] = <https://builds.apache.org/job/CXF-3.1-deploy/ws/.repository/org/apache/ant/ant/1.9.6/ant-1.9.6.jar>
[ERROR] urls[35] = <https://builds.apache.org/job/CXF-3.1-deploy/ws/.repository/org/apache/ant/ant-launcher/1.9.6/ant-launcher-1.9.6.jar>
[ERROR] urls[36] = <https://builds.apache.org/job/CXF-3.1-deploy/ws/.repository/org/apache/ant/ant-nodeps/1.8.1/ant-nodeps-1.8.1.jar>
[ERROR] urls[37] = <https://builds.apache.org/job/CXF-3.1-deploy/ws/.repository/org/sonatype/plexus/plexus-build-api/0.0.7/plexus-build-api-0.0.7.jar>
[ERROR] Number of foreign imports: 1
[ERROR] import: Entry[import  from realm ClassRealm[maven.api, parent: null]]
[ERROR] 
[ERROR] -----------------------------------------------------: org.apache.commons.logging.LogFactory
[ERROR] -> [Help 1]
[ERROR] 
[ERROR] To see the full stack trace of the errors, re-run Maven with the -e switch.
[ERROR] Re-run Maven using the -X switch to enable full debug logging.
[ERROR] 
[ERROR] For more information about the errors and possible solutions, please read the following
articles:
[ERROR] [Help 1] http://cwiki.apache.org/confluence/display/MAVEN/PluginContainerException
[ERROR] 
[ERROR] After correcting the problems, you can resume the build with the command
[ERROR]   mvn <goals> -rf :js_browser_client_simple
Build step 'Invoke top-level Maven targets' marked build as failure

Mime
View raw message