cxf-notifications mailing list archives

Site index · List index
Message view « Date » · « Thread »
Top « Date » · « Thread »
From gmcdon...@apache.org
Subject Build failed in Jenkins: cxf-trunk #1299
Date Thu, 12 May 2016 17:50:41 GMT
See <https://analysis.apache.org/jenkins/job/cxf-trunk/1299/changes>

Changes:

[sberyozkin] [CXF-6869] Updates to the auto configuration code, patch from Vedran

[sberyozkin] [CXF-6869] Adding application.properties to the demo

------------------------------------------
[...truncated 8707 lines...]
[INFO] Apache CXF STS Core ................................ SUCCESS [ 11.690 s]
[INFO] Apache CXF STS war deployment ...................... SUCCESS [ 18.919 s]
[INFO] Apache CXF STS basic systests ...................... SUCCESS [ 17.576 s]
[INFO] Apache CXF STS advanced systests ................... SUCCESS [ 10.040 s]
[INFO] Apache CXF STS test OSGi deployment ................ SUCCESS [  3.375 s]
[INFO] Apache CXF STS test Karaf Features ................. SUCCESS [  0.652 s]
[INFO] Apache CXF Karaf Parent ............................ SUCCESS [  0.353 s]
[INFO] Apache CXF Karaf Features .......................... SUCCESS [  6.235 s]
[INFO] Apache CXF Karaf Commands .......................... SUCCESS [  7.119 s]
[INFO] Apache CXF STS Integration Tests ................... SUCCESS [ 12.587 s]
[INFO] Apache CXF Services ................................ SUCCESS [  0.286 s]
[INFO] Apache CXF STS service ............................. SUCCESS [  0.180 s]
[INFO] Apache CXF STS systests ............................ SUCCESS [  0.148 s]
[INFO] Apache CXF WSN API ................................. SUCCESS [ 11.851 s]
[INFO] Apache CXF WSN Core ................................ SUCCESS [  4.654 s]
[INFO] Apache CXF WSN OSGi ................................ SUCCESS [  3.481 s]
[INFO] Apache CXF WSN service ............................. SUCCESS [  1.267 s]
[INFO] Apache CXF WS-Discovery API ........................ SUCCESS [ 12.834 s]
[INFO] Apache CXF WS-Discovery Service .................... SUCCESS [  1.166 s]
[INFO] Apache CXF WS-Discovery ............................ SUCCESS [  1.347 s]
[INFO] Apache CXF XKMS Common ............................. SUCCESS [  7.818 s]
[INFO] Apache CXF XKMS X509 Handlers ...................... SUCCESS [  7.309 s]
[INFO] Apache CXF XKMS Service ............................ SUCCESS [  2.111 s]
[INFO] Apache CXF XKMS Client ............................. SUCCESS [  3.784 s]
[INFO] Apache CXF XKMS Karaf Features ..................... SUCCESS [  1.875 s]
[INFO] Apache CXF XKMS OSGi deployment .................... SUCCESS [  4.146 s]
[INFO] Apache CXF XKMS LDAP repository .................... SUCCESS [  2.533 s]
[INFO] Apache CXF XKMS Service war deployment ............. SUCCESS [  6.877 s]
[INFO] Apache CXF XKMS Integration Tests .................. SUCCESS [  5.086 s]
[INFO] Apache CXF XKMS .................................... SUCCESS [  0.820 s]
[INFO] Apache CXF Bundle Parent ........................... SUCCESS [  0.885 s]
[INFO] Apache CXF Compatibility Bundle Jar ................ SUCCESS [  2.134 s]
[INFO] Apache CXF :: OSGi :: Integration Tests ............ SUCCESS [ 27.665 s]
[INFO] Apache CXF :: OSGi :: Integration Tests pure felix . SUCCESS [ 11.413 s]
[INFO] cxf-repository ..................................... SUCCESS [  7.514 s]
[INFO] Apache CXF OSGi parent ............................. SUCCESS [  0.206 s]
[INFO] Apache CXF Container Integration System Tests ...... SUCCESS [  0.357 s]
[INFO] Apache CXF Container Integration Test Webapp ....... SUCCESS [  4.035 s]
[INFO] Apache CXF Container Integration Test Grizzly ...... SUCCESS [  9.173 s]
[INFO] Apache CXF Uncategorized System Tests .............. SUCCESS [ 24.423 s]
[INFO] Apache CXF Transport System Tests .................. SUCCESS [  7.410 s]
[INFO] Apache CXF Transport SSL3 System Tests ............. SUCCESS [  1.819 s]
[INFO] Apache CXF Transport System Tests JMS .............. SUCCESS [  6.097 s]
[INFO] Apache CXF Undertow Transport System Tests ......... SUCCESS [  9.163 s]
[INFO] Apache CXF JAX-WS System Tests ..................... SUCCESS [ 10.193 s]
[INFO] Apache CXF Databinding System Tests ................ SUCCESS [ 27.296 s]
[INFO] Apache CXF JAX-RS System Tests ..................... SUCCESS [01:10 min]
[INFO] Apache CXF WS-* Specifications System Tests ........ SUCCESS [ 38.163 s]
[INFO] Apache CXF WS-RM Specifications System Tests ....... SUCCESS [  7.552 s]
[INFO] Apache CXF WS-Security System Tests ................ SUCCESS [ 35.704 s]
[INFO] Apache CXF WS-Security Interop System Tests ........ SUCCESS [ 15.556 s]
[INFO] Apache CXF Kerberos Integration System Tests ....... SUCCESS [ 37.745 s]
[INFO] Apache CXF JAX-RS System Advanced Security Tests ... SUCCESS [ 19.018 s]
[INFO] Test for writing wsdl to repo ...................... SUCCESS [  8.161 s]
[INFO] Test for generating code from wsdl in repo ......... SUCCESS [ 20.671 s]
[INFO] Apache CXF System Tests ............................ SUCCESS [  0.209 s]
[INFO] Apache CXF System Tests for Maven Plugins .......... SUCCESS [  0.149 s]
[INFO] Apache CXF CDI Integration System Tests ............ SUCCESS [  9.883 s]
[INFO] Apache CXF Servlet Container Initializer Integration System Tests SUCCESS [  4.780
s]
[INFO] Apache CXF Distributed Tracing Integration System Tests SKIPPED
[INFO] Apache CXF JiBX Integration System Tests ........... SUCCESS [  0.403 s]
[INFO] Apache CXF JAX-RS JiBX System Tests ................ SUCCESS [  7.697 s]
[INFO] Apache CXF Data Binding JiBX System Tests .......... SUCCESS [ 16.912 s]
[INFO] ------------------------------------------------------------------------
[INFO] BUILD FAILURE
[INFO] ------------------------------------------------------------------------
[INFO] Total time: 26:29 min
[INFO] Finished at: 2016-05-12T17:49:46+00:00
[INFO] Final Memory: 284M/589M
[INFO] ------------------------------------------------------------------------
[ERROR] Failed to execute goal org.apache.maven.plugins:maven-compiler-plugin:3.3:compile
(default-compile) on project cxf-integration-tracing-htrace: Compilation failure: Compilation
failure:
[ERROR] <https://analysis.apache.org/jenkins/job/cxf-trunk/ws/integration/tracing/tracing-htrace/src/main/java/org/apache/cxf/jaxrs/tracing/htrace/HTraceTracerContext.java>:[26,25]
cannot find symbol
[ERROR] symbol:   class Sampler
[ERROR] location: package org.apache.htrace
[ERROR] <https://analysis.apache.org/jenkins/job/cxf-trunk/ws/integration/tracing/tracing-htrace/src/main/java/org/apache/cxf/jaxrs/tracing/htrace/HTraceTracerContext.java>:[27,25]
cannot find symbol
[ERROR] symbol:   class Trace
[ERROR] location: package org.apache.htrace
[ERROR] <https://analysis.apache.org/jenkins/job/cxf-trunk/ws/integration/tracing/tracing-htrace/src/main/java/org/apache/cxf/jaxrs/tracing/htrace/HTraceTracerContext.java>:[28,25]
cannot find symbol
[ERROR] symbol:   class TraceScope
[ERROR] location: package org.apache.htrace
[ERROR] <https://analysis.apache.org/jenkins/job/cxf-trunk/ws/integration/tracing/tracing-htrace/src/main/java/org/apache/cxf/jaxrs/tracing/htrace/HTraceTracerContext.java>:[29,34]
package org.apache.htrace.wrappers does not exist
[ERROR] <https://analysis.apache.org/jenkins/job/cxf-trunk/ws/integration/tracing/tracing-htrace/src/main/java/org/apache/cxf/jaxrs/tracing/htrace/HTraceTracerContext.java>:[32,19]
cannot find symbol
[ERROR] symbol:   class Sampler
[ERROR] location: class org.apache.cxf.jaxrs.tracing.htrace.HTraceTracerContext
[ERROR] <https://analysis.apache.org/jenkins/job/cxf-trunk/ws/integration/tracing/tracing-htrace/src/main/java/org/apache/cxf/jaxrs/tracing/htrace/HTraceTracerContext.java>:[34,38]
cannot find symbol
[ERROR] symbol:   class Sampler
[ERROR] location: class org.apache.cxf.jaxrs.tracing.htrace.HTraceTracerContext
[ERROR] <https://analysis.apache.org/jenkins/job/cxf-trunk/ws/integration/tracing/tracing-htrace/src/main/java/org/apache/cxf/jaxrs/tracing/htrace/HTraceTracerContext.java>:[40,12]
cannot find symbol
[ERROR] symbol:   class TraceScope
[ERROR] location: class org.apache.cxf.jaxrs.tracing.htrace.HTraceTracerContext
[ERROR] <https://analysis.apache.org/jenkins/job/cxf-trunk/ws/integration/tracing/tracing-htrace/src/main/java/org/apache/cxf/jaxrs/tracing/htrace/HTraceContextProvider.java>:[26,25]
cannot find symbol
[ERROR] symbol:   class Sampler
[ERROR] location: package org.apache.htrace
[ERROR] <https://analysis.apache.org/jenkins/job/cxf-trunk/ws/integration/tracing/tracing-htrace/src/main/java/org/apache/cxf/jaxrs/tracing/htrace/HTraceContextProvider.java>:[27,30]
package org.apache.htrace.impl does not exist
[ERROR] <https://analysis.apache.org/jenkins/job/cxf-trunk/ws/integration/tracing/tracing-htrace/src/main/java/org/apache/cxf/jaxrs/tracing/htrace/HTraceContextProvider.java>:[31,13]
cannot find symbol
[ERROR] symbol:   class Sampler
[ERROR] location: class org.apache.cxf.jaxrs.tracing.htrace.HTraceContextProvider
[ERROR] <https://analysis.apache.org/jenkins/job/cxf-trunk/ws/integration/tracing/tracing-htrace/src/main/java/org/apache/cxf/jaxrs/tracing/htrace/HTraceContextProvider.java>:[33,40]
cannot find symbol
[ERROR] symbol:   class Sampler
[ERROR] location: class org.apache.cxf.jaxrs.tracing.htrace.HTraceContextProvider
[ERROR] <https://analysis.apache.org/jenkins/job/cxf-trunk/ws/integration/tracing/tracing-htrace/src/main/java/org/apache/cxf/jaxrs/tracing/htrace/HTraceFeature.java>:[27,25]
cannot find symbol
[ERROR] symbol:   class HTraceConfiguration
[ERROR] location: package org.apache.htrace
[ERROR] <https://analysis.apache.org/jenkins/job/cxf-trunk/ws/integration/tracing/tracing-htrace/src/main/java/org/apache/cxf/jaxrs/tracing/htrace/HTraceFeature.java>:[28,25]
cannot find symbol
[ERROR] symbol:   class Sampler
[ERROR] location: package org.apache.htrace
[ERROR] <https://analysis.apache.org/jenkins/job/cxf-trunk/ws/integration/tracing/tracing-htrace/src/main/java/org/apache/cxf/jaxrs/tracing/htrace/HTraceFeature.java>:[29,25]
cannot find symbol
[ERROR] symbol:   class SamplerBuilder
[ERROR] location: package org.apache.htrace
[ERROR] <https://analysis.apache.org/jenkins/job/cxf-trunk/ws/integration/tracing/tracing-htrace/src/main/java/org/apache/cxf/jaxrs/tracing/htrace/HTraceFeature.java>:[30,25]
cannot find symbol
[ERROR] symbol:   class SpanReceiver
[ERROR] location: package org.apache.htrace
[ERROR] <https://analysis.apache.org/jenkins/job/cxf-trunk/ws/integration/tracing/tracing-htrace/src/main/java/org/apache/cxf/jaxrs/tracing/htrace/HTraceFeature.java>:[31,25]
cannot find symbol
[ERROR] symbol:   class SpanReceiverBuilder
[ERROR] location: package org.apache.htrace
[ERROR] <https://analysis.apache.org/jenkins/job/cxf-trunk/ws/integration/tracing/tracing-htrace/src/main/java/org/apache/cxf/jaxrs/tracing/htrace/HTraceFeature.java>:[32,25]
cannot find symbol
[ERROR] symbol:   class Trace
[ERROR] location: package org.apache.htrace
[ERROR] <https://analysis.apache.org/jenkins/job/cxf-trunk/ws/integration/tracing/tracing-htrace/src/main/java/org/apache/cxf/jaxrs/tracing/htrace/HTraceFeature.java>:[35,13]
cannot find symbol
[ERROR] symbol:   class HTraceConfiguration
[ERROR] location: class org.apache.cxf.jaxrs.tracing.htrace.HTraceFeature
[ERROR] <https://analysis.apache.org/jenkins/job/cxf-trunk/ws/integration/tracing/tracing-htrace/src/main/java/org/apache/cxf/jaxrs/tracing/htrace/HTraceFeature.java>:[41,32]
cannot find symbol
[ERROR] symbol:   class HTraceConfiguration
[ERROR] location: class org.apache.cxf.jaxrs.tracing.htrace.HTraceFeature
[ERROR] <https://analysis.apache.org/jenkins/job/cxf-trunk/ws/integration/tracing/tracing-htrace/src/main/java/org/apache/cxf/jaxrs/tracing/htrace/HTraceFeature.java>:[64,40]
cannot find symbol
[ERROR] symbol:   class HTraceConfiguration
[ERROR] location: class org.apache.cxf.jaxrs.tracing.htrace.HTraceFeature
[ERROR] <https://analysis.apache.org/jenkins/job/cxf-trunk/ws/integration/tracing/tracing-htrace/src/main/java/org/apache/cxf/jaxrs/tracing/htrace/HTraceFeature.java>:[68,12]
cannot find symbol
[ERROR] symbol:   class HTraceConfiguration
[ERROR] location: class org.apache.cxf.jaxrs.tracing.htrace.HTraceFeature
[ERROR] <https://analysis.apache.org/jenkins/job/cxf-trunk/ws/integration/tracing/tracing-htrace/src/main/java/org/apache/cxf/jaxrs/tracing/htrace/HTraceProvider.java>:[33,25]
cannot find symbol
[ERROR] symbol:   class Sampler
[ERROR] location: package org.apache.htrace
[ERROR] <https://analysis.apache.org/jenkins/job/cxf-trunk/ws/integration/tracing/tracing-htrace/src/main/java/org/apache/cxf/jaxrs/tracing/htrace/HTraceProvider.java>:[34,25]
cannot find symbol
[ERROR] symbol:   class Trace
[ERROR] location: package org.apache.htrace
[ERROR] <https://analysis.apache.org/jenkins/job/cxf-trunk/ws/integration/tracing/tracing-htrace/src/main/java/org/apache/cxf/jaxrs/tracing/htrace/HTraceProvider.java>:[35,25]
cannot find symbol
[ERROR] symbol:   class TraceInfo
[ERROR] location: package org.apache.htrace
[ERROR] <https://analysis.apache.org/jenkins/job/cxf-trunk/ws/integration/tracing/tracing-htrace/src/main/java/org/apache/cxf/jaxrs/tracing/htrace/HTraceProvider.java>:[36,25]
cannot find symbol
[ERROR] symbol:   class TraceScope
[ERROR] location: package org.apache.htrace
[ERROR] <https://analysis.apache.org/jenkins/job/cxf-trunk/ws/integration/tracing/tracing-htrace/src/main/java/org/apache/cxf/jaxrs/tracing/htrace/HTraceProvider.java>:[37,25]
cannot find symbol
[ERROR] symbol:   class Tracer
[ERROR] location: package org.apache.htrace
[ERROR] <https://analysis.apache.org/jenkins/job/cxf-trunk/ws/integration/tracing/tracing-htrace/src/main/java/org/apache/cxf/jaxrs/tracing/htrace/HTraceProvider.java>:[38,30]
package org.apache.htrace.impl does not exist
[ERROR] <https://analysis.apache.org/jenkins/job/cxf-trunk/ws/integration/tracing/tracing-htrace/src/main/java/org/apache/cxf/jaxrs/tracing/htrace/HTraceProvider.java>:[48,19]
cannot find symbol
[ERROR] symbol:   class Sampler
[ERROR] location: class org.apache.cxf.jaxrs.tracing.htrace.HTraceProvider
[ERROR] <https://analysis.apache.org/jenkins/job/cxf-trunk/ws/integration/tracing/tracing-htrace/src/main/java/org/apache/cxf/jaxrs/tracing/htrace/HTraceProvider.java>:[54,33]
cannot find symbol
[ERROR] symbol:   class Sampler
[ERROR] location: class org.apache.cxf.jaxrs.tracing.htrace.HTraceProvider
[ERROR] <https://analysis.apache.org/jenkins/job/cxf-trunk/ws/integration/tracing/tracing-htrace/src/main/java/org/apache/cxf/jaxrs/tracing/htrace/HTraceProvider.java>:[41,1]
cannot find symbol
[ERROR] symbol:   static HEADER_TRACE_ID
[ERROR] location: class
[ERROR] <https://analysis.apache.org/jenkins/job/cxf-trunk/ws/integration/tracing/tracing-htrace/src/main/java/org/apache/cxf/jaxrs/tracing/htrace/HTraceTracerContext.java>:[31,8]
org.apache.cxf.jaxrs.tracing.htrace.HTraceTracerContext is not abstract and does not override
abstract method <T>continueSpan(org.apache.cxf.tracing.Traceable<T>) in org.apache.cxf.tracing.TracerContext
[ERROR] <https://analysis.apache.org/jenkins/job/cxf-trunk/ws/integration/tracing/tracing-htrace/src/main/java/org/apache/cxf/jaxrs/tracing/htrace/HTraceTracerContext.java>:[41,16]
cannot find symbol
[ERROR] symbol:   variable Trace
[ERROR] location: class org.apache.cxf.jaxrs.tracing.htrace.HTraceTracerContext
[ERROR] <https://analysis.apache.org/jenkins/job/cxf-trunk/ws/integration/tracing/tracing-htrace/src/main/java/org/apache/cxf/jaxrs/tracing/htrace/HTraceTracerContext.java>:[55,13]
cannot find symbol
[ERROR] symbol:   variable Trace
[ERROR] location: class org.apache.cxf.jaxrs.tracing.htrace.HTraceTracerContext
[ERROR] <https://analysis.apache.org/jenkins/job/cxf-trunk/ws/integration/tracing/tracing-htrace/src/main/java/org/apache/cxf/jaxrs/tracing/htrace/HTraceTracerContext.java>:[56,24]
cannot find symbol
[ERROR] symbol:   class TraceCallable
[ERROR] location: class org.apache.cxf.jaxrs.tracing.htrace.HTraceTracerContext
[ERROR] <https://analysis.apache.org/jenkins/job/cxf-trunk/ws/integration/tracing/tracing-htrace/src/main/java/org/apache/cxf/jaxrs/tracing/htrace/HTraceTracerContext.java>:[56,41]
cannot find symbol
[ERROR] symbol:   variable Trace
[ERROR] location: class org.apache.cxf.jaxrs.tracing.htrace.HTraceTracerContext
[ERROR] <https://analysis.apache.org/jenkins/job/cxf-trunk/ws/integration/tracing/tracing-htrace/src/main/java/org/apache/cxf/jaxrs/tracing/htrace/HTraceTracerContext.java>:[62,5]
method does not override or implement a method from a supertype
[ERROR] <https://analysis.apache.org/jenkins/job/cxf-trunk/ws/integration/tracing/tracing-htrace/src/main/java/org/apache/cxf/jaxrs/tracing/htrace/HTraceTracerContext.java>:[64,9]
cannot find symbol
[ERROR] symbol:   variable Trace
[ERROR] location: class org.apache.cxf.jaxrs.tracing.htrace.HTraceTracerContext
[ERROR] <https://analysis.apache.org/jenkins/job/cxf-trunk/ws/integration/tracing/tracing-htrace/src/main/java/org/apache/cxf/jaxrs/tracing/htrace/HTraceTracerContext.java>:[75,9]
cannot find symbol
[ERROR] symbol:   variable Trace
[ERROR] location: class org.apache.cxf.jaxrs.tracing.htrace.HTraceTracerContext
[ERROR] <https://analysis.apache.org/jenkins/job/cxf-trunk/ws/integration/tracing/tracing-htrace/src/main/java/org/apache/cxf/jaxrs/tracing/htrace/HTraceContextProvider.java>:[31,36]
cannot find symbol
[ERROR] symbol:   variable NeverSampler
[ERROR] location: class org.apache.cxf.jaxrs.tracing.htrace.HTraceContextProvider
[ERROR] <https://analysis.apache.org/jenkins/job/cxf-trunk/ws/integration/tracing/tracing-htrace/src/main/java/org/apache/cxf/jaxrs/tracing/htrace/HTraceFeature.java>:[38,14]
cannot find symbol
[ERROR] symbol:   variable HTraceConfiguration
[ERROR] location: class org.apache.cxf.jaxrs.tracing.htrace.HTraceFeature
[ERROR] <https://analysis.apache.org/jenkins/job/cxf-trunk/ws/integration/tracing/tracing-htrace/src/main/java/org/apache/cxf/jaxrs/tracing/htrace/HTraceFeature.java>:[51,15]
cannot find symbol
[ERROR] symbol:   class Sampler
[ERROR] location: class org.apache.cxf.jaxrs.tracing.htrace.HTraceFeature
[ERROR] <https://analysis.apache.org/jenkins/job/cxf-trunk/ws/integration/tracing/tracing-htrace/src/main/java/org/apache/cxf/jaxrs/tracing/htrace/HTraceFeature.java>:[51,42]
cannot find symbol
[ERROR] symbol:   class SamplerBuilder
[ERROR] location: class org.apache.cxf.jaxrs.tracing.htrace.HTraceFeature
[ERROR] <https://analysis.apache.org/jenkins/job/cxf-trunk/ws/integration/tracing/tracing-htrace/src/main/java/org/apache/cxf/jaxrs/tracing/htrace/HTraceFeature.java>:[52,15]
cannot find symbol
[ERROR] symbol:   class SpanReceiver
[ERROR] location: class org.apache.cxf.jaxrs.tracing.htrace.HTraceFeature
[ERROR] <https://analysis.apache.org/jenkins/job/cxf-trunk/ws/integration/tracing/tracing-htrace/src/main/java/org/apache/cxf/jaxrs/tracing/htrace/HTraceFeature.java>:[52,47]
cannot find symbol
[ERROR] symbol:   class SpanReceiverBuilder
[ERROR] location: class org.apache.cxf.jaxrs.tracing.htrace.HTraceFeature
[ERROR] <https://analysis.apache.org/jenkins/job/cxf-trunk/ws/integration/tracing/tracing-htrace/src/main/java/org/apache/cxf/jaxrs/tracing/htrace/HTraceFeature.java>:[55,13]
cannot find symbol
[ERROR] symbol:   variable Trace
[ERROR] location: class org.apache.cxf.jaxrs.tracing.htrace.HTraceFeature
[ERROR] <https://analysis.apache.org/jenkins/job/cxf-trunk/ws/integration/tracing/tracing-htrace/src/main/java/org/apache/cxf/jaxrs/tracing/htrace/HTraceProvider.java>:[51,14]
cannot find symbol
[ERROR] symbol:   variable NeverSampler
[ERROR] location: class org.apache.cxf.jaxrs.tracing.htrace.HTraceProvider
[ERROR] <https://analysis.apache.org/jenkins/job/cxf-trunk/ws/integration/tracing/tracing-htrace/src/main/java/org/apache/cxf/jaxrs/tracing/htrace/HTraceProvider.java>:[64,62]
cannot find symbol
[ERROR] symbol:   variable HEADER_TRACE_ID
[ERROR] location: class org.apache.cxf.jaxrs.tracing.htrace.HTraceProvider
[ERROR] <https://analysis.apache.org/jenkins/job/cxf-trunk/ws/integration/tracing/tracing-htrace/src/main/java/org/apache/cxf/jaxrs/tracing/htrace/HTraceProvider.java>:[65,19]
package Tracer does not exist
[ERROR] <https://analysis.apache.org/jenkins/job/cxf-trunk/ws/integration/tracing/tracing-htrace/src/main/java/org/apache/cxf/jaxrs/tracing/htrace/HTraceProvider.java>:[69,19]
package Tracer does not exist
[ERROR] <https://analysis.apache.org/jenkins/job/cxf-trunk/ws/integration/tracing/tracing-htrace/src/main/java/org/apache/cxf/jaxrs/tracing/htrace/HTraceProvider.java>:[71,30]
package Tracer does not exist
[ERROR] <https://analysis.apache.org/jenkins/job/cxf-trunk/ws/integration/tracing/tracing-htrace/src/main/java/org/apache/cxf/jaxrs/tracing/htrace/HTraceProvider.java>:[71,69]
package Tracer does not exist
[ERROR] <https://analysis.apache.org/jenkins/job/cxf-trunk/ws/integration/tracing/tracing-htrace/src/main/java/org/apache/cxf/jaxrs/tracing/htrace/HTraceProvider.java>:[73,18]
cannot find symbol
[ERROR] symbol:   class Sampler
[ERROR] location: class org.apache.cxf.jaxrs.tracing.htrace.HTraceProvider
[ERROR] <https://analysis.apache.org/jenkins/job/cxf-trunk/ws/integration/tracing/tracing-htrace/src/main/java/org/apache/cxf/jaxrs/tracing/htrace/HTraceProvider.java>:[73,27]
cannot find symbol
[ERROR] symbol:   class TraceInfo
[ERROR] location: class org.apache.cxf.jaxrs.tracing.htrace.HTraceProvider
[ERROR] <https://analysis.apache.org/jenkins/job/cxf-trunk/ws/integration/tracing/tracing-htrace/src/main/java/org/apache/cxf/jaxrs/tracing/htrace/HTraceProvider.java>:[73,52]
cannot find symbol
[ERROR] symbol:   class TraceInfo
[ERROR] location: class org.apache.cxf.jaxrs.tracing.htrace.HTraceProvider
[ERROR] <https://analysis.apache.org/jenkins/job/cxf-trunk/ws/integration/tracing/tracing-htrace/src/main/java/org/apache/cxf/jaxrs/tracing/htrace/HTraceProvider.java>:[72,52]
cannot find symbol
[ERROR] symbol:   variable Trace
[ERROR] location: class org.apache.cxf.jaxrs.tracing.htrace.HTraceProvider
[ERROR] <https://analysis.apache.org/jenkins/job/cxf-trunk/ws/integration/tracing/tracing-htrace/src/main/java/org/apache/cxf/jaxrs/tracing/htrace/HTraceProvider.java>:[83,33]
cannot find symbol
[ERROR] symbol:   variable HEADER_TRACE_ID
[ERROR] location: class org.apache.cxf.jaxrs.tracing.htrace.HTraceProvider
[ERROR] <https://analysis.apache.org/jenkins/job/cxf-trunk/ws/integration/tracing/tracing-htrace/src/main/java/org/apache/cxf/jaxrs/tracing/htrace/HTraceProvider.java>:[84,46]
cannot find symbol
[ERROR] symbol:   variable HEADER_TRACE_ID
[ERROR] location: class org.apache.cxf.jaxrs.tracing.htrace.HTraceProvider
[ERROR] <https://analysis.apache.org/jenkins/job/cxf-trunk/ws/integration/tracing/tracing-htrace/src/main/java/org/apache/cxf/jaxrs/tracing/htrace/HTraceProvider.java>:[84,80]
cannot find symbol
[ERROR] symbol:   variable HEADER_TRACE_ID
[ERROR] location: class org.apache.cxf.jaxrs.tracing.htrace.HTraceProvider
[ERROR] <https://analysis.apache.org/jenkins/job/cxf-trunk/ws/integration/tracing/tracing-htrace/src/main/java/org/apache/cxf/jaxrs/tracing/htrace/HTraceProvider.java>:[89,30]
cannot find symbol
[ERROR] symbol:   class TraceScope
[ERROR] location: class org.apache.cxf.jaxrs.tracing.htrace.HTraceProvider
[ERROR] <https://analysis.apache.org/jenkins/job/cxf-trunk/ws/integration/tracing/tracing-htrace/src/main/java/org/apache/cxf/jaxrs/tracing/htrace/HTraceProvider.java>:[90,19]
cannot find symbol
[ERROR] symbol:   class TraceScope
[ERROR] location: class org.apache.cxf.jaxrs.tracing.htrace.HTraceProvider
[ERROR] <https://analysis.apache.org/jenkins/job/cxf-trunk/ws/integration/tracing/tracing-htrace/src/main/java/org/apache/cxf/jaxrs/tracing/htrace/HTraceProvider.java>:[90,38]
cannot find symbol
[ERROR] symbol:   class TraceScope
[ERROR] location: class org.apache.cxf.jaxrs.tracing.htrace.HTraceProvider
[ERROR] -> [Help 1]
[ERROR] 
[ERROR] To see the full stack trace of the errors, re-run Maven with the -e switch.
[ERROR] Re-run Maven using the -X switch to enable full debug logging.
[ERROR] 
[ERROR] For more information about the errors and possible solutions, please read the following
articles:
[ERROR] [Help 1] http://cwiki.apache.org/confluence/display/MAVEN/MojoFailureException
[ERROR] 
[ERROR] After correcting the problems, you can resume the build with the command
[ERROR]   mvn <goals> -rf :cxf-integration-tracing-htrace
Sending e-mails to: notifications@cxf.apache.org
channel stopped
Skipping sonar analysis due to bad build status FAILURE

Mime
View raw message