cxf-notifications mailing list archives

Site index · List index
Message view « Date » · « Thread »
Top « Date » · « Thread »
From gmcdon...@apache.org
Subject Build failed in Jenkins: cxf-trunk #1301
Date Mon, 16 May 2016 17:54:39 GMT
See <https://analysis.apache.org/jenkins/job/cxf-trunk/1301/changes>

Changes:

[sberyozkin] [CXF-6510] Updating LoggingOutInterceptor to use formatLoggingMessage,

[sberyozkin] Fixing the old OAuth test

[sberyozkin] [CXF-6901] Fixing an issue with resolving the query templates

[coheigea] DBF fix

[sberyozkin] Updating Search/Tika demo on the trunk to use individual parser modules

------------------------------------------
[...truncated 8595 lines...]
[INFO] Apache CXF STS war deployment ...................... SUCCESS [ 14.269 s]
[INFO] Apache CXF STS basic systests ...................... SUCCESS [ 27.518 s]
[INFO] Apache CXF STS advanced systests ................... SUCCESS [ 23.308 s]
[INFO] Apache CXF STS test OSGi deployment ................ SUCCESS [ 17.012 s]
[INFO] Apache CXF STS test Karaf Features ................. SUCCESS [  7.855 s]
[INFO] Apache CXF Karaf Parent ............................ SUCCESS [  4.191 s]
[INFO] Apache CXF Karaf Features .......................... SUCCESS [  9.317 s]
[INFO] Apache CXF Karaf Commands .......................... SUCCESS [ 10.437 s]
[INFO] Apache CXF STS Integration Tests ................... SUCCESS [ 29.331 s]
[INFO] Apache CXF Services ................................ SUCCESS [  0.342 s]
[INFO] Apache CXF STS service ............................. SUCCESS [  0.367 s]
[INFO] Apache CXF STS systests ............................ SUCCESS [  0.176 s]
[INFO] Apache CXF WSN API ................................. SUCCESS [ 31.253 s]
[INFO] Apache CXF WSN Core ................................ SUCCESS [ 12.700 s]
[INFO] Apache CXF WSN OSGi ................................ SUCCESS [  4.563 s]
[INFO] Apache CXF WSN service ............................. SUCCESS [  0.231 s]
[INFO] Apache CXF WS-Discovery API ........................ SUCCESS [ 13.800 s]
[INFO] Apache CXF WS-Discovery Service .................... SUCCESS [  4.531 s]
[INFO] Apache CXF WS-Discovery ............................ SUCCESS [  0.252 s]
[INFO] Apache CXF XKMS Common ............................. SUCCESS [ 19.228 s]
[INFO] Apache CXF XKMS X509 Handlers ...................... SUCCESS [ 12.911 s]
[INFO] Apache CXF XKMS Service ............................ SUCCESS [  3.255 s]
[INFO] Apache CXF XKMS Client ............................. SUCCESS [ 15.477 s]
[INFO] Apache CXF XKMS Karaf Features ..................... SUCCESS [  3.080 s]
[INFO] Apache CXF XKMS OSGi deployment .................... SUCCESS [  5.726 s]
[INFO] Apache CXF XKMS LDAP repository .................... SUCCESS [  9.887 s]
[INFO] Apache CXF XKMS Service war deployment ............. SUCCESS [  9.190 s]
[INFO] Apache CXF XKMS Integration Tests .................. SUCCESS [ 12.417 s]
[INFO] Apache CXF XKMS .................................... SUCCESS [  0.259 s]
[INFO] Apache CXF Bundle Parent ........................... SUCCESS [  2.983 s]
[INFO] Apache CXF Compatibility Bundle Jar ................ SUCCESS [  5.667 s]
[INFO] Apache CXF :: OSGi :: Integration Tests ............ SUCCESS [ 38.154 s]
[INFO] Apache CXF :: OSGi :: Integration Tests pure felix . SUCCESS [ 12.736 s]
[INFO] cxf-repository ..................................... SUCCESS [  7.567 s]
[INFO] Apache CXF OSGi parent ............................. SUCCESS [  0.223 s]
[INFO] Apache CXF Container Integration System Tests ...... SUCCESS [  0.442 s]
[INFO] Apache CXF Container Integration Test Webapp ....... SUCCESS [  6.609 s]
[INFO] Apache CXF Container Integration Test Grizzly ...... SUCCESS [  6.480 s]
[INFO] Apache CXF Uncategorized System Tests .............. SUCCESS [ 21.347 s]
[INFO] Apache CXF Transport System Tests .................. SUCCESS [  7.818 s]
[INFO] Apache CXF Transport SSL3 System Tests ............. SUCCESS [  3.363 s]
[INFO] Apache CXF Transport System Tests JMS .............. SUCCESS [  8.921 s]
[INFO] Apache CXF Undertow Transport System Tests ......... SUCCESS [  3.885 s]
[INFO] Apache CXF JAX-WS System Tests ..................... SUCCESS [ 12.919 s]
[INFO] Apache CXF Databinding System Tests ................ SUCCESS [ 13.977 s]
[INFO] Apache CXF JAX-RS System Tests ..................... SUCCESS [ 40.890 s]
[INFO] Apache CXF WS-* Specifications System Tests ........ SUCCESS [ 16.434 s]
[INFO] Apache CXF WS-RM Specifications System Tests ....... SUCCESS [ 10.513 s]
[INFO] Apache CXF WS-Security System Tests ................ SUCCESS [ 16.962 s]
[INFO] Apache CXF WS-Security Interop System Tests ........ SUCCESS [  9.418 s]
[INFO] Apache CXF Kerberos Integration System Tests ....... SUCCESS [ 16.877 s]
[INFO] Apache CXF JAX-RS System Advanced Security Tests ... SUCCESS [ 11.696 s]
[INFO] Test for writing wsdl to repo ...................... SUCCESS [  5.757 s]
[INFO] Test for generating code from wsdl in repo ......... SUCCESS [  7.132 s]
[INFO] Apache CXF System Tests ............................ SUCCESS [  0.144 s]
[INFO] Apache CXF System Tests for Maven Plugins .......... SUCCESS [  0.145 s]
[INFO] Apache CXF CDI Integration System Tests ............ SUCCESS [ 14.211 s]
[INFO] Apache CXF Servlet Container Initializer Integration System Tests SUCCESS [  3.806
s]
[INFO] Apache CXF Distributed Tracing Integration System Tests SKIPPED
[INFO] Apache CXF JiBX Integration System Tests ........... SUCCESS [  0.377 s]
[INFO] Apache CXF JAX-RS JiBX System Tests ................ SUCCESS [  5.345 s]
[INFO] Apache CXF Data Binding JiBX System Tests .......... SUCCESS [ 11.636 s]
[INFO] ------------------------------------------------------------------------
[INFO] BUILD FAILURE
[INFO] ------------------------------------------------------------------------
[INFO] Total time: 27:51 min
[INFO] Finished at: 2016-05-16T17:54:10+00:00
[INFO] Final Memory: 280M/592M
[INFO] ------------------------------------------------------------------------
Waiting for Jenkins to finish collecting data
[ERROR] Failed to execute goal org.apache.maven.plugins:maven-compiler-plugin:3.3:compile
(default-compile) on project cxf-integration-tracing-htrace: Compilation failure: Compilation
failure:
[ERROR] <https://analysis.apache.org/jenkins/job/cxf-trunk/ws/integration/tracing/tracing-htrace/src/main/java/org/apache/cxf/jaxrs/tracing/htrace/HTraceTracerContext.java>:[26,25]
cannot find symbol
[ERROR] symbol:   class Sampler
[ERROR] location: package org.apache.htrace
[ERROR] <https://analysis.apache.org/jenkins/job/cxf-trunk/ws/integration/tracing/tracing-htrace/src/main/java/org/apache/cxf/jaxrs/tracing/htrace/HTraceTracerContext.java>:[27,25]
cannot find symbol
[ERROR] symbol:   class Trace
[ERROR] location: package org.apache.htrace
[ERROR] <https://analysis.apache.org/jenkins/job/cxf-trunk/ws/integration/tracing/tracing-htrace/src/main/java/org/apache/cxf/jaxrs/tracing/htrace/HTraceTracerContext.java>:[28,25]
cannot find symbol
[ERROR] symbol:   class TraceScope
[ERROR] location: package org.apache.htrace
[ERROR] <https://analysis.apache.org/jenkins/job/cxf-trunk/ws/integration/tracing/tracing-htrace/src/main/java/org/apache/cxf/jaxrs/tracing/htrace/HTraceTracerContext.java>:[29,34]
package org.apache.htrace.wrappers does not exist
[ERROR] <https://analysis.apache.org/jenkins/job/cxf-trunk/ws/integration/tracing/tracing-htrace/src/main/java/org/apache/cxf/jaxrs/tracing/htrace/HTraceTracerContext.java>:[32,19]
cannot find symbol
[ERROR] symbol:   class Sampler
[ERROR] location: class org.apache.cxf.jaxrs.tracing.htrace.HTraceTracerContext
[ERROR] <https://analysis.apache.org/jenkins/job/cxf-trunk/ws/integration/tracing/tracing-htrace/src/main/java/org/apache/cxf/jaxrs/tracing/htrace/HTraceTracerContext.java>:[34,38]
cannot find symbol
[ERROR] symbol:   class Sampler
[ERROR] location: class org.apache.cxf.jaxrs.tracing.htrace.HTraceTracerContext
[ERROR] <https://analysis.apache.org/jenkins/job/cxf-trunk/ws/integration/tracing/tracing-htrace/src/main/java/org/apache/cxf/jaxrs/tracing/htrace/HTraceTracerContext.java>:[40,12]
cannot find symbol
[ERROR] symbol:   class TraceScope
[ERROR] location: class org.apache.cxf.jaxrs.tracing.htrace.HTraceTracerContext
Sending e-mails to: notifications@cxf.apache.org
[ERROR] <https://analysis.apache.org/jenkins/job/cxf-trunk/ws/integration/tracing/tracing-htrace/src/main/java/org/apache/cxf/jaxrs/tracing/htrace/HTraceContextProvider.java>:[26,25]
cannot find symbol
[ERROR] symbol:   class Sampler
[ERROR] location: package org.apache.htrace
[ERROR] <https://analysis.apache.org/jenkins/job/cxf-trunk/ws/integration/tracing/tracing-htrace/src/main/java/org/apache/cxf/jaxrs/tracing/htrace/HTraceContextProvider.java>:[27,30]
package org.apache.htrace.impl does not exist
[ERROR] <https://analysis.apache.org/jenkins/job/cxf-trunk/ws/integration/tracing/tracing-htrace/src/main/java/org/apache/cxf/jaxrs/tracing/htrace/HTraceContextProvider.java>:[31,13]
cannot find symbol
[ERROR] symbol:   class Sampler
[ERROR] location: class org.apache.cxf.jaxrs.tracing.htrace.HTraceContextProvider
[ERROR] <https://analysis.apache.org/jenkins/job/cxf-trunk/ws/integration/tracing/tracing-htrace/src/main/java/org/apache/cxf/jaxrs/tracing/htrace/HTraceContextProvider.java>:[33,40]
cannot find symbol
[ERROR] symbol:   class Sampler
[ERROR] location: class org.apache.cxf.jaxrs.tracing.htrace.HTraceContextProvider
[ERROR] <https://analysis.apache.org/jenkins/job/cxf-trunk/ws/integration/tracing/tracing-htrace/src/main/java/org/apache/cxf/jaxrs/tracing/htrace/HTraceFeature.java>:[27,25]
cannot find symbol
[ERROR] symbol:   class HTraceConfiguration
[ERROR] location: package org.apache.htrace
[ERROR] <https://analysis.apache.org/jenkins/job/cxf-trunk/ws/integration/tracing/tracing-htrace/src/main/java/org/apache/cxf/jaxrs/tracing/htrace/HTraceFeature.java>:[28,25]
cannot find symbol
[ERROR] symbol:   class Sampler
[ERROR] location: package org.apache.htrace
[ERROR] <https://analysis.apache.org/jenkins/job/cxf-trunk/ws/integration/tracing/tracing-htrace/src/main/java/org/apache/cxf/jaxrs/tracing/htrace/HTraceFeature.java>:[29,25]
cannot find symbol
[ERROR] symbol:   class SamplerBuilder
[ERROR] location: package org.apache.htrace
[ERROR] <https://analysis.apache.org/jenkins/job/cxf-trunk/ws/integration/tracing/tracing-htrace/src/main/java/org/apache/cxf/jaxrs/tracing/htrace/HTraceFeature.java>:[30,25]
cannot find symbol
[ERROR] symbol:   class SpanReceiver
[ERROR] location: package org.apache.htrace
[ERROR] <https://analysis.apache.org/jenkins/job/cxf-trunk/ws/integration/tracing/tracing-htrace/src/main/java/org/apache/cxf/jaxrs/tracing/htrace/HTraceFeature.java>:[31,25]
cannot find symbol
[ERROR] symbol:   class SpanReceiverBuilder
[ERROR] location: package org.apache.htrace
[ERROR] <https://analysis.apache.org/jenkins/job/cxf-trunk/ws/integration/tracing/tracing-htrace/src/main/java/org/apache/cxf/jaxrs/tracing/htrace/HTraceFeature.java>:[32,25]
cannot find symbol
[ERROR] symbol:   class Trace
[ERROR] location: package org.apache.htrace
[ERROR] <https://analysis.apache.org/jenkins/job/cxf-trunk/ws/integration/tracing/tracing-htrace/src/main/java/org/apache/cxf/jaxrs/tracing/htrace/HTraceFeature.java>:[35,13]
cannot find symbol
[ERROR] symbol:   class HTraceConfiguration
[ERROR] location: class org.apache.cxf.jaxrs.tracing.htrace.HTraceFeature
[ERROR] <https://analysis.apache.org/jenkins/job/cxf-trunk/ws/integration/tracing/tracing-htrace/src/main/java/org/apache/cxf/jaxrs/tracing/htrace/HTraceFeature.java>:[41,32]
cannot find symbol
[ERROR] symbol:   class HTraceConfiguration
[ERROR] location: class org.apache.cxf.jaxrs.tracing.htrace.HTraceFeature
[ERROR] <https://analysis.apache.org/jenkins/job/cxf-trunk/ws/integration/tracing/tracing-htrace/src/main/java/org/apache/cxf/jaxrs/tracing/htrace/HTraceFeature.java>:[64,40]
cannot find symbol
[ERROR] symbol:   class HTraceConfiguration
[ERROR] location: class org.apache.cxf.jaxrs.tracing.htrace.HTraceFeature
[ERROR] <https://analysis.apache.org/jenkins/job/cxf-trunk/ws/integration/tracing/tracing-htrace/src/main/java/org/apache/cxf/jaxrs/tracing/htrace/HTraceFeature.java>:[68,12]
cannot find symbol
[ERROR] symbol:   class HTraceConfiguration
[ERROR] location: class org.apache.cxf.jaxrs.tracing.htrace.HTraceFeature
[ERROR] <https://analysis.apache.org/jenkins/job/cxf-trunk/ws/integration/tracing/tracing-htrace/src/main/java/org/apache/cxf/jaxrs/tracing/htrace/HTraceProvider.java>:[33,25]
cannot find symbol
[ERROR] symbol:   class Sampler
[ERROR] location: package org.apache.htrace
[ERROR] <https://analysis.apache.org/jenkins/job/cxf-trunk/ws/integration/tracing/tracing-htrace/src/main/java/org/apache/cxf/jaxrs/tracing/htrace/HTraceProvider.java>:[34,25]
cannot find symbol
[ERROR] symbol:   class Trace
[ERROR] location: package org.apache.htrace
[ERROR] <https://analysis.apache.org/jenkins/job/cxf-trunk/ws/integration/tracing/tracing-htrace/src/main/java/org/apache/cxf/jaxrs/tracing/htrace/HTraceProvider.java>:[35,25]
cannot find symbol
[ERROR] symbol:   class TraceInfo
[ERROR] location: package org.apache.htrace
[ERROR] <https://analysis.apache.org/jenkins/job/cxf-trunk/ws/integration/tracing/tracing-htrace/src/main/java/org/apache/cxf/jaxrs/tracing/htrace/HTraceProvider.java>:[36,25]
cannot find symbol
[ERROR] symbol:   class TraceScope
[ERROR] location: package org.apache.htrace
[ERROR] <https://analysis.apache.org/jenkins/job/cxf-trunk/ws/integration/tracing/tracing-htrace/src/main/java/org/apache/cxf/jaxrs/tracing/htrace/HTraceProvider.java>:[37,25]
cannot find symbol
[ERROR] symbol:   class Tracer
[ERROR] location: package org.apache.htrace
[ERROR] <https://analysis.apache.org/jenkins/job/cxf-trunk/ws/integration/tracing/tracing-htrace/src/main/java/org/apache/cxf/jaxrs/tracing/htrace/HTraceProvider.java>:[38,30]
package org.apache.htrace.impl does not exist
[ERROR] <https://analysis.apache.org/jenkins/job/cxf-trunk/ws/integration/tracing/tracing-htrace/src/main/java/org/apache/cxf/jaxrs/tracing/htrace/HTraceProvider.java>:[48,19]
cannot find symbol
[ERROR] symbol:   class Sampler
[ERROR] location: class org.apache.cxf.jaxrs.tracing.htrace.HTraceProvider
[ERROR] <https://analysis.apache.org/jenkins/job/cxf-trunk/ws/integration/tracing/tracing-htrace/src/main/java/org/apache/cxf/jaxrs/tracing/htrace/HTraceProvider.java>:[54,33]
cannot find symbol
[ERROR] symbol:   class Sampler
[ERROR] location: class org.apache.cxf.jaxrs.tracing.htrace.HTraceProvider
[ERROR] <https://analysis.apache.org/jenkins/job/cxf-trunk/ws/integration/tracing/tracing-htrace/src/main/java/org/apache/cxf/jaxrs/tracing/htrace/HTraceProvider.java>:[41,1]
cannot find symbol
[ERROR] symbol:   static HEADER_TRACE_ID
[ERROR] location: class
[ERROR] <https://analysis.apache.org/jenkins/job/cxf-trunk/ws/integration/tracing/tracing-htrace/src/main/java/org/apache/cxf/jaxrs/tracing/htrace/HTraceTracerContext.java>:[31,8]
org.apache.cxf.jaxrs.tracing.htrace.HTraceTracerContext is not abstract and does not override
abstract method <T>continueSpan(org.apache.cxf.tracing.Traceable<T>) in org.apache.cxf.tracing.TracerContext
[ERROR] <https://analysis.apache.org/jenkins/job/cxf-trunk/ws/integration/tracing/tracing-htrace/src/main/java/org/apache/cxf/jaxrs/tracing/htrace/HTraceTracerContext.java>:[41,16]
cannot find symbol
[ERROR] symbol:   variable Trace
[ERROR] location: class org.apache.cxf.jaxrs.tracing.htrace.HTraceTracerContext
[ERROR] <https://analysis.apache.org/jenkins/job/cxf-trunk/ws/integration/tracing/tracing-htrace/src/main/java/org/apache/cxf/jaxrs/tracing/htrace/HTraceTracerContext.java>:[55,13]
cannot find symbol
[ERROR] symbol:   variable Trace
[ERROR] location: class org.apache.cxf.jaxrs.tracing.htrace.HTraceTracerContext
[ERROR] <https://analysis.apache.org/jenkins/job/cxf-trunk/ws/integration/tracing/tracing-htrace/src/main/java/org/apache/cxf/jaxrs/tracing/htrace/HTraceTracerContext.java>:[56,24]
cannot find symbol
[ERROR] symbol:   class TraceCallable
[ERROR] location: class org.apache.cxf.jaxrs.tracing.htrace.HTraceTracerContext
[ERROR] <https://analysis.apache.org/jenkins/job/cxf-trunk/ws/integration/tracing/tracing-htrace/src/main/java/org/apache/cxf/jaxrs/tracing/htrace/HTraceTracerContext.java>:[56,41]
cannot find symbol
[ERROR] symbol:   variable Trace
[ERROR] location: class org.apache.cxf.jaxrs.tracing.htrace.HTraceTracerContext
[ERROR] <https://analysis.apache.org/jenkins/job/cxf-trunk/ws/integration/tracing/tracing-htrace/src/main/java/org/apache/cxf/jaxrs/tracing/htrace/HTraceTracerContext.java>:[62,5]
method does not override or implement a method from a supertype
[ERROR] <https://analysis.apache.org/jenkins/job/cxf-trunk/ws/integration/tracing/tracing-htrace/src/main/java/org/apache/cxf/jaxrs/tracing/htrace/HTraceTracerContext.java>:[64,9]
cannot find symbol
[ERROR] symbol:   variable Trace
[ERROR] location: class org.apache.cxf.jaxrs.tracing.htrace.HTraceTracerContext
[ERROR] <https://analysis.apache.org/jenkins/job/cxf-trunk/ws/integration/tracing/tracing-htrace/src/main/java/org/apache/cxf/jaxrs/tracing/htrace/HTraceTracerContext.java>:[75,9]
cannot find symbol
[ERROR] symbol:   variable Trace
[ERROR] location: class org.apache.cxf.jaxrs.tracing.htrace.HTraceTracerContext
[ERROR] <https://analysis.apache.org/jenkins/job/cxf-trunk/ws/integration/tracing/tracing-htrace/src/main/java/org/apache/cxf/jaxrs/tracing/htrace/HTraceContextProvider.java>:[31,36]
cannot find symbol
[ERROR] symbol:   variable NeverSampler
[ERROR] location: class org.apache.cxf.jaxrs.tracing.htrace.HTraceContextProvider
[ERROR] <https://analysis.apache.org/jenkins/job/cxf-trunk/ws/integration/tracing/tracing-htrace/src/main/java/org/apache/cxf/jaxrs/tracing/htrace/HTraceFeature.java>:[38,14]
cannot find symbol
[ERROR] symbol:   variable HTraceConfiguration
[ERROR] location: class org.apache.cxf.jaxrs.tracing.htrace.HTraceFeature
[ERROR] <https://analysis.apache.org/jenkins/job/cxf-trunk/ws/integration/tracing/tracing-htrace/src/main/java/org/apache/cxf/jaxrs/tracing/htrace/HTraceFeature.java>:[51,15]
cannot find symbol
[ERROR] symbol:   class Sampler
[ERROR] location: class org.apache.cxf.jaxrs.tracing.htrace.HTraceFeature
[ERROR] <https://analysis.apache.org/jenkins/job/cxf-trunk/ws/integration/tracing/tracing-htrace/src/main/java/org/apache/cxf/jaxrs/tracing/htrace/HTraceFeature.java>:[51,42]
cannot find symbol
[ERROR] symbol:   class SamplerBuilder
[ERROR] location: class org.apache.cxf.jaxrs.tracing.htrace.HTraceFeature
[ERROR] <https://analysis.apache.org/jenkins/job/cxf-trunk/ws/integration/tracing/tracing-htrace/src/main/java/org/apache/cxf/jaxrs/tracing/htrace/HTraceFeature.java>:[52,15]
cannot find symbol
[ERROR] symbol:   class SpanReceiver
[ERROR] location: class org.apache.cxf.jaxrs.tracing.htrace.HTraceFeature
[ERROR] <https://analysis.apache.org/jenkins/job/cxf-trunk/ws/integration/tracing/tracing-htrace/src/main/java/org/apache/cxf/jaxrs/tracing/htrace/HTraceFeature.java>:[52,47]
cannot find symbol
[ERROR] symbol:   class SpanReceiverBuilder
[ERROR] location: class org.apache.cxf.jaxrs.tracing.htrace.HTraceFeature
[ERROR] <https://analysis.apache.org/jenkins/job/cxf-trunk/ws/integration/tracing/tracing-htrace/src/main/java/org/apache/cxf/jaxrs/tracing/htrace/HTraceFeature.java>:[55,13]
cannot find symbol
[ERROR] symbol:   variable Trace
[ERROR] location: class org.apache.cxf.jaxrs.tracing.htrace.HTraceFeature
[ERROR] <https://analysis.apache.org/jenkins/job/cxf-trunk/ws/integration/tracing/tracing-htrace/src/main/java/org/apache/cxf/jaxrs/tracing/htrace/HTraceProvider.java>:[51,14]
cannot find symbol
[ERROR] symbol:   variable NeverSampler
[ERROR] location: class org.apache.cxf.jaxrs.tracing.htrace.HTraceProvider
[ERROR] <https://analysis.apache.org/jenkins/job/cxf-trunk/ws/integration/tracing/tracing-htrace/src/main/java/org/apache/cxf/jaxrs/tracing/htrace/HTraceProvider.java>:[64,62]
cannot find symbol
[ERROR] symbol:   variable HEADER_TRACE_ID
[ERROR] location: class org.apache.cxf.jaxrs.tracing.htrace.HTraceProvider
[ERROR] <https://analysis.apache.org/jenkins/job/cxf-trunk/ws/integration/tracing/tracing-htrace/src/main/java/org/apache/cxf/jaxrs/tracing/htrace/HTraceProvider.java>:[65,19]
package Tracer does not exist
[ERROR] <https://analysis.apache.org/jenkins/job/cxf-trunk/ws/integration/tracing/tracing-htrace/src/main/java/org/apache/cxf/jaxrs/tracing/htrace/HTraceProvider.java>:[69,19]
package Tracer does not exist
[ERROR] <https://analysis.apache.org/jenkins/job/cxf-trunk/ws/integration/tracing/tracing-htrace/src/main/java/org/apache/cxf/jaxrs/tracing/htrace/HTraceProvider.java>:[71,30]
package Tracer does not exist
[ERROR] <https://analysis.apache.org/jenkins/job/cxf-trunk/ws/integration/tracing/tracing-htrace/src/main/java/org/apache/cxf/jaxrs/tracing/htrace/HTraceProvider.java>:[71,69]
package Tracer does not exist
[ERROR] <https://analysis.apache.org/jenkins/job/cxf-trunk/ws/integration/tracing/tracing-htrace/src/main/java/org/apache/cxf/jaxrs/tracing/htrace/HTraceProvider.java>:[73,18]
cannot find symbol
[ERROR] symbol:   class Sampler
[ERROR] location: class org.apache.cxf.jaxrs.tracing.htrace.HTraceProvider
[ERROR] <https://analysis.apache.org/jenkins/job/cxf-trunk/ws/integration/tracing/tracing-htrace/src/main/java/org/apache/cxf/jaxrs/tracing/htrace/HTraceProvider.java>:[73,27]
cannot find symbol
[ERROR] symbol:   class TraceInfo
[ERROR] location: class org.apache.cxf.jaxrs.tracing.htrace.HTraceProvider
[ERROR] <https://analysis.apache.org/jenkins/job/cxf-trunk/ws/integration/tracing/tracing-htrace/src/main/java/org/apache/cxf/jaxrs/tracing/htrace/HTraceProvider.java>:[73,52]
cannot find symbol
[ERROR] symbol:   class TraceInfo
[ERROR] location: class org.apache.cxf.jaxrs.tracing.htrace.HTraceProvider
[ERROR] <https://analysis.apache.org/jenkins/job/cxf-trunk/ws/integration/tracing/tracing-htrace/src/main/java/org/apache/cxf/jaxrs/tracing/htrace/HTraceProvider.java>:[72,52]
cannot find symbol
[ERROR] symbol:   variable Trace
[ERROR] location: class org.apache.cxf.jaxrs.tracing.htrace.HTraceProvider
[ERROR] <https://analysis.apache.org/jenkins/job/cxf-trunk/ws/integration/tracing/tracing-htrace/src/main/java/org/apache/cxf/jaxrs/tracing/htrace/HTraceProvider.java>:[83,33]
cannot find symbol
[ERROR] symbol:   variable HEADER_TRACE_ID
[ERROR] location: class org.apache.cxf.jaxrs.tracing.htrace.HTraceProvider
[ERROR] <https://analysis.apache.org/jenkins/job/cxf-trunk/ws/integration/tracing/tracing-htrace/src/main/java/org/apache/cxf/jaxrs/tracing/htrace/HTraceProvider.java>:[84,46]
cannot find symbol
[ERROR] symbol:   variable HEADER_TRACE_ID
[ERROR] location: class org.apache.cxf.jaxrs.tracing.htrace.HTraceProvider
[ERROR] <https://analysis.apache.org/jenkins/job/cxf-trunk/ws/integration/tracing/tracing-htrace/src/main/java/org/apache/cxf/jaxrs/tracing/htrace/HTraceProvider.java>:[84,80]
cannot find symbol
[ERROR] symbol:   variable HEADER_TRACE_ID
[ERROR] location: class org.apache.cxf.jaxrs.tracing.htrace.HTraceProvider
[ERROR] <https://analysis.apache.org/jenkins/job/cxf-trunk/ws/integration/tracing/tracing-htrace/src/main/java/org/apache/cxf/jaxrs/tracing/htrace/HTraceProvider.java>:[89,30]
cannot find symbol
[ERROR] symbol:   class TraceScope
[ERROR] location: class org.apache.cxf.jaxrs.tracing.htrace.HTraceProvider
[ERROR] <https://analysis.apache.org/jenkins/job/cxf-trunk/ws/integration/tracing/tracing-htrace/src/main/java/org/apache/cxf/jaxrs/tracing/htrace/HTraceProvider.java>:[90,19]
cannot find symbol
[ERROR] symbol:   class TraceScope
[ERROR] location: class org.apache.cxf.jaxrs.tracing.htrace.HTraceProvider
[ERROR] <https://analysis.apache.org/jenkins/job/cxf-trunk/ws/integration/tracing/tracing-htrace/src/main/java/org/apache/cxf/jaxrs/tracing/htrace/HTraceProvider.java>:[90,38]
cannot find symbol
[ERROR] symbol:   class TraceScope
[ERROR] location: class org.apache.cxf.jaxrs.tracing.htrace.HTraceProvider
[ERROR] -> [Help 1]
[ERROR] 
[ERROR] To see the full stack trace of the errors, re-run Maven with the -e switch.
[ERROR] Re-run Maven using the -X switch to enable full debug logging.
[ERROR] 
[ERROR] For more information about the errors and possible solutions, please read the following
articles:
[ERROR] [Help 1] http://cwiki.apache.org/confluence/display/MAVEN/MojoFailureException
[ERROR] 
[ERROR] After correcting the problems, you can resume the build with the command
[ERROR]   mvn <goals> -rf :cxf-integration-tracing-htrace
channel stopped
Skipping sonar analysis due to bad build status FAILURE

Mime
View raw message