cxf-notifications mailing list archives

Site index · List index
Message view « Date » · « Thread »
Top « Date » · « Thread »
From Apache Jenkins Server <jenk...@builds.apache.org>
Subject Build failed in Jenkins: CXF-3.1-deploy #98
Date Wed, 16 Mar 2016 07:39:03 GMT
See <https://builds.apache.org/job/CXF-3.1-deploy/98/changes>

Changes:

[freeman.fang] [CXF-6831]should be able to configure the certStore key type

[coheigea] Updating Weld version due to CVE-2014-8122

------------------------------------------
[...truncated 33016 lines...]
[INFO] Apache CXF Runtime UDP Transport ................... SUCCESS [  4.046 s]
[INFO] Apache CXF Runtime WebSocket Transport ............. SUCCESS [ 11.603 s]
[INFO] Apache CXF Runtime ................................. SUCCESS [  0.537 s]
[INFO] Apache CXF Transports Runtime ...................... SUCCESS [  0.762 s]
[INFO] Apache CXF Runtime JiBX DataBinding ................ SUCCESS [  7.075 s]
[INFO] Apache CXF Databinding Runtime ..................... SUCCESS [  0.669 s]
[INFO] Apache CXF Runtime Object Binding .................. SUCCESS [  6.208 s]
[INFO] Apache CXF Runtime Colocated Binding ............... SUCCESS [  4.584 s]
[INFO] Apache CXF Runtime Bindings ........................ SUCCESS [  1.591 s]
[INFO] Apache CXF Runtime Clustering ...................... SUCCESS [  4.295 s]
[INFO] Apache CXF JAX-RS Client ........................... SUCCESS [  8.347 s]
[INFO] Apache CXF Advanced Logging Feature ................ SUCCESS [  6.147 s]
[INFO] Apache CXF Metrics Feature ......................... SUCCESS [  4.658 s]
[INFO] Apache CXF Throttling Feature ...................... SUCCESS [  3.442 s]
[INFO] Apache CXF Features Runtime ........................ SUCCESS [  1.003 s]
[INFO] Apache CXF Runtime JavaScript Frontend ............. SUCCESS [  4.690 s]
[INFO] Apache CXF Frontend Runtime ........................ SUCCESS [  4.994 s]
[INFO] Apache CXF Runtime Security functionality .......... SUCCESS [  7.176 s]
[INFO] Apache CXF Runtime SAML Security functionality ..... SUCCESS [ 11.495 s]
[INFO] Apache CXF Runtime WS MetadataExchange ............. SUCCESS [  3.892 s]
[INFO] Apache CXF Runtime WS Security ..................... SUCCESS [ 12.612 s]
[INFO] Apache CXF Runtime WS Reliable Messaging ........... SUCCESS [ 10.122 s]
[INFO] Apache CXF Runtime WS Eventing ..................... SUCCESS [  6.933 s]
[INFO] Apache CXF Web Services Runtime .................... SUCCESS [  0.765 s]
[INFO] Apache CXF JAX-RS Servlet Container Initializer .... SUCCESS [  3.002 s]
[INFO] Apache CXF JAX-RS Extensions: Search ............... SUCCESS [ 28.453 s]
[INFO] Apache CXF RS XML Security ......................... SUCCESS [  5.969 s]
[INFO] Apache CXF Runtime JOSE Core ....................... SUCCESS [  9.640 s]
[INFO] Apache CXF Runtime JOSE JAX-RS ..................... SUCCESS [  8.127 s]
[INFO] Apache CXF Rest Runtime ............................ SUCCESS [  0.941 s]
[INFO] Apache CXF Rest Security Runtime ................... SUCCESS [  0.527 s]
[INFO] Apache CXF JOSE Security parent .................... SUCCESS [  0.680 s]
[INFO] Apache CXF Runtime RS Security OAuth Parent ........ SUCCESS [  0.711 s]
[INFO] Apache CXF Runtime OAuth 1.0a ...................... SUCCESS [  5.605 s]
[INFO] Apache CXF Runtime OAuth 2.0 ....................... SUCCESS [ 10.571 s]
[INFO] Apache CXF Runtime OAuth 2.0 SAML .................. SUCCESS [  6.358 s]
[INFO] Apache CXF RS SSO SAML ............................. SUCCESS [  9.224 s]
[INFO] Apache CXF Runtime OpenId Connect .................. SUCCESS [  4.868 s]
[INFO] Apache CXF RS Cross-Origin Resource Sharing ........ SUCCESS [  5.844 s]
[INFO] Apache CXF Runtime Web Management .................. SUCCESS [ 31.947 s]
[INFO] Apache CXF Runtime JavaScript Client Generator Tests SUCCESS [  4.824 s]
[INFO] Apache CXF JCA Connection .......................... SUCCESS [  8.589 s]
[INFO] Apache CXF CDI Integration ......................... SUCCESS [  6.057 s]
[INFO] Apache CXF Distributed Tracing using Apache HTrace . SUCCESS [  8.691 s]
[INFO] Apache CXF Integration ............................. SUCCESS [  0.796 s]
[INFO] Apache CXF Java2WS Maven2 Plugin ................... SUCCESS [  3.854 s]
[INFO] Apache CXF Java2WADL Maven2 Plugin ................. SUCCESS [  7.255 s]
[INFO] Apache CXF WADL2Java Code Generation Maven2 Plugin . SUCCESS [  5.198 s]
[INFO] Apache CXF CORBA Tools Maven2 Plugins .............. SUCCESS [  5.667 s]
[INFO] Apache CXF Archetype - Simple JAX-WS Java First .... SUCCESS [  5.723 s]
[INFO] Apache CXF Archetype - Simple JAX-RS webapp ........ SUCCESS [  3.867 s]
[INFO] Apache CXF Maven Archetypes ........................ SUCCESS [  0.793 s]
[INFO] Apache CXF STS Core ................................ SUCCESS [ 11.112 s]
[INFO] Apache CXF STS war deployment ...................... SUCCESS [ 13.872 s]
[INFO] Apache CXF STS basic systests ...................... SUCCESS [  8.695 s]
[INFO] Apache CXF STS advanced systests ................... SUCCESS [  6.796 s]
[INFO] Apache CXF STS test OSGi deployment ................ SUCCESS [  4.158 s]
[INFO] Apache CXF STS test Karaf Features ................. SUCCESS [  1.048 s]
[INFO] Apache CXF Karaf Parent ............................ SUCCESS [  0.316 s]
[INFO] Apache CXF Karaf Features .......................... SUCCESS [  3.758 s]
[INFO] Apache CXF Karaf Commands .......................... SUCCESS [  4.062 s]
[INFO] Apache CXF STS Integration Tests ................... SUCCESS [ 13.138 s]
[INFO] Apache CXF Services ................................ SUCCESS [  1.039 s]
[INFO] Apache CXF STS service ............................. SUCCESS [  0.577 s]
[INFO] Apache CXF STS systests ............................ SUCCESS [  0.338 s]
[INFO] Apache CXF WSN API ................................. SUCCESS [ 12.682 s]
[INFO] Apache CXF WSN Core ................................ SUCCESS [  6.268 s]
[INFO] Apache CXF WSN OSGi ................................ SUCCESS [  3.188 s]
[INFO] Apache CXF WSN service ............................. SUCCESS [  0.463 s]
[INFO] Apache CXF WS-Discovery API ........................ SUCCESS [  7.529 s]
[INFO] Apache CXF WS-Discovery Service .................... SUCCESS [  1.209 s]
[INFO] Apache CXF WS-Discovery ............................ SUCCESS [  2.928 s]
[INFO] Apache CXF XKMS Common ............................. SUCCESS [ 12.227 s]
[INFO] Apache CXF XKMS X509 Handlers ...................... SUCCESS [  8.130 s]
[INFO] Apache CXF XKMS Service ............................ SUCCESS [  3.534 s]
[INFO] Apache CXF XKMS Client ............................. SUCCESS [  3.967 s]
[INFO] Apache CXF XKMS Karaf Features ..................... SUCCESS [  7.209 s]
[INFO] Apache CXF XKMS OSGi deployment .................... SUCCESS [  3.993 s]
[INFO] Apache CXF XKMS LDAP repository .................... SUCCESS [  4.356 s]
[INFO] Apache CXF XKMS Service war deployment ............. SUCCESS [ 10.514 s]
[INFO] Apache CXF XKMS Integration Tests .................. SUCCESS [  2.986 s]
[INFO] Apache CXF XKMS .................................... SUCCESS [  1.074 s]
[INFO] Apache CXF Bundle Parent ........................... SUCCESS [  2.587 s]
[INFO] Apache CXF Compatibility Bundle Jar ................ SUCCESS [  2.129 s]
[INFO] Apache CXF :: OSGi :: Integration Tests ............ SUCCESS [ 23.150 s]
[INFO] Apache CXF :: OSGi :: Integration Tests pure felix . SUCCESS [  8.728 s]
[INFO] Apache CXF OSGi parent ............................. SUCCESS [  0.742 s]
[INFO] Apache CXF Container Integration System Tests ...... SUCCESS [  1.377 s]
[INFO] Apache CXF Container Integration Test Webapp ....... SUCCESS [ 11.869 s]
[INFO] Apache CXF Container Integration Test Grizzly ...... SUCCESS [ 34.539 s]
[INFO] Apache CXF Uncategorized System Tests .............. SUCCESS [ 10.907 s]
[INFO] Apache CXF Transport System Tests .................. SUCCESS [  3.558 s]
[INFO] Apache CXF Transport SSL3 System Tests ............. SUCCESS [  1.456 s]
[INFO] Apache CXF Transport System Tests JMS .............. SUCCESS [  5.333 s]
[INFO] Apache CXF JAX-WS System Tests ..................... SUCCESS [  9.070 s]
[INFO] Apache CXF Databinding System Tests ................ SUCCESS [  8.757 s]
[INFO] Apache CXF JAX-RS System Tests ..................... SUCCESS [ 10.997 s]
[INFO] Apache CXF WS-* Specifications System Tests ........ SUCCESS [  5.970 s]
[INFO] Apache CXF WS-RM Specifications System Tests ....... SUCCESS [  4.660 s]
[INFO] Apache CXF WS-Security System Tests ................ SUCCESS [ 10.076 s]
[INFO] Apache CXF WS-Security Interop System Tests ........ SUCCESS [  6.799 s]
[INFO] Apache CXF Kerberos Integration System Tests ....... SUCCESS [ 14.669 s]
[INFO] Apache CXF JAX-RS System Advanced Security Tests ... SUCCESS [  6.380 s]
[INFO] Test for writing wsdl to repo ...................... SUCCESS [  5.127 s]
[INFO] Test for generating code from wsdl in repo ......... SUCCESS [  7.557 s]
[INFO] Apache CXF System Tests ............................ SUCCESS [  0.830 s]
[INFO] Apache CXF System Tests for Maven Plugins .......... SUCCESS [  2.290 s]
[INFO] Apache CXF CDI Integration System Tests ............ SUCCESS [  4.755 s]
[INFO] Apache CXF Servlet Container Initializer Integration System Tests SUCCESS [  2.346
s]
[INFO] Apache CXF Distributed Tracing Integration System Tests SUCCESS [  2.442 s]
[INFO] Apache CXF JiBX Integration System Tests ........... SUCCESS [  0.610 s]
[INFO] Apache CXF JAX-RS JiBX System Tests ................ SUCCESS [ 10.993 s]
[INFO] Apache CXF Data Binding JiBX System Tests .......... SUCCESS [  8.044 s]
[INFO] Apache CXF Manifest Jar ............................ SUCCESS [  3.438 s]
[INFO] Apache CXF JavaDoc ................................. SUCCESS [02:19 min]
[INFO] Apache CXF Samples ................................. SUCCESS [  1.049 s]
[INFO] Colocated Demo using Document/Literal Style ........ SUCCESS [  5.368 s]
[INFO] JavaScript Client Demo using Document/Literal Style  FAILURE [  0.014 s]
[INFO] Generated JavaScript Sample using JAX-WS and JSR-181 SKIPPED
[INFO] Java First demo service using the JAXWSFactoryBeans  SKIPPED
[INFO] Java First demo using JMS .......................... SKIPPED
[INFO] JAX-RS Content Negotiation Demo .................... SKIPPED
[INFO] JAX-RS Basic Demo With HTTPS communications ........ SKIPPED
[INFO] JAX-RS Basic Demo .................................. SKIPPED
[INFO] JAX-RS WebSocket Demo .............................. SKIPPED
[INFO] JAX-RS Basic Demo .................................. SKIPPED
[INFO] JAX-RS Swagger Demo ................................ SKIPPED
[INFO] JAX-RS Swagger2 Demo ............................... SKIPPED
[INFO] JAX-RS Swagger2 WebApp Demo ........................ SKIPPED
[INFO] CXF JAX-RS Swagger2 Blueprint Demo ................. SKIPPED
[INFO] JAX-RS Basic Oidc Demo ............................. SKIPPED
[INFO] JAX-RS Big Query Demo .............................. SKIPPED
[INFO] CXF sample using a callback object ................. SKIPPED
[INFO] WSDL first demo using BARE Style in XML Binding (pure XML over HTTP) SKIPPED
[INFO] JAX-WS Dispatch/Provider Demo ...................... SKIPPED
[INFO] WSDL first demo using Document/Literal Style and XMLBeans DataBinding SKIPPED
[INFO] WSDL first demo using SOAP12 in Document/Literal Style SKIPPED
[INFO] CXF Dynamic Client Sample .......................... SKIPPED
[INFO] JMS Transport Queue Demo using Document-Literal Style SKIPPED
[INFO] WSDL first demo using the jms transport and jmsConfigFeature SKIPPED
[INFO] RESTful Hello World Demo ........................... SKIPPED
[INFO] WSDL first demo using Document/Literal Style ....... SKIPPED
[INFO] CXF sample using the Aegis Binding without any webservice SKIPPED
[INFO] Java First demo using JAX-WS APIs .................. SKIPPED
[INFO] WS-RM Demo ......................................... SKIPPED
[INFO] CXF Sample of Stream GZIP Interceptor .............. SKIPPED
[INFO] Spring HTTP Sample ................................. SKIPPED
[INFO] Spring HTTP Servlet demo with ruby support ......... SKIPPED
[INFO] Spring HTTP Servlet demo with groovy support ....... SKIPPED
[INFO] Hello world javascript demo ........................ SKIPPED
[INFO] CXF WS-Security UT Demo ............................ SKIPPED
[INFO] CXF WS-Security Signature Encryption Demo .......... SKIPPED
[INFO] CXF WS-SecurityPolicy Signature Encryption Demo .... SKIPPED
[INFO] WS-SecurityPolicy UT Demo .......................... SKIPPED
[INFO] MTOM Demo for SWA and XOP .......................... SKIPPED
[INFO] JAX-WS Asynchronous Demo using Document/Literal Style SKIPPED
[INFO] Java First POJO Sample ............................. SKIPPED
[INFO] WS-Policy Demo ..................................... SKIPPED
[INFO] Hello World Client Demo using JavaScript ........... SKIPPED
[INFO] WSDL first demo using HTTPS ........................ SKIPPED
[INFO] WS-Addressing Demo ................................. SKIPPED
[INFO] Sample using SOAP Headers .......................... SKIPPED
[INFO] SOAP/JMS Transport Specification Demo using Document-Literal Style SKIPPED
[INFO] CXF sample using WRAPPED Style in XML Binding (pure XML over HTTP) SKIPPED
[INFO] CXF sample using code first POJO's and the Aegis Binding SKIPPED
[INFO] Sample of JAX-* Service Using an Aegis Client ...... SKIPPED
[INFO] JAX-WS Handler Demo ................................ SKIPPED
[INFO] WSDL first demo using RPC-Literal Style ............ SKIPPED
[INFO] JMS Transport Publish/Subscribe Demo using Document-Literal Style SKIPPED
[INFO] JAX-RS Spring Security Demo ........................ SKIPPED
[INFO] Apache CXF Samples LogBrowser ...................... SKIPPED
[INFO] Apache CXF Samples LogBrowser Blueprint ............ SKIPPED
[INFO] WS-Notification Demo ............................... SKIPPED
[INFO] CXF STS Demo ....................................... SKIPPED
[INFO] Bank sample using JAX-WS API's to talk via CORBA/IIOP SKIPPED
[INFO] Bank sample using JAX-WS API's to talk via CORBA/IIOP SKIPPED
[INFO] hello-world sample using JAX-WS API's to talk via CORBA/IIOP SKIPPED
[INFO] OAuth 1.0a server .................................. SKIPPED
[INFO] OAuth 1.0a client .................................. SKIPPED
[INFO] JAX-RS Minimal OSGI Demo ........................... SKIPPED
[INFO] WS-Discovery Sample ................................ SKIPPED
[INFO] WS-Eventing Demo ................................... SKIPPED
[INFO] Demo using the throttling feature .................. SKIPPED
[INFO] JAX-RS Demo Using Distributed Tracing with Apache HTrace SKIPPED
[INFO] Apache CXF Distribution ............................ SKIPPED
[INFO] ------------------------------------------------------------------------
[INFO] BUILD FAILURE
[INFO] ------------------------------------------------------------------------
[INFO] Total time: 22:29 min
[INFO] Finished at: 2016-03-16T07:38:58+00:00
[INFO] Final Memory: 310M/774M
[INFO] ------------------------------------------------------------------------
[ERROR] Failed to execute goal org.apache.cxf:cxf-codegen-plugin:3.1.6-SNAPSHOT:wsdl2java
(generate-sources) on project js_browser_client_simple: Execution generate-sources of goal
org.apache.cxf:cxf-codegen-plugin:3.1.6-SNAPSHOT:wsdl2java failed: A required class was missing
while executing org.apache.cxf:cxf-codegen-plugin:3.1.6-SNAPSHOT:wsdl2java: org/apache/commons/logging/LogFactory
[ERROR] -----------------------------------------------------
[ERROR] realm =    plugin>org.apache.cxf:cxf-codegen-plugin:3.1.6-SNAPSHOT-1412906989
[ERROR] strategy = org.codehaus.plexus.classworlds.strategy.SelfFirstStrategy
[ERROR] urls[0] = file:/x1/jenkins/jenkins-slave/workspace/CXF-3.1-deploy/maven-plugins/codegen-plugin/target/cxf-codegen-plugin-3.1.6-SNAPSHOT.jar
[ERROR] urls[1] = <https://builds.apache.org/job/CXF-3.1-deploy/ws/.repository/org/apache/maven/shared/maven-artifact-resolver/1.0/maven-artifact-resolver-1.0.jar>
[ERROR] urls[2] = <https://builds.apache.org/job/CXF-3.1-deploy/ws/.repository/org/codehaus/plexus/plexus-utils/2.0.5/plexus-utils-2.0.5.jar>
[ERROR] urls[3] = <https://builds.apache.org/job/CXF-3.1-deploy/ws/.repository/org/codehaus/plexus/plexus-archiver/1.2/plexus-archiver-1.2.jar>
[ERROR] urls[4] = <https://builds.apache.org/job/CXF-3.1-deploy/ws/.repository/org/codehaus/plexus/plexus-io/1.0.1/plexus-io-1.0.1.jar>
[ERROR] urls[5] = file:/x1/jenkins/jenkins-slave/workspace/CXF-3.1-deploy/core/target/cxf-core-3.1.6-SNAPSHOT.jar
[ERROR] urls[6] = <https://builds.apache.org/job/CXF-3.1-deploy/ws/.repository/org/codehaus/woodstox/woodstox-core-asl/4.4.1/woodstox-core-asl-4.4.1.jar>
[ERROR] urls[7] = <https://builds.apache.org/job/CXF-3.1-deploy/ws/.repository/org/codehaus/woodstox/stax2-api/3.1.4/stax2-api-3.1.4.jar>
[ERROR] urls[8] = <https://builds.apache.org/job/CXF-3.1-deploy/ws/.repository/org/apache/ws/xmlschema/xmlschema-core/2.2.1/xmlschema-core-2.2.1.jar>
[ERROR] urls[9] = file:/x1/jenkins/jenkins-slave/workspace/CXF-3.1-deploy/tools/common/target/cxf-tools-common-3.1.6-SNAPSHOT.jar
[ERROR] urls[10] = <https://builds.apache.org/job/CXF-3.1-deploy/ws/.repository/org/apache/velocity/velocity/1.7/velocity-1.7.jar>
[ERROR] urls[11] = <https://builds.apache.org/job/CXF-3.1-deploy/ws/.repository/commons-lang/commons-lang/2.6/commons-lang-2.6.jar>
[ERROR] urls[12] = <https://builds.apache.org/job/CXF-3.1-deploy/ws/.repository/commons-collections/commons-collections/3.2.2/commons-collections-3.2.2.jar>
[ERROR] urls[13] = <https://builds.apache.org/job/CXF-3.1-deploy/ws/.repository/wsdl4j/wsdl4j/1.6.3/wsdl4j-1.6.3.jar>
[ERROR] urls[14] = <https://builds.apache.org/job/CXF-3.1-deploy/ws/.repository/com/sun/xml/bind/jaxb-xjc/2.2.11/jaxb-xjc-2.2.11.jar>
[ERROR] urls[15] = <https://builds.apache.org/job/CXF-3.1-deploy/ws/.repository/com/sun/xml/bind/jaxb-core/2.2.11/jaxb-core-2.2.11.jar>
[ERROR] urls[16] = <https://builds.apache.org/job/CXF-3.1-deploy/ws/.repository/com/sun/xml/bind/jaxb-impl/2.2.11/jaxb-impl-2.2.11.jar>
[ERROR] urls[17] = file:/x1/jenkins/jenkins-slave/workspace/CXF-3.1-deploy/tools/wsdlto/core/target/cxf-tools-wsdlto-core-3.1.6-SNAPSHOT.jar
[ERROR] urls[18] = file:/x1/jenkins/jenkins-slave/workspace/CXF-3.1-deploy/tools/validator/target/cxf-tools-validator-3.1.6-SNAPSHOT.jar
[ERROR] urls[19] = file:/x1/jenkins/jenkins-slave/workspace/CXF-3.1-deploy/rt/bindings/soap/target/cxf-rt-bindings-soap-3.1.6-SNAPSHOT.jar
[ERROR] urls[20] = file:/x1/jenkins/jenkins-slave/workspace/CXF-3.1-deploy/rt/databinding/jaxb/target/cxf-rt-databinding-jaxb-3.1.6-SNAPSHOT.jar
[ERROR] urls[21] = file:/x1/jenkins/jenkins-slave/workspace/CXF-3.1-deploy/rt/wsdl/target/cxf-rt-wsdl-3.1.6-SNAPSHOT.jar
[ERROR] urls[22] = <https://builds.apache.org/job/CXF-3.1-deploy/ws/.repository/org/ow2/asm/asm/5.0.4/asm-5.0.4.jar>
[ERROR] urls[23] = file:/x1/jenkins/jenkins-slave/workspace/CXF-3.1-deploy/tools/wsdlto/databinding/jaxb/target/cxf-tools-wsdlto-databinding-jaxb-3.1.6-SNAPSHOT.jar
[ERROR] urls[24] = file:/x1/jenkins/jenkins-slave/workspace/CXF-3.1-deploy/tools/wsdlto/frontend/jaxws/target/cxf-tools-wsdlto-frontend-jaxws-3.1.6-SNAPSHOT.jar
[ERROR] urls[25] = <https://builds.apache.org/job/CXF-3.1-deploy/ws/.repository/xml-resolver/xml-resolver/1.2/xml-resolver-1.2.jar>
[ERROR] urls[26] = file:/x1/jenkins/jenkins-slave/workspace/CXF-3.1-deploy/tools/wsdlto/frontend/javascript/target/cxf-tools-wsdlto-frontend-javascript-3.1.6-SNAPSHOT.jar
[ERROR] urls[27] = file:/x1/jenkins/jenkins-slave/workspace/CXF-3.1-deploy/rt/javascript/javascript-rt/target/cxf-rt-javascript-3.1.6-SNAPSHOT.jar
[ERROR] urls[28] = <https://builds.apache.org/job/CXF-3.1-deploy/ws/.repository/org/springframework/spring-core/4.1.8.RELEASE/spring-core-4.1.8.RELEASE.jar>
[ERROR] urls[29] = <https://builds.apache.org/job/CXF-3.1-deploy/ws/.repository/org/springframework/spring-beans/4.1.8.RELEASE/spring-beans-4.1.8.RELEASE.jar>
[ERROR] urls[30] = <https://builds.apache.org/job/CXF-3.1-deploy/ws/.repository/org/springframework/spring-context/4.1.8.RELEASE/spring-context-4.1.8.RELEASE.jar>
[ERROR] urls[31] = <https://builds.apache.org/job/CXF-3.1-deploy/ws/.repository/org/springframework/spring-aop/4.1.8.RELEASE/spring-aop-4.1.8.RELEASE.jar>
[ERROR] urls[32] = <https://builds.apache.org/job/CXF-3.1-deploy/ws/.repository/aopalliance/aopalliance/1.0/aopalliance-1.0.jar>
[ERROR] urls[33] = <https://builds.apache.org/job/CXF-3.1-deploy/ws/.repository/org/springframework/spring-expression/4.1.8.RELEASE/spring-expression-4.1.8.RELEASE.jar>
[ERROR] urls[34] = <https://builds.apache.org/job/CXF-3.1-deploy/ws/.repository/org/apache/ant/ant/1.8.4/ant-1.8.4.jar>
[ERROR] urls[35] = <https://builds.apache.org/job/CXF-3.1-deploy/ws/.repository/org/apache/ant/ant-launcher/1.8.4/ant-launcher-1.8.4.jar>
[ERROR] urls[36] = <https://builds.apache.org/job/CXF-3.1-deploy/ws/.repository/org/apache/ant/ant-nodeps/1.8.1/ant-nodeps-1.8.1.jar>
[ERROR] urls[37] = <https://builds.apache.org/job/CXF-3.1-deploy/ws/.repository/org/sonatype/plexus/plexus-build-api/0.0.7/plexus-build-api-0.0.7.jar>
[ERROR] Number of foreign imports: 1
[ERROR] import: Entry[import  from realm ClassRealm[maven.api, parent: null]]
[ERROR] 
[ERROR] -----------------------------------------------------: org.apache.commons.logging.LogFactory
[ERROR] -> [Help 1]
[ERROR] 
[ERROR] To see the full stack trace of the errors, re-run Maven with the -e switch.
[ERROR] Re-run Maven using the -X switch to enable full debug logging.
[ERROR] 
[ERROR] For more information about the errors and possible solutions, please read the following
articles:
[ERROR] [Help 1] http://cwiki.apache.org/confluence/display/MAVEN/PluginContainerException
[ERROR] 
[ERROR] After correcting the problems, you can resume the build with the command
[ERROR]   mvn <goals> -rf :js_browser_client_simple
Build step 'Invoke top-level Maven targets' marked build as failure

Mime
View raw message