cxf-notifications mailing list archives

Site index · List index
Message view « Date » · « Thread »
Top « Date » · « Thread »
From gmcdon...@apache.org
Subject Build failed in Jenkins: cxf-trunk » Apache CXF STS Core #1248
Date Mon, 29 Feb 2016 17:44:38 GMT
See <https://analysis.apache.org/jenkins/job/cxf-trunk/org.apache.cxf.services.sts$cxf-services-sts-core/1248/changes>

Changes:

[coheigea] Fixing build with latest WSS4J SNAPSHOT changes

------------------------------------------
[INFO]                                                                         
[INFO] ------------------------------------------------------------------------
[INFO] Building Apache CXF STS Core 3.2.0-SNAPSHOT
[INFO] ------------------------------------------------------------------------
[INFO] 
[INFO] --- maven-clean-plugin:2.6.1:clean (default-clean) @ cxf-services-sts-core ---
[INFO] Deleting <https://analysis.apache.org/jenkins/job/cxf-trunk/org.apache.cxf.services.sts$cxf-services-sts-core/ws/target>
[INFO] 
[INFO] --- maven-bundle-plugin:2.4.0:cleanVersions (versions) @ cxf-services-sts-core ---
[INFO] 
[INFO] --- cxf-xml2fastinfoset-plugin:3.1.0:xml2fastinfoset (xml2fastinfoset) @ cxf-services-sts-core
---
[INFO] 
[INFO] --- maven-remote-resources-plugin:1.5:process (default) @ cxf-services-sts-core ---
[INFO] 
[INFO] --- maven-resources-plugin:2.7:resources (default-resources) @ cxf-services-sts-core
---
[INFO] Using 'UTF-8' encoding to copy filtered resources.
[INFO] Copying 0 resource
[INFO] Copying 1 resource
[INFO] skip non existing resourceDirectory <https://analysis.apache.org/jenkins/job/cxf-trunk/org.apache.cxf.services.sts$cxf-services-sts-core/ws/src/main/resources-filtered>
[INFO] skip non existing resourceDirectory <https://analysis.apache.org/jenkins/job/cxf-trunk/org.apache.cxf.services.sts$cxf-services-sts-core/ws/target/generated/src/main/resources>
[INFO] Copying 3 resources
[INFO] 
[INFO] --- maven-compiler-plugin:3.3:compile (default-compile) @ cxf-services-sts-core ---
[INFO] Changes detected - recompiling the module!
[INFO] Compiling 146 source files to <https://analysis.apache.org/jenkins/job/cxf-trunk/org.apache.cxf.services.sts$cxf-services-sts-core/ws/target/classes>
[INFO] 
[INFO] --- maven-resources-plugin:2.7:testResources (default-testResources) @ cxf-services-sts-core
---
[INFO] Using 'UTF-8' encoding to copy filtered resources.
[INFO] Copying 0 resource
[INFO] Copying 10 resources
[INFO] skip non existing resourceDirectory <https://analysis.apache.org/jenkins/job/cxf-trunk/org.apache.cxf.services.sts$cxf-services-sts-core/ws/target/generated/src/test/resources>
[INFO] Copying 3 resources
[INFO] 
[INFO] --- maven-compiler-plugin:3.3:testCompile (default-testCompile) @ cxf-services-sts-core
---
[INFO] Changes detected - recompiling the module!
[INFO] Compiling 74 source files to <https://analysis.apache.org/jenkins/job/cxf-trunk/org.apache.cxf.services.sts$cxf-services-sts-core/ws/target/test-classes>
[INFO] -------------------------------------------------------------
[ERROR] COMPILATION ERROR : 
[INFO] -------------------------------------------------------------
[ERROR] <https://analysis.apache.org/jenkins/job/cxf-trunk/org.apache.cxf.services.sts$cxf-services-sts-core/ws/src/test/java/org/apache/cxf/sts/operation/IssueEncryptedUnitTest.java>:[332,61]
cannot find symbol
  symbol:   variable KEYTRANSPORT_RSAOEP
  location: class org.apache.wss4j.dom.WSConstants
[ERROR] <https://analysis.apache.org/jenkins/job/cxf-trunk/org.apache.cxf.services.sts$cxf-services-sts-core/ws/src/test/java/org/apache/cxf/sts/operation/IssueEncryptedUnitTest.java>:[421,76]
cannot find symbol
  symbol:   variable KEYTRANSPORT_RSAOEP
  location: class org.apache.wss4j.dom.WSConstants
[ERROR] <https://analysis.apache.org/jenkins/job/cxf-trunk/org.apache.cxf.services.sts$cxf-services-sts-core/ws/src/test/java/org/apache/cxf/sts/operation/IssueSamlUnitTest.java>:[831,42]
cannot find symbol
  symbol:   variable KEYTRANSPORT_RSAOEP
  location: class org.apache.wss4j.dom.WSConstants
[INFO] 3 errors 
[INFO] -------------------------------------------------------------
[JENKINS] Archiving disabled

Mime
View raw message