cxf-notifications mailing list archives

Site index · List index
Message view « Date » · « Thread »
Top « Date » · « Thread »
From gmcdon...@apache.org
Subject Build failed in Jenkins: cxf-trunk » Apache CXF Distributed Tracing using Apache HTrace #1198
Date Thu, 17 Dec 2015 18:48:29 GMT
See <https://analysis.apache.org/jenkins/job/cxf-trunk/org.apache.cxf$cxf-integration-tracing-htrace/1198/>

------------------------------------------
[INFO]                                                                         
[INFO] ------------------------------------------------------------------------
[INFO] Building Apache CXF Distributed Tracing using Apache HTrace 3.2.0-SNAPSHOT
[INFO] ------------------------------------------------------------------------
[INFO] 
[INFO] --- maven-clean-plugin:2.6.1:clean (default-clean) @ cxf-integration-tracing-htrace
---
[INFO] Deleting <https://analysis.apache.org/jenkins/job/cxf-trunk/org.apache.cxf$cxf-integration-tracing-htrace/ws/target>
[INFO] 
[INFO] --- maven-bundle-plugin:2.4.0:cleanVersions (versions) @ cxf-integration-tracing-htrace
---
[INFO] 
[INFO] --- maven-checkstyle-plugin:2.15:checkstyle (validate) @ cxf-integration-tracing-htrace
---
[INFO] Starting audit...
Audit done.
[INFO] 
[INFO] >>> maven-pmd-plugin:3.5:check (validate) > :pmd @ cxf-integration-tracing-htrace
>>>
[INFO] 
[INFO] --- maven-pmd-plugin:3.5:pmd (pmd) @ cxf-integration-tracing-htrace ---
[INFO] 
[INFO] <<< maven-pmd-plugin:3.5:check (validate) < :pmd @ cxf-integration-tracing-htrace
<<<
[INFO] 
[INFO] --- maven-pmd-plugin:3.5:check (validate) @ cxf-integration-tracing-htrace ---
[INFO] 
[INFO] 
[INFO] --- cxf-xml2fastinfoset-plugin:3.1.0:xml2fastinfoset (xml2fastinfoset) @ cxf-integration-tracing-htrace
---
[INFO] 
[INFO] --- maven-remote-resources-plugin:1.5:process (default) @ cxf-integration-tracing-htrace
---
[INFO] 
[INFO] --- maven-resources-plugin:2.7:resources (default-resources) @ cxf-integration-tracing-htrace
---
[INFO] Using 'UTF-8' encoding to copy filtered resources.
[INFO] Copying 0 resource
[INFO] skip non existing resourceDirectory <https://analysis.apache.org/jenkins/job/cxf-trunk/org.apache.cxf$cxf-integration-tracing-htrace/ws/src/main/resources>
[INFO] skip non existing resourceDirectory <https://analysis.apache.org/jenkins/job/cxf-trunk/org.apache.cxf$cxf-integration-tracing-htrace/ws/src/main/resources-filtered>
[INFO] skip non existing resourceDirectory <https://analysis.apache.org/jenkins/job/cxf-trunk/org.apache.cxf$cxf-integration-tracing-htrace/ws/target/generated/src/main/resources>
[INFO] Copying 3 resources
[INFO] 
[INFO] --- maven-compiler-plugin:3.3:compile (default-compile) @ cxf-integration-tracing-htrace
---
[INFO] Changes detected - recompiling the module!
[INFO] Compiling 17 source files to <https://analysis.apache.org/jenkins/job/cxf-trunk/org.apache.cxf$cxf-integration-tracing-htrace/ws/target/classes>
[INFO] -------------------------------------------------------------
[WARNING] COMPILATION WARNING : 
[INFO] -------------------------------------------------------------
[WARNING] <https://analysis.apache.org/jenkins/job/cxf-trunk/org.apache.cxf$cxf-integration-tracing-htrace/ws/src/main/java/org/apache/cxf/tracing/htrace/HTraceTracerContext.java>:[44,23]
startSpan(java.lang.String) in org.apache.cxf.tracing.htrace.HTraceTracerContext implements
<T>startSpan(java.lang.String) in org.apache.cxf.tracing.TracerContext
  return type requires unchecked conversion from org.apache.htrace.core.TraceScope to T
[INFO] 1 warning
[INFO] -------------------------------------------------------------
[INFO] -------------------------------------------------------------
[ERROR] COMPILATION ERROR : 
[INFO] -------------------------------------------------------------
[ERROR] <https://analysis.apache.org/jenkins/job/cxf-trunk/org.apache.cxf$cxf-integration-tracing-htrace/ws/src/main/java/org/apache/cxf/jaxrs/tracing/htrace/HTraceTracerContext.java>:[26,25]
cannot find symbol
  symbol:   class Sampler
  location: package org.apache.htrace
[ERROR] <https://analysis.apache.org/jenkins/job/cxf-trunk/org.apache.cxf$cxf-integration-tracing-htrace/ws/src/main/java/org/apache/cxf/jaxrs/tracing/htrace/HTraceTracerContext.java>:[27,25]
cannot find symbol
  symbol:   class Trace
  location: package org.apache.htrace
[ERROR] <https://analysis.apache.org/jenkins/job/cxf-trunk/org.apache.cxf$cxf-integration-tracing-htrace/ws/src/main/java/org/apache/cxf/jaxrs/tracing/htrace/HTraceTracerContext.java>:[28,25]
cannot find symbol
  symbol:   class TraceScope
  location: package org.apache.htrace
[ERROR] <https://analysis.apache.org/jenkins/job/cxf-trunk/org.apache.cxf$cxf-integration-tracing-htrace/ws/src/main/java/org/apache/cxf/jaxrs/tracing/htrace/HTraceTracerContext.java>:[29,34]
package org.apache.htrace.wrappers does not exist
[ERROR] <https://analysis.apache.org/jenkins/job/cxf-trunk/org.apache.cxf$cxf-integration-tracing-htrace/ws/src/main/java/org/apache/cxf/jaxrs/tracing/htrace/HTraceTracerContext.java>:[32,19]
cannot find symbol
  symbol:   class Sampler
  location: class org.apache.cxf.jaxrs.tracing.htrace.HTraceTracerContext
[ERROR] <https://analysis.apache.org/jenkins/job/cxf-trunk/org.apache.cxf$cxf-integration-tracing-htrace/ws/src/main/java/org/apache/cxf/jaxrs/tracing/htrace/HTraceTracerContext.java>:[34,38]
cannot find symbol
  symbol:   class Sampler
  location: class org.apache.cxf.jaxrs.tracing.htrace.HTraceTracerContext
[ERROR] <https://analysis.apache.org/jenkins/job/cxf-trunk/org.apache.cxf$cxf-integration-tracing-htrace/ws/src/main/java/org/apache/cxf/jaxrs/tracing/htrace/HTraceTracerContext.java>:[40,12]
cannot find symbol
  symbol:   class TraceScope
  location: class org.apache.cxf.jaxrs.tracing.htrace.HTraceTracerContext
[ERROR] <https://analysis.apache.org/jenkins/job/cxf-trunk/org.apache.cxf$cxf-integration-tracing-htrace/ws/src/main/java/org/apache/cxf/jaxrs/tracing/htrace/HTraceContextProvider.java>:[26,25]
cannot find symbol
  symbol:   class Sampler
  location: package org.apache.htrace
[ERROR] <https://analysis.apache.org/jenkins/job/cxf-trunk/org.apache.cxf$cxf-integration-tracing-htrace/ws/src/main/java/org/apache/cxf/jaxrs/tracing/htrace/HTraceContextProvider.java>:[27,30]
package org.apache.htrace.impl does not exist
[ERROR] <https://analysis.apache.org/jenkins/job/cxf-trunk/org.apache.cxf$cxf-integration-tracing-htrace/ws/src/main/java/org/apache/cxf/jaxrs/tracing/htrace/HTraceContextProvider.java>:[31,13]
cannot find symbol
  symbol:   class Sampler
  location: class org.apache.cxf.jaxrs.tracing.htrace.HTraceContextProvider
[ERROR] <https://analysis.apache.org/jenkins/job/cxf-trunk/org.apache.cxf$cxf-integration-tracing-htrace/ws/src/main/java/org/apache/cxf/jaxrs/tracing/htrace/HTraceContextProvider.java>:[33,40]
cannot find symbol
  symbol:   class Sampler
  location: class org.apache.cxf.jaxrs.tracing.htrace.HTraceContextProvider
[ERROR] <https://analysis.apache.org/jenkins/job/cxf-trunk/org.apache.cxf$cxf-integration-tracing-htrace/ws/src/main/java/org/apache/cxf/jaxrs/tracing/htrace/HTraceFeature.java>:[27,25]
cannot find symbol
  symbol:   class HTraceConfiguration
  location: package org.apache.htrace
[ERROR] <https://analysis.apache.org/jenkins/job/cxf-trunk/org.apache.cxf$cxf-integration-tracing-htrace/ws/src/main/java/org/apache/cxf/jaxrs/tracing/htrace/HTraceFeature.java>:[28,25]
cannot find symbol
  symbol:   class Sampler
  location: package org.apache.htrace
[ERROR] <https://analysis.apache.org/jenkins/job/cxf-trunk/org.apache.cxf$cxf-integration-tracing-htrace/ws/src/main/java/org/apache/cxf/jaxrs/tracing/htrace/HTraceFeature.java>:[29,25]
cannot find symbol
  symbol:   class SamplerBuilder
  location: package org.apache.htrace
[ERROR] <https://analysis.apache.org/jenkins/job/cxf-trunk/org.apache.cxf$cxf-integration-tracing-htrace/ws/src/main/java/org/apache/cxf/jaxrs/tracing/htrace/HTraceFeature.java>:[30,25]
cannot find symbol
  symbol:   class SpanReceiver
  location: package org.apache.htrace
[ERROR] <https://analysis.apache.org/jenkins/job/cxf-trunk/org.apache.cxf$cxf-integration-tracing-htrace/ws/src/main/java/org/apache/cxf/jaxrs/tracing/htrace/HTraceFeature.java>:[31,25]
cannot find symbol
  symbol:   class SpanReceiverBuilder
  location: package org.apache.htrace
[ERROR] <https://analysis.apache.org/jenkins/job/cxf-trunk/org.apache.cxf$cxf-integration-tracing-htrace/ws/src/main/java/org/apache/cxf/jaxrs/tracing/htrace/HTraceFeature.java>:[32,25]
cannot find symbol
  symbol:   class Trace
  location: package org.apache.htrace
[ERROR] <https://analysis.apache.org/jenkins/job/cxf-trunk/org.apache.cxf$cxf-integration-tracing-htrace/ws/src/main/java/org/apache/cxf/jaxrs/tracing/htrace/HTraceFeature.java>:[35,13]
cannot find symbol
  symbol:   class HTraceConfiguration
  location: class org.apache.cxf.jaxrs.tracing.htrace.HTraceFeature
[ERROR] <https://analysis.apache.org/jenkins/job/cxf-trunk/org.apache.cxf$cxf-integration-tracing-htrace/ws/src/main/java/org/apache/cxf/jaxrs/tracing/htrace/HTraceFeature.java>:[41,32]
cannot find symbol
  symbol:   class HTraceConfiguration
  location: class org.apache.cxf.jaxrs.tracing.htrace.HTraceFeature
[ERROR] <https://analysis.apache.org/jenkins/job/cxf-trunk/org.apache.cxf$cxf-integration-tracing-htrace/ws/src/main/java/org/apache/cxf/jaxrs/tracing/htrace/HTraceFeature.java>:[64,40]
cannot find symbol
  symbol:   class HTraceConfiguration
  location: class org.apache.cxf.jaxrs.tracing.htrace.HTraceFeature
[ERROR] <https://analysis.apache.org/jenkins/job/cxf-trunk/org.apache.cxf$cxf-integration-tracing-htrace/ws/src/main/java/org/apache/cxf/jaxrs/tracing/htrace/HTraceFeature.java>:[68,12]
cannot find symbol
  symbol:   class HTraceConfiguration
  location: class org.apache.cxf.jaxrs.tracing.htrace.HTraceFeature
[ERROR] <https://analysis.apache.org/jenkins/job/cxf-trunk/org.apache.cxf$cxf-integration-tracing-htrace/ws/src/main/java/org/apache/cxf/jaxrs/tracing/htrace/HTraceProvider.java>:[33,25]
cannot find symbol
  symbol:   class Sampler
  location: package org.apache.htrace
[ERROR] <https://analysis.apache.org/jenkins/job/cxf-trunk/org.apache.cxf$cxf-integration-tracing-htrace/ws/src/main/java/org/apache/cxf/jaxrs/tracing/htrace/HTraceProvider.java>:[34,25]
cannot find symbol
  symbol:   class Trace
  location: package org.apache.htrace
[ERROR] <https://analysis.apache.org/jenkins/job/cxf-trunk/org.apache.cxf$cxf-integration-tracing-htrace/ws/src/main/java/org/apache/cxf/jaxrs/tracing/htrace/HTraceProvider.java>:[35,25]
cannot find symbol
  symbol:   class TraceInfo
  location: package org.apache.htrace
[ERROR] <https://analysis.apache.org/jenkins/job/cxf-trunk/org.apache.cxf$cxf-integration-tracing-htrace/ws/src/main/java/org/apache/cxf/jaxrs/tracing/htrace/HTraceProvider.java>:[36,25]
cannot find symbol
  symbol:   class TraceScope
  location: package org.apache.htrace
[ERROR] <https://analysis.apache.org/jenkins/job/cxf-trunk/org.apache.cxf$cxf-integration-tracing-htrace/ws/src/main/java/org/apache/cxf/jaxrs/tracing/htrace/HTraceProvider.java>:[37,25]
cannot find symbol
  symbol:   class Tracer
  location: package org.apache.htrace
[ERROR] <https://analysis.apache.org/jenkins/job/cxf-trunk/org.apache.cxf$cxf-integration-tracing-htrace/ws/src/main/java/org/apache/cxf/jaxrs/tracing/htrace/HTraceProvider.java>:[38,30]
package org.apache.htrace.impl does not exist
[ERROR] <https://analysis.apache.org/jenkins/job/cxf-trunk/org.apache.cxf$cxf-integration-tracing-htrace/ws/src/main/java/org/apache/cxf/jaxrs/tracing/htrace/HTraceProvider.java>:[48,19]
cannot find symbol
  symbol:   class Sampler
  location: class org.apache.cxf.jaxrs.tracing.htrace.HTraceProvider
[ERROR] <https://analysis.apache.org/jenkins/job/cxf-trunk/org.apache.cxf$cxf-integration-tracing-htrace/ws/src/main/java/org/apache/cxf/jaxrs/tracing/htrace/HTraceProvider.java>:[54,33]
cannot find symbol
  symbol:   class Sampler
  location: class org.apache.cxf.jaxrs.tracing.htrace.HTraceProvider
[ERROR] <https://analysis.apache.org/jenkins/job/cxf-trunk/org.apache.cxf$cxf-integration-tracing-htrace/ws/src/main/java/org/apache/cxf/jaxrs/tracing/htrace/HTraceProvider.java>:[41,1]
cannot find symbol
  symbol:   static HEADER_TRACE_ID
  location: class
[ERROR] <https://analysis.apache.org/jenkins/job/cxf-trunk/org.apache.cxf$cxf-integration-tracing-htrace/ws/src/main/java/org/apache/cxf/jaxrs/tracing/htrace/HTraceTracerContext.java>:[31,8]
org.apache.cxf.jaxrs.tracing.htrace.HTraceTracerContext is not abstract and does not override
abstract method <T>continueSpan(org.apache.cxf.tracing.Traceable<T>) in org.apache.cxf.tracing.TracerContext
[ERROR] <https://analysis.apache.org/jenkins/job/cxf-trunk/org.apache.cxf$cxf-integration-tracing-htrace/ws/src/main/java/org/apache/cxf/jaxrs/tracing/htrace/HTraceTracerContext.java>:[41,16]
cannot find symbol
  symbol:   variable Trace
  location: class org.apache.cxf.jaxrs.tracing.htrace.HTraceTracerContext
[ERROR] <https://analysis.apache.org/jenkins/job/cxf-trunk/org.apache.cxf$cxf-integration-tracing-htrace/ws/src/main/java/org/apache/cxf/jaxrs/tracing/htrace/HTraceTracerContext.java>:[55,13]
cannot find symbol
  symbol:   variable Trace
  location: class org.apache.cxf.jaxrs.tracing.htrace.HTraceTracerContext
[ERROR] <https://analysis.apache.org/jenkins/job/cxf-trunk/org.apache.cxf$cxf-integration-tracing-htrace/ws/src/main/java/org/apache/cxf/jaxrs/tracing/htrace/HTraceTracerContext.java>:[56,24]
cannot find symbol
  symbol:   class TraceCallable
  location: class org.apache.cxf.jaxrs.tracing.htrace.HTraceTracerContext
[ERROR] <https://analysis.apache.org/jenkins/job/cxf-trunk/org.apache.cxf$cxf-integration-tracing-htrace/ws/src/main/java/org/apache/cxf/jaxrs/tracing/htrace/HTraceTracerContext.java>:[56,41]
cannot find symbol
  symbol:   variable Trace
  location: class org.apache.cxf.jaxrs.tracing.htrace.HTraceTracerContext
[ERROR] <https://analysis.apache.org/jenkins/job/cxf-trunk/org.apache.cxf$cxf-integration-tracing-htrace/ws/src/main/java/org/apache/cxf/jaxrs/tracing/htrace/HTraceTracerContext.java>:[62,5]
method does not override or implement a method from a supertype
[ERROR] <https://analysis.apache.org/jenkins/job/cxf-trunk/org.apache.cxf$cxf-integration-tracing-htrace/ws/src/main/java/org/apache/cxf/jaxrs/tracing/htrace/HTraceTracerContext.java>:[64,9]
cannot find symbol
  symbol:   variable Trace
  location: class org.apache.cxf.jaxrs.tracing.htrace.HTraceTracerContext
[ERROR] <https://analysis.apache.org/jenkins/job/cxf-trunk/org.apache.cxf$cxf-integration-tracing-htrace/ws/src/main/java/org/apache/cxf/jaxrs/tracing/htrace/HTraceTracerContext.java>:[75,9]
cannot find symbol
  symbol:   variable Trace
  location: class org.apache.cxf.jaxrs.tracing.htrace.HTraceTracerContext
[ERROR] <https://analysis.apache.org/jenkins/job/cxf-trunk/org.apache.cxf$cxf-integration-tracing-htrace/ws/src/main/java/org/apache/cxf/jaxrs/tracing/htrace/HTraceContextProvider.java>:[31,36]
cannot find symbol
  symbol:   variable NeverSampler
  location: class org.apache.cxf.jaxrs.tracing.htrace.HTraceContextProvider
[ERROR] <https://analysis.apache.org/jenkins/job/cxf-trunk/org.apache.cxf$cxf-integration-tracing-htrace/ws/src/main/java/org/apache/cxf/jaxrs/tracing/htrace/HTraceFeature.java>:[38,14]
cannot find symbol
  symbol:   variable HTraceConfiguration
  location: class org.apache.cxf.jaxrs.tracing.htrace.HTraceFeature
[ERROR] <https://analysis.apache.org/jenkins/job/cxf-trunk/org.apache.cxf$cxf-integration-tracing-htrace/ws/src/main/java/org/apache/cxf/jaxrs/tracing/htrace/HTraceFeature.java>:[51,15]
cannot find symbol
  symbol:   class Sampler
  location: class org.apache.cxf.jaxrs.tracing.htrace.HTraceFeature
[ERROR] <https://analysis.apache.org/jenkins/job/cxf-trunk/org.apache.cxf$cxf-integration-tracing-htrace/ws/src/main/java/org/apache/cxf/jaxrs/tracing/htrace/HTraceFeature.java>:[51,42]
cannot find symbol
  symbol:   class SamplerBuilder
  location: class org.apache.cxf.jaxrs.tracing.htrace.HTraceFeature
[ERROR] <https://analysis.apache.org/jenkins/job/cxf-trunk/org.apache.cxf$cxf-integration-tracing-htrace/ws/src/main/java/org/apache/cxf/jaxrs/tracing/htrace/HTraceFeature.java>:[52,15]
cannot find symbol
  symbol:   class SpanReceiver
  location: class org.apache.cxf.jaxrs.tracing.htrace.HTraceFeature
[ERROR] <https://analysis.apache.org/jenkins/job/cxf-trunk/org.apache.cxf$cxf-integration-tracing-htrace/ws/src/main/java/org/apache/cxf/jaxrs/tracing/htrace/HTraceFeature.java>:[52,47]
cannot find symbol
  symbol:   class SpanReceiverBuilder
  location: class org.apache.cxf.jaxrs.tracing.htrace.HTraceFeature
[ERROR] <https://analysis.apache.org/jenkins/job/cxf-trunk/org.apache.cxf$cxf-integration-tracing-htrace/ws/src/main/java/org/apache/cxf/jaxrs/tracing/htrace/HTraceFeature.java>:[55,13]
cannot find symbol
  symbol:   variable Trace
  location: class org.apache.cxf.jaxrs.tracing.htrace.HTraceFeature
[ERROR] <https://analysis.apache.org/jenkins/job/cxf-trunk/org.apache.cxf$cxf-integration-tracing-htrace/ws/src/main/java/org/apache/cxf/jaxrs/tracing/htrace/HTraceProvider.java>:[51,14]
cannot find symbol
  symbol:   variable NeverSampler
  location: class org.apache.cxf.jaxrs.tracing.htrace.HTraceProvider
[ERROR] <https://analysis.apache.org/jenkins/job/cxf-trunk/org.apache.cxf$cxf-integration-tracing-htrace/ws/src/main/java/org/apache/cxf/jaxrs/tracing/htrace/HTraceProvider.java>:[64,62]
cannot find symbol
  symbol:   variable HEADER_TRACE_ID
  location: class org.apache.cxf.jaxrs.tracing.htrace.HTraceProvider
[ERROR] <https://analysis.apache.org/jenkins/job/cxf-trunk/org.apache.cxf$cxf-integration-tracing-htrace/ws/src/main/java/org/apache/cxf/jaxrs/tracing/htrace/HTraceProvider.java>:[65,19]
package Tracer does not exist
[ERROR] <https://analysis.apache.org/jenkins/job/cxf-trunk/org.apache.cxf$cxf-integration-tracing-htrace/ws/src/main/java/org/apache/cxf/jaxrs/tracing/htrace/HTraceProvider.java>:[69,19]
package Tracer does not exist
[ERROR] <https://analysis.apache.org/jenkins/job/cxf-trunk/org.apache.cxf$cxf-integration-tracing-htrace/ws/src/main/java/org/apache/cxf/jaxrs/tracing/htrace/HTraceProvider.java>:[71,30]
package Tracer does not exist
[ERROR] <https://analysis.apache.org/jenkins/job/cxf-trunk/org.apache.cxf$cxf-integration-tracing-htrace/ws/src/main/java/org/apache/cxf/jaxrs/tracing/htrace/HTraceProvider.java>:[71,69]
package Tracer does not exist
[ERROR] <https://analysis.apache.org/jenkins/job/cxf-trunk/org.apache.cxf$cxf-integration-tracing-htrace/ws/src/main/java/org/apache/cxf/jaxrs/tracing/htrace/HTraceProvider.java>:[73,18]
cannot find symbol
  symbol:   class Sampler
  location: class org.apache.cxf.jaxrs.tracing.htrace.HTraceProvider
[ERROR] <https://analysis.apache.org/jenkins/job/cxf-trunk/org.apache.cxf$cxf-integration-tracing-htrace/ws/src/main/java/org/apache/cxf/jaxrs/tracing/htrace/HTraceProvider.java>:[73,27]
cannot find symbol
  symbol:   class TraceInfo
  location: class org.apache.cxf.jaxrs.tracing.htrace.HTraceProvider
[ERROR] <https://analysis.apache.org/jenkins/job/cxf-trunk/org.apache.cxf$cxf-integration-tracing-htrace/ws/src/main/java/org/apache/cxf/jaxrs/tracing/htrace/HTraceProvider.java>:[73,52]
cannot find symbol
  symbol:   class TraceInfo
  location: class org.apache.cxf.jaxrs.tracing.htrace.HTraceProvider
[ERROR] <https://analysis.apache.org/jenkins/job/cxf-trunk/org.apache.cxf$cxf-integration-tracing-htrace/ws/src/main/java/org/apache/cxf/jaxrs/tracing/htrace/HTraceProvider.java>:[72,52]
cannot find symbol
  symbol:   variable Trace
  location: class org.apache.cxf.jaxrs.tracing.htrace.HTraceProvider
[ERROR] <https://analysis.apache.org/jenkins/job/cxf-trunk/org.apache.cxf$cxf-integration-tracing-htrace/ws/src/main/java/org/apache/cxf/jaxrs/tracing/htrace/HTraceProvider.java>:[83,33]
cannot find symbol
  symbol:   variable HEADER_TRACE_ID
  location: class org.apache.cxf.jaxrs.tracing.htrace.HTraceProvider
[ERROR] <https://analysis.apache.org/jenkins/job/cxf-trunk/org.apache.cxf$cxf-integration-tracing-htrace/ws/src/main/java/org/apache/cxf/jaxrs/tracing/htrace/HTraceProvider.java>:[84,46]
cannot find symbol
  symbol:   variable HEADER_TRACE_ID
  location: class org.apache.cxf.jaxrs.tracing.htrace.HTraceProvider
[ERROR] <https://analysis.apache.org/jenkins/job/cxf-trunk/org.apache.cxf$cxf-integration-tracing-htrace/ws/src/main/java/org/apache/cxf/jaxrs/tracing/htrace/HTraceProvider.java>:[84,80]
cannot find symbol
  symbol:   variable HEADER_TRACE_ID
  location: class org.apache.cxf.jaxrs.tracing.htrace.HTraceProvider
[ERROR] <https://analysis.apache.org/jenkins/job/cxf-trunk/org.apache.cxf$cxf-integration-tracing-htrace/ws/src/main/java/org/apache/cxf/jaxrs/tracing/htrace/HTraceProvider.java>:[89,30]
cannot find symbol
  symbol:   class TraceScope
  location: class org.apache.cxf.jaxrs.tracing.htrace.HTraceProvider
[ERROR] <https://analysis.apache.org/jenkins/job/cxf-trunk/org.apache.cxf$cxf-integration-tracing-htrace/ws/src/main/java/org/apache/cxf/jaxrs/tracing/htrace/HTraceProvider.java>:[90,19]
cannot find symbol
  symbol:   class TraceScope
  location: class org.apache.cxf.jaxrs.tracing.htrace.HTraceProvider
[ERROR] <https://analysis.apache.org/jenkins/job/cxf-trunk/org.apache.cxf$cxf-integration-tracing-htrace/ws/src/main/java/org/apache/cxf/jaxrs/tracing/htrace/HTraceProvider.java>:[90,38]
cannot find symbol
  symbol:   class TraceScope
  location: class org.apache.cxf.jaxrs.tracing.htrace.HTraceProvider
[INFO] 61 errors 
[INFO] -------------------------------------------------------------
[JENKINS] Archiving disabled

Mime
View raw message