cxf-notifications mailing list archives

Site index · List index
Message view « Date » · « Thread »
Top « Date » · « Thread »
From Apache Jenkins Server <jenk...@builds.apache.org>
Subject Build failed in Jenkins: CXF-trunk-deploy #1724
Date Fri, 07 Aug 2015 06:52:45 GMT
See <https://builds.apache.org/job/CXF-trunk-deploy/1724/changes>

Changes:

[sberyozkin] [CXF-6521] Making RS SAML Interceptors constructor accepting a custom phase

[sberyozkin] [CXF-5348] Adding a test

[sberyozkin] [CXF-6522] Updating the tl proxy code to unwrap target exceptions, patch from
Ievgen Tarasov applied

[sberyozkin] Adding a couple of jose exception classes

[sberyozkin] [CXF-6509] Adding a fine level warning that a given public method is not a JAX-RS
method

[coheigea] Fixing some issues thrown up by analysis.apache.org

[sberyozkin] Temp making JoseHeaders abstract again

[ay] [CXF-6519] clean up the code and add a test for 3.x.x

[ay] [CXF-6519] add a systest case using RM11 CloseSequence

[sberyozkin] Fixing a typo in the abstract jose helper

[sberyozkin] Renaming JWE key decryption interfaces to make the names consistent with encryption
ones

------------------------------------------
Started by an SCM change
Building remotely on ubuntu3 (Ubuntu ubuntu legacy-ubuntu) in workspace <https://builds.apache.org/job/CXF-trunk-deploy/ws/>
 > git rev-parse --is-inside-work-tree # timeout=10
Fetching changes from the remote Git repository
 > git config remote.origin.url https://git-wip-us.apache.org/repos/asf/cxf.git # timeout=10
Fetching upstream changes from https://git-wip-us.apache.org/repos/asf/cxf.git
 > git --version # timeout=10
 > git fetch --tags --progress https://git-wip-us.apache.org/repos/asf/cxf.git +refs/heads/*:refs/remotes/origin/*
 > git rev-parse refs/remotes/origin/master^{commit} # timeout=10
 > git rev-parse refs/remotes/origin/origin/master^{commit} # timeout=10
Checking out Revision 966dd67269e7c406b1571484687150d0cb49db81 (refs/remotes/origin/master)
 > git config core.sparsecheckout # timeout=10
 > git checkout -f 966dd67269e7c406b1571484687150d0cb49db81
 > git rev-list 82e40f03f24264a41e1f72f26c0d2af7747e5da7 # timeout=10
Parsing POMs
Modules changed, recalculating dependency graph
maven3-agent.jar already up to date
maven3-interceptor.jar already up to date
maven3-interceptor-commons.jar already up to date
[CXF-trunk-deploy] $ /home/jenkins/tools/java/latest1.7/bin/java -da -dsa -XX:MaxPermSize=256m
-Xmx1024M -cp /home/jenkins/jenkins-slave/maven3-agent.jar:/home/jenkins/jenkins-slave/tools/hudson.tasks.Maven_MavenInstallation/Maven_3.0.5/boot/plexus-classworlds-2.4.jar
org.jvnet.hudson.maven3.agent.Maven3Main /home/jenkins/jenkins-slave/tools/hudson.tasks.Maven_MavenInstallation/Maven_3.0.5
/x1/jenkins/jenkins-slave/slave.jar /home/jenkins/jenkins-slave/maven3-interceptor.jar /home/jenkins/jenkins-slave/maven3-interceptor-commons.jar
43261
<===[JENKINS REMOTING CAPACITY]===>   channel started
Executing Maven:  -B -f <https://builds.apache.org/job/CXF-trunk-deploy/ws/pom.xml>
-Dmaven.repo.local=/home/jenkins/jenkins-slave/maven-repositories/1 -U -B -e clean install
-Pjaxws22,deploy,everything,nochecks -Dmaven.test.skip.exec=true -V -DobrRepository=NONE
Apache Maven 3.0.5 (r01de14724cdef164cd33c7c8c2fe155faf9602da; 2013-02-19 13:51:28+0000)
Maven home: /x1/jenkins/jenkins-slave/tools/hudson.tasks.Maven_MavenInstallation/Maven_3.0.5
Java version: 1.7.0_25, vendor: Oracle Corporation
Java home: /x1/jenkins/tools/java/jdk1.7.0_25-32/jre
Default locale: en_US, platform encoding: ANSI_X3.4-1968
OS name: "linux", version: "3.2.0-75-generic", arch: "i386", family: "unix"
[INFO] Error stacktraces are turned on.
[INFO] Scanning for projects...
Downloading: http://repo.maven.apache.org/maven2/org/apache/felix/maven-bundle-plugin/maven-metadata.xml
Downloaded: http://repo.maven.apache.org/maven2/org/apache/felix/maven-bundle-plugin/maven-metadata.xml
(931 B at 1.7 KB/sec)
[WARNING] 
[WARNING] Some problems were encountered while building the effective model for org.apache.cxf.samples:logbrowser:war:3.1.3-SNAPSHOT
[WARNING] 'build.plugins.plugin.version' for org.apache.felix:maven-bundle-plugin is missing.
@ line 45, column 13
[WARNING] 'build.plugins.plugin.version' for org.apache.maven.plugins:maven-war-plugin is
missing. @ line 34, column 13
[WARNING] 
[WARNING] Some problems were encountered while building the effective model for org.apache.cxf.samples:logbrowser-blueprint:bundle:3.1.3-SNAPSHOT
[WARNING] 'build.plugins.plugin.version' for org.apache.felix:maven-bundle-plugin is missing.
@ line 34, column 21
[WARNING] 
[WARNING] It is highly recommended to fix these problems because they threaten the stability
of your build.
[WARNING] 
[WARNING] For this reason, future Maven versions might no longer support building such malformed
projects.
[WARNING] 
[ERROR] Two or more projects in the reactor have the same identifier, please make sure that
<groupId>:<artifactId>:<version> is unique for each project: {org.apache.cxf.samples:wssec_ut_policy:3.1.3-SNAPSHOT=[<https://builds.apache.org/job/CXF-trunk-deploy/ws/distribution/src/main/release/samples/ws_security/sign_enc_policy/pom.xml,>
<https://builds.apache.org/job/CXF-trunk-deploy/ws/distribution/src/main/release/samples/ws_security/ut_policy/pom.xml]}>
-> [Help 1]
org.apache.maven.DuplicateProjectException: Two or more projects in the reactor have the same
identifier, please make sure that <groupId>:<artifactId>:<version> is unique
for each project: {org.apache.cxf.samples:wssec_ut_policy:3.1.3-SNAPSHOT=[<https://builds.apache.org/job/CXF-trunk-deploy/ws/distribution/src/main/release/samples/ws_security/sign_enc_policy/pom.xml,>
<https://builds.apache.org/job/CXF-trunk-deploy/ws/distribution/src/main/release/samples/ws_security/ut_policy/pom.xml]}>
	at org.apache.maven.DefaultMaven.getProjectMap(DefaultMaven.java:623)
	at org.apache.maven.DefaultMaven.doExecute(DefaultMaven.java:250)
	at org.apache.maven.DefaultMaven.execute(DefaultMaven.java:156)
	at org.jvnet.hudson.maven3.launcher.Maven3Launcher.main(Maven3Launcher.java:117)
	at sun.reflect.NativeMethodAccessorImpl.invoke0(Native Method)
	at sun.reflect.NativeMethodAccessorImpl.invoke(NativeMethodAccessorImpl.java:57)
	at sun.reflect.DelegatingMethodAccessorImpl.invoke(DelegatingMethodAccessorImpl.java:43)
	at java.lang.reflect.Method.invoke(Method.java:606)
	at org.codehaus.plexus.classworlds.launcher.Launcher.launchStandard(Launcher.java:329)
	at org.codehaus.plexus.classworlds.launcher.Launcher.launch(Launcher.java:239)
	at org.jvnet.hudson.maven3.agent.Maven3Main.launch(Maven3Main.java:178)
	at sun.reflect.NativeMethodAccessorImpl.invoke0(Native Method)
	at sun.reflect.NativeMethodAccessorImpl.invoke(NativeMethodAccessorImpl.java:57)
	at sun.reflect.DelegatingMethodAccessorImpl.invoke(DelegatingMethodAccessorImpl.java:43)
	at java.lang.reflect.Method.invoke(Method.java:606)
	at hudson.maven.Maven3Builder.call(Maven3Builder.java:136)
	at hudson.maven.Maven3Builder.call(Maven3Builder.java:71)
	at hudson.remoting.UserRequest.perform(UserRequest.java:118)
	at hudson.remoting.UserRequest.perform(UserRequest.java:48)
	at hudson.remoting.Request$2.run(Request.java:328)
	at hudson.remoting.InterceptingExecutorService$1.call(InterceptingExecutorService.java:72)
	at java.util.concurrent.FutureTask$Sync.innerRun(FutureTask.java:334)
	at java.util.concurrent.FutureTask.run(FutureTask.java:166)
	at java.util.concurrent.ThreadPoolExecutor.runWorker(ThreadPoolExecutor.java:1145)
	at java.util.concurrent.ThreadPoolExecutor$Worker.run(ThreadPoolExecutor.java:615)
	at java.lang.Thread.run(Thread.java:724)
[ERROR] 
[ERROR] Re-run Maven using the -X switch to enable full debug logging.
[ERROR] 
[ERROR] For more information about the errors and possible solutions, please read the following
articles:
[ERROR] [Help 1] http://cwiki.apache.org/confluence/display/MAVEN/DuplicateProjectException
channel stopped

Mime
View raw message