cxf-notifications mailing list archives

Site index · List index
Message view « Date » · « Thread »
Top « Date » · « Thread »
From Apache Jenkins Server <jenk...@builds.apache.org>
Subject Build failed in Jenkins: CXF-3.0-deploy #637
Date Sat, 23 May 2015 07:06:15 GMT
See <https://builds.apache.org/job/CXF-3.0-deploy/637/changes>

Changes:

[sberyozkin] Updating StreamingResponseProvider to support objects dynamically

[coheigea] Recording .gitmergeinfo Changes

[paul] CXF-6138 JAXB unmarshaller Properties get overwriten on a call to initialize()

[dkulp] Update to latest release xjc-utils

[dkulp] Several plugin version updates (but not Surefire as tests are failing with Surefire
2.18.1)

[dkulp] Change how the jaxbcontext is set to work with surefire 2.18.1

[dkulp] Surefire 2.18 allocates and initializes the statics for ALL the test classes up front.
 Thus, the "Server" and similar ports get overwridden and tests fail.  Update TestUtil to
record the port on the various package names walkingup the class so we can start fixing tests.

[dkulp] Fix services/sts/systests/basic with surefire 2.18.1

[dkulp] Update sts/systests/advanced to pass with surefire 2.18.1

[dkulp] Update systests/ws-security-examples to work with surefure 2.18.1

[dkulp] systests/ws-security now pass with latest surefire

[thofman] [CXF-6392] Schema imports are not handled correctly in generated WSDL

[thofman] [CXF-6392] Schema imports are not handled correctly in generated WSDL

[dkulp] Recording .gitmergeinfo Changes

[dkulp] Recording .gitmergeinfo Changes

------------------------------------------
[...truncated 34817 lines...]
[INFO] Apache CXF Runtime WS Policy ...................... SUCCESS [7.341s]
[INFO] Apache CXF Runtime HTTP Transport ................. SUCCESS [8.316s]
[INFO] Apache CXF Runtime Local Transport ................ SUCCESS [6.036s]
[INFO] Apache CXF Runtime HTTP Jetty Transport ........... SUCCESS [5.374s]
[INFO] Apache CXF Runtime Simple Frontend ................ SUCCESS [5.113s]
[INFO] Apache CXF Runtime WS Addressing .................. SUCCESS [3.293s]
[INFO] Apache CXF Runtime JAX-WS Frontend ................ SUCCESS [9.287s]
[INFO] Apache CXF Runtime XmlBeans DataBinding ........... SUCCESS [6.717s]
[INFO] Apache CXF Command Line Tools WSDLTo Test ......... SUCCESS [1.570s]
[INFO] Apache CXF Command Line Tools WSDLTo Misctools .... SUCCESS [4.508s]
[INFO] Apache CXF Command Line Tools ..................... SUCCESS [0.791s]
[INFO] Apache CXF Command Line Tools WSDLTo .............. SUCCESS [0.387s]
[INFO] Apache CXF Runtime Aegis Databinding .............. SUCCESS [5.920s]
[INFO] Apache CXF Command Line Tools JavaTo WS ........... SUCCESS [7.828s]
[INFO] Apache CXF Command Line Tools JavaTo .............. SUCCESS [0.367s]
[INFO] Apache CXF Runtime JAX-RS Frontend ................ SUCCESS [7.799s]
[INFO] Apache CXF Runtime SDO DataBinding ................ SUCCESS [8.433s]
[INFO] Apache CXF JAX-RS Extensions: Providers ........... SUCCESS [7.637s]
[INFO] Apache CXF JAX-RS Service Description ............. SUCCESS [16.252s]
[INFO] Apache CXF Command Line Tools WADLTo JAXRS Frontend  SUCCESS [3.794s]
[INFO] Apache CXF Command Line Tools WADLTo .............. SUCCESS [0.312s]
[INFO] Apache CXF Runtime CORBA Binding .................. SUCCESS [5.837s]
[INFO] Apache CXF Command Line Tools CORBA ............... SUCCESS [7.545s]
[INFO] Apache CXF Runtime JiBX DataBinding ............... SUCCESS [5.775s]
[INFO] Apache CXF Runtime Object Binding ................. SUCCESS [2.173s]
[INFO] Apache CXF Runtime Colocated Binding .............. SUCCESS [2.285s]
[INFO] Apache CXF Runtime ................................ SUCCESS [0.439s]
[INFO] Apache CXF Runtime Bindings ....................... SUCCESS [0.351s]
[INFO] Apache CXF Runtime Clustering ..................... SUCCESS [2.644s]
[INFO] Apache CXF Runtime JavaScript Frontend ............ SUCCESS [2.758s]
[INFO] Apache CXF Runtime HTTP Async Transport ........... SUCCESS [3.659s]
[INFO] Apache CXF Runtime HTTP Netty Server Transport .... SUCCESS [6.185s]
[INFO] Apache CXF Runtime HTTP Netty Client Transport .... SUCCESS [3.378s]
[INFO] Apache CXF Runtime UDP Transport .................. SUCCESS [5.432s]
[INFO] Apache CXF Runtime WebSocket Transport ............ SUCCESS [4.939s]
[INFO] Apache CXF Runtime Security functionality ......... SUCCESS [5.368s]
[INFO] Apache CXF Runtime WS MetadataExchange ............ SUCCESS [3.988s]
[INFO] Apache CXF Runtime WS Security .................... SUCCESS [10.241s]
[INFO] Apache CXF Runtime WS Reliable Messaging .......... SUCCESS [5.861s]
[INFO] Apache CXF Runtime WS Eventing .................... SUCCESS [4.941s]
[INFO] Apache CXF JAX-RS Client .......................... SUCCESS [9.877s]
[INFO] Apache CXF JAX-RS Servlet Container Initializer ... SUCCESS [2.972s]
[INFO] Apache CXF JAX-RS Extensions: Search .............. SUCCESS [23.590s]
[INFO] Apache CXF RS XML Security ........................ SUCCESS [5.575s]
[INFO] Apache CXF Runtime JOSE ........................... SUCCESS [6.211s]
[INFO] Apache CXF Runtime RS Security OAuth Parent ....... SUCCESS [0.944s]
[INFO] Apache CXF Runtime OAuth 1.0a ..................... SUCCESS [4.352s]
[INFO] Apache CXF Runtime OAuth 2.0 ...................... SUCCESS [6.593s]
[INFO] Apache CXF Runtime OAuth 2.0 SAML ................. SUCCESS [5.306s]
[INFO] Apache CXF RS SSO SAML ............................ SUCCESS [6.470s]
[INFO] Apache CXF Runtime OpenId Connect ................. SUCCESS [4.245s]
[INFO] Apache CXF RS Cross-Origin Resource Sharing ....... SUCCESS [4.287s]
[INFO] Apache CXF Runtime Web Management ................. SUCCESS [29.168s]
[INFO] Apache CXF Runtime JavaScript Client Generator Tests  SUCCESS [1.188s]
[INFO] Apache CXF JCA Connection ......................... SUCCESS [4.190s]
[INFO] Apache CXF CDI Integration ........................ SUCCESS [2.991s]
[INFO] Apache CXF Integration ............................ SUCCESS [0.697s]
[INFO] Apache CXF Java2WS Maven2 Plugin .................. SUCCESS [2.511s]
[INFO] Apache CXF Java2WADL Maven2 Plugin ................ SUCCESS [5.565s]
[INFO] Apache CXF WADL2Java Code Generation Maven2 Plugin  SUCCESS [6.826s]
[INFO] Apache CXF CORBA Tools Maven2 Plugins ............. SUCCESS [3.208s]
[INFO] Apache CXF Archetype - Simple JAX-WS Java First ... SUCCESS [6.122s]
[INFO] Apache CXF Archetype - Simple JAX-RS webapp ....... SUCCESS [1.925s]
[INFO] Apache CXF Maven Archetypes ....................... SUCCESS [1.050s]
[INFO] Apache CXF STS Core ............................... SUCCESS [8.572s]
[INFO] Apache CXF STS war deployment ..................... SUCCESS [8.581s]
[INFO] Apache CXF STS basic systests ..................... SUCCESS [6.329s]
[INFO] Apache CXF STS advanced systests .................. SUCCESS [4.948s]
[INFO] Apache CXF Services ............................... SUCCESS [0.340s]
[INFO] Apache CXF STS service ............................ SUCCESS [0.684s]
[INFO] Apache CXF STS systests ........................... SUCCESS [0.579s]
[INFO] Apache CXF WSN API ................................ SUCCESS [9.080s]
[INFO] Apache CXF WSN Core ............................... SUCCESS [4.056s]
[INFO] Apache CXF WSN OSGi ............................... SUCCESS [3.225s]
[INFO] Apache CXF WSN service ............................ SUCCESS [3.724s]
[INFO] Apache CXF WS-Discovery API ....................... SUCCESS [6.468s]
[INFO] Apache CXF WS-Discovery Service ................... SUCCESS [1.445s]
[INFO] Apache CXF WS-Discovery ........................... SUCCESS [0.380s]
[INFO] Apache CXF XKMS Common ............................ SUCCESS [8.454s]
[INFO] Apache CXF XKMS X509 Handlers ..................... SUCCESS [13.948s]
[INFO] Apache CXF XKMS Service ........................... SUCCESS [2.447s]
[INFO] Apache CXF XKMS Client ............................ SUCCESS [4.335s]
[INFO] Apache CXF XKMS Karaf Features .................... SUCCESS [1.191s]
[INFO] Apache CXF XKMS OSGi deployment ................... SUCCESS [1.776s]
[INFO] Apache CXF XKMS LDAP repository ................... SUCCESS [6.051s]
[INFO] Apache CXF XKMS Service war deployment ............ SUCCESS [4.855s]
[INFO] Apache CXF Karaf Parent ........................... SUCCESS [0.650s]
[INFO] Apache CXF Karaf Features ......................... SUCCESS [4.572s]
[INFO] Apache CXF Karaf Commands ......................... SUCCESS [2.910s]
[INFO] Apache CXF XKMS Integration Tests ................. SUCCESS [21.522s]
[INFO] Apache CXF XKMS ................................... SUCCESS [2.085s]
[INFO] Apache CXF Bundle Parent .......................... SUCCESS [1.543s]
[INFO] Apache CXF Compatibility Bundle Jar ............... SUCCESS [13.418s]
[INFO] Apache CXF :: OSGi :: Integration Tests ........... SUCCESS [26.544s]
[INFO] Apache CXF :: OSGi :: Integration Tests pure felix  SUCCESS [6.106s]
[INFO] Apache CXF OSGi parent ............................ SUCCESS [0.860s]
[INFO] Apache CXF Container Integration System Tests ..... SUCCESS [0.668s]
[INFO] Apache CXF Container Integration Test Webapp ...... SUCCESS [5.095s]
[INFO] Apache CXF Container Integration Test Grizzly ..... SUCCESS [8.779s]
[INFO] Apache CXF Uncategorized System Tests ............. SUCCESS [11.234s]
[INFO] Apache CXF Transport System Tests ................. SUCCESS [3.199s]
[INFO] Apache CXF Transport SSL3 System Tests ............ SUCCESS [4.907s]
[INFO] Apache CXF Transport System Tests JMS ............. SUCCESS [4.567s]
[INFO] Apache CXF JAX-WS System Tests .................... SUCCESS [6.226s]
[INFO] Apache CXF Databinding System Tests ............... SUCCESS [5.632s]
[INFO] Apache CXF JAX-RS System Tests .................... SUCCESS [11.434s]
[INFO] Apache CXF WS-* Specifications System Tests ....... SUCCESS [5.036s]
[INFO] Apache CXF WS-RM Specifications System Tests ...... SUCCESS [5.298s]
[INFO] Apache CXF WS-Security System Tests ............... SUCCESS [9.031s]
[INFO] Apache CXF WS-Security Interop System Tests ....... SUCCESS [5.336s]
[INFO] Apache CXF Kerberos Integration System Tests ...... SUCCESS [15.452s]
[INFO] Apache CXF JAX-RS System Advanced Security Tests .. SUCCESS [3.507s]
[INFO] Test for writing wsdl to repo ..................... SUCCESS [4.884s]
[INFO] Test for generating code from wsdl in repo ........ SUCCESS [8.952s]
[INFO] Apache CXF System Tests ........................... SUCCESS [1.442s]
[INFO] Apache CXF System Tests for Maven Plugins ......... SUCCESS [0.559s]
[INFO] Apache CXF CDI Integration System Tests ........... SUCCESS [5.428s]
[INFO] Apache CXF Servlet Container Initializer Integration System Tests  SUCCESS [22.968s]
[INFO] Apache CXF JiBX Integration System Tests .......... SUCCESS [1.367s]
[INFO] Apache CXF JAX-RS JiBX System Tests ............... SUCCESS [9.151s]
[INFO] Apache CXF Data Binding JiBX System Tests ......... SUCCESS [6.611s]
[INFO] Apache CXF Manifest Jar ........................... SUCCESS [3.844s]
[INFO] Apache CXF JavaDoc ................................ SUCCESS [1:54.315s]
[INFO] Apache CXF Samples ................................ SUCCESS [0.598s]
[INFO] Colocated Demo using Document/Literal Style ....... SUCCESS [4.506s]
[INFO] JavaScript Client Demo using Document/Literal Style  FAILURE [0.025s]
[INFO] Generated JavaScript Sample using JAX-WS and JSR-181  SKIPPED
[INFO] Java First demo service using the JAXWSFactoryBeans  SKIPPED
[INFO] Java First demo using JMS ......................... SKIPPED
[INFO] JAX-RS Content Negotiation Demo ................... SKIPPED
[INFO] JAX-RS Basic Demo With HTTPS communications ....... SKIPPED
[INFO] JAX-RS Basic Demo ................................. SKIPPED
[INFO] JAX-RS WebSocket Demo ............................. SKIPPED
[INFO] CXF sample using a callback object ................ SKIPPED
[INFO] WSDL first demo using BARE Style in XML Binding (pure XML over HTTP)  SKIPPED
[INFO] JAX-WS Dispatch/Provider Demo ..................... SKIPPED
[INFO] WSDL first demo using Document/Literal Style and XMLBeans DataBinding  SKIPPED
[INFO] WSDL first demo using SOAP12 in Document/Literal Style  SKIPPED
[INFO] CXF Dynamic Client Sample ......................... SKIPPED
[INFO] JMS Transport Queue Demo using Document-Literal Style  SKIPPED
[INFO] WSDL first demo using the jms transport and jmsConfigFeature  SKIPPED
[INFO] RESTful Hello World Demo .......................... SKIPPED
[INFO] WSDL first demo using Document/Literal Style ...... SKIPPED
[INFO] CXF sample using the Aegis Binding without any webservice  SKIPPED
[INFO] Java First demo using JAX-WS APIs ................. SKIPPED
[INFO] WS-RM Demo ........................................ SKIPPED
[INFO] CXF Sample of Stream GZIP Interceptor ............. SKIPPED
[INFO] Spring HTTP Sample ................................ SKIPPED
[INFO] Spring HTTP Servlet demo with ruby support ........ SKIPPED
[INFO] Spring HTTP Servlet demo with groovy support ...... SKIPPED
[INFO] Hello world javascript demo ....................... SKIPPED
[INFO] CXF WS-Security UT Demo ........................... SKIPPED
[INFO] CXF WS-Security Sign Encoding Demo ................ SKIPPED
[INFO] WS-Security UT Policy Demo ........................ SKIPPED
[INFO] MTOM Demo for SWA and XOP ......................... SKIPPED
[INFO] JAX-WS Asynchronous Demo using Document/Literal Style  SKIPPED
[INFO] Java First POJO Sample ............................ SKIPPED
[INFO] WS-Policy Demo .................................... SKIPPED
[INFO] Hello World Client Demo using JavaScript .......... SKIPPED
[INFO] WSDL first demo using HTTPS ....................... SKIPPED
[INFO] WS-Addressing Demo ................................ SKIPPED
[INFO] Sample using SOAP Headers ......................... SKIPPED
[INFO] SOAP/JMS Transport Specification Demo using Document-Literal Style  SKIPPED
[INFO] CXF sample using WRAPPED Style in XML Binding (pure XML over HTTP)  SKIPPED
[INFO] CXF sample using code first POJO's and the Aegis Binding  SKIPPED
[INFO] Sample of JAX-* Service Using an Aegis Client ..... SKIPPED
[INFO] JAX-WS Handler Demo ............................... SKIPPED
[INFO] WSDL first demo using RPC-Literal Style ........... SKIPPED
[INFO] JMS Transport Publish/Subscribe Demo using Document-Literal Style  SKIPPED
[INFO] JAX-RS Spring Security Demo ....................... SKIPPED
[INFO] Apache CXF Samples LogBrowser ..................... SKIPPED
[INFO] Apache CXF Samples LogBrowser Blueprint ........... SKIPPED
[INFO] WS-Notification Demo .............................. SKIPPED
[INFO] CXF STS Demo ...................................... SKIPPED
[INFO] Bank sample using JAX-WS API's to talk via CORBA/IIOP  SKIPPED
[INFO] Bank sample using JAX-WS API's to talk via CORBA/IIOP  SKIPPED
[INFO] hello-world sample using JAX-WS API's to talk via CORBA/IIOP  SKIPPED
[INFO] OAuth 1.0a server ................................. SKIPPED
[INFO] OAuth 1.0a client ................................. SKIPPED
[INFO] JAX-RS Minimal OSGI Demo .......................... SKIPPED
[INFO] WS-Discovery Sample ............................... SKIPPED
[INFO] WS-Eventing Demo .................................. SKIPPED
[INFO] Apache CXF Distribution ........................... SKIPPED
[INFO] ------------------------------------------------------------------------
[INFO] BUILD FAILURE
[INFO] ------------------------------------------------------------------------
[INFO] Total time: 17:12.093s
[INFO] Finished at: Sat May 23 07:05:46 UTC 2015
[INFO] Final Memory: 219M/555M
[INFO] ------------------------------------------------------------------------
[ERROR] Failed to execute goal org.apache.cxf:cxf-codegen-plugin:3.0.6-SNAPSHOT:wsdl2java
(generate-sources) on project js_browser_client_simple: Execution generate-sources of goal
org.apache.cxf:cxf-codegen-plugin:3.0.6-SNAPSHOT:wsdl2java failed: A required class was missing
while executing org.apache.cxf:cxf-codegen-plugin:3.0.6-SNAPSHOT:wsdl2java: org/apache/commons/logging/LogFactory
[ERROR] -----------------------------------------------------
[ERROR] realm =    plugin>org.apache.cxf:cxf-codegen-plugin:3.0.6-SNAPSHOT-1673433661
[ERROR] strategy = org.codehaus.plexus.classworlds.strategy.SelfFirstStrategy
[ERROR] urls[0] = file:/x1/jenkins/jenkins-slave/workspace/CXF-3.0-deploy/maven-plugins/codegen-plugin/target/cxf-codegen-plugin-3.0.6-SNAPSHOT.jar
[ERROR] urls[1] = <https://builds.apache.org/job/CXF-3.0-deploy/ws/.repository/org/apache/maven/shared/maven-artifact-resolver/1.0/maven-artifact-resolver-1.0.jar>
[ERROR] urls[2] = <https://builds.apache.org/job/CXF-3.0-deploy/ws/.repository/org/codehaus/plexus/plexus-utils/2.0.5/plexus-utils-2.0.5.jar>
[ERROR] urls[3] = <https://builds.apache.org/job/CXF-3.0-deploy/ws/.repository/org/codehaus/plexus/plexus-archiver/1.2/plexus-archiver-1.2.jar>
[ERROR] urls[4] = <https://builds.apache.org/job/CXF-3.0-deploy/ws/.repository/org/codehaus/plexus/plexus-io/1.0.1/plexus-io-1.0.1.jar>
[ERROR] urls[5] = file:/x1/jenkins/jenkins-slave/workspace/CXF-3.0-deploy/core/target/cxf-core-3.0.6-SNAPSHOT.jar
[ERROR] urls[6] = <https://builds.apache.org/job/CXF-3.0-deploy/ws/.repository/org/codehaus/woodstox/woodstox-core-asl/4.4.1/woodstox-core-asl-4.4.1.jar>
[ERROR] urls[7] = <https://builds.apache.org/job/CXF-3.0-deploy/ws/.repository/org/codehaus/woodstox/stax2-api/3.1.4/stax2-api-3.1.4.jar>
[ERROR] urls[8] = <https://builds.apache.org/job/CXF-3.0-deploy/ws/.repository/org/apache/ws/xmlschema/xmlschema-core/2.2.1/xmlschema-core-2.2.1.jar>
[ERROR] urls[9] = file:/x1/jenkins/jenkins-slave/workspace/CXF-3.0-deploy/tools/common/target/cxf-tools-common-3.0.6-SNAPSHOT.jar
[ERROR] urls[10] = <https://builds.apache.org/job/CXF-3.0-deploy/ws/.repository/org/apache/velocity/velocity/1.7/velocity-1.7.jar>
[ERROR] urls[11] = <https://builds.apache.org/job/CXF-3.0-deploy/ws/.repository/commons-collections/commons-collections/3.2.1/commons-collections-3.2.1.jar>
[ERROR] urls[12] = <https://builds.apache.org/job/CXF-3.0-deploy/ws/.repository/commons-lang/commons-lang/2.6/commons-lang-2.6.jar>
[ERROR] urls[13] = <https://builds.apache.org/job/CXF-3.0-deploy/ws/.repository/wsdl4j/wsdl4j/1.6.3/wsdl4j-1.6.3.jar>
[ERROR] urls[14] = <https://builds.apache.org/job/CXF-3.0-deploy/ws/.repository/com/sun/xml/bind/jaxb-xjc/2.1.14/jaxb-xjc-2.1.14.jar>
[ERROR] urls[15] = <https://builds.apache.org/job/CXF-3.0-deploy/ws/.repository/com/sun/xml/bind/jaxb-core/2.1.14/jaxb-core-2.1.14.jar>
[ERROR] urls[16] = <https://builds.apache.org/job/CXF-3.0-deploy/ws/.repository/javax/xml/bind/jaxb-api/2.1/jaxb-api-2.1.jar>
[ERROR] urls[17] = <https://builds.apache.org/job/CXF-3.0-deploy/ws/.repository/com/sun/xml/bind/jaxb-impl/2.1.14/jaxb-impl-2.1.14.jar>
[ERROR] urls[18] = <https://builds.apache.org/job/CXF-3.0-deploy/ws/.repository/com/sun/xml/fastinfoset/FastInfoset/1.2.13/FastInfoset-1.2.13.jar>
[ERROR] urls[19] = file:/x1/jenkins/jenkins-slave/workspace/CXF-3.0-deploy/tools/wsdlto/core/target/cxf-tools-wsdlto-core-3.0.6-SNAPSHOT.jar
[ERROR] urls[20] = file:/x1/jenkins/jenkins-slave/workspace/CXF-3.0-deploy/tools/validator/target/cxf-tools-validator-3.0.6-SNAPSHOT.jar
[ERROR] urls[21] = file:/x1/jenkins/jenkins-slave/workspace/CXF-3.0-deploy/rt/bindings/soap/target/cxf-rt-bindings-soap-3.0.6-SNAPSHOT.jar
[ERROR] urls[22] = file:/x1/jenkins/jenkins-slave/workspace/CXF-3.0-deploy/rt/databinding/jaxb/target/cxf-rt-databinding-jaxb-3.0.6-SNAPSHOT.jar
[ERROR] urls[23] = file:/x1/jenkins/jenkins-slave/workspace/CXF-3.0-deploy/rt/wsdl/target/cxf-rt-wsdl-3.0.6-SNAPSHOT.jar
[ERROR] urls[24] = <https://builds.apache.org/job/CXF-3.0-deploy/ws/.repository/asm/asm/3.3.1/asm-3.3.1.jar>
[ERROR] urls[25] = file:/x1/jenkins/jenkins-slave/workspace/CXF-3.0-deploy/tools/wsdlto/databinding/jaxb/target/cxf-tools-wsdlto-databinding-jaxb-3.0.6-SNAPSHOT.jar
[ERROR] urls[26] = file:/x1/jenkins/jenkins-slave/workspace/CXF-3.0-deploy/tools/wsdlto/frontend/jaxws/target/cxf-tools-wsdlto-frontend-jaxws-3.0.6-SNAPSHOT.jar
[ERROR] urls[27] = <https://builds.apache.org/job/CXF-3.0-deploy/ws/.repository/xml-resolver/xml-resolver/1.2/xml-resolver-1.2.jar>
[ERROR] urls[28] = file:/x1/jenkins/jenkins-slave/workspace/CXF-3.0-deploy/tools/wsdlto/frontend/javascript/target/cxf-tools-wsdlto-frontend-javascript-3.0.6-SNAPSHOT.jar
[ERROR] urls[29] = file:/x1/jenkins/jenkins-slave/workspace/CXF-3.0-deploy/rt/javascript/javascript-rt/target/cxf-rt-javascript-3.0.6-SNAPSHOT.jar
[ERROR] urls[30] = <https://builds.apache.org/job/CXF-3.0-deploy/ws/.repository/org/springframework/spring-core/3.2.6.RELEASE/spring-core-3.2.6.RELEASE.jar>
[ERROR] urls[31] = <https://builds.apache.org/job/CXF-3.0-deploy/ws/.repository/org/springframework/spring-beans/3.2.6.RELEASE/spring-beans-3.2.6.RELEASE.jar>
[ERROR] urls[32] = <https://builds.apache.org/job/CXF-3.0-deploy/ws/.repository/org/springframework/spring-context/3.2.6.RELEASE/spring-context-3.2.6.RELEASE.jar>
[ERROR] urls[33] = <https://builds.apache.org/job/CXF-3.0-deploy/ws/.repository/org/springframework/spring-aop/3.2.6.RELEASE/spring-aop-3.2.6.RELEASE.jar>
[ERROR] urls[34] = <https://builds.apache.org/job/CXF-3.0-deploy/ws/.repository/aopalliance/aopalliance/1.0/aopalliance-1.0.jar>
[ERROR] urls[35] = <https://builds.apache.org/job/CXF-3.0-deploy/ws/.repository/org/springframework/spring-expression/3.2.6.RELEASE/spring-expression-3.2.6.RELEASE.jar>
[ERROR] urls[36] = <https://builds.apache.org/job/CXF-3.0-deploy/ws/.repository/org/apache/ant/ant/1.8.4/ant-1.8.4.jar>
[ERROR] urls[37] = <https://builds.apache.org/job/CXF-3.0-deploy/ws/.repository/org/apache/ant/ant-launcher/1.8.4/ant-launcher-1.8.4.jar>
[ERROR] urls[38] = <https://builds.apache.org/job/CXF-3.0-deploy/ws/.repository/org/apache/ant/ant-nodeps/1.8.1/ant-nodeps-1.8.1.jar>
[ERROR] urls[39] = <https://builds.apache.org/job/CXF-3.0-deploy/ws/.repository/org/sonatype/plexus/plexus-build-api/0.0.7/plexus-build-api-0.0.7.jar>
[ERROR] Number of foreign imports: 1
[ERROR] import: Entry[import  from realm ClassRealm[maven.api, parent: null]]
[ERROR] 
[ERROR] -----------------------------------------------------: org.apache.commons.logging.LogFactory
[ERROR] -> [Help 1]
[ERROR] 
[ERROR] To see the full stack trace of the errors, re-run Maven with the -e switch.
[ERROR] Re-run Maven using the -X switch to enable full debug logging.
[ERROR] 
[ERROR] For more information about the errors and possible solutions, please read the following
articles:
[ERROR] [Help 1] http://cwiki.apache.org/confluence/display/MAVEN/PluginContainerException
[ERROR] 
[ERROR] After correcting the problems, you can resume the build with the command
[ERROR]   mvn <goals> -rf :js_browser_client_simple
Build step 'Invoke top-level Maven targets' marked build as failure

Mime
View raw message