cxf-notifications mailing list archives

Site index · List index
Message view « Date » · « Thread »
Top « Date » · « Thread »
From Apache Jenkins Server <jenk...@builds.apache.org>
Subject Build failed in Jenkins: CXF-3.0-deploy #634
Date Wed, 20 May 2015 07:11:44 GMT
See <https://builds.apache.org/job/CXF-3.0-deploy/634/changes>

Changes:

[sberyozkin] [CXF-6411] Initial improvements

[sberyozkin] [CXF-6411] Removing the test listener

[sberyozkin] [CXF-6411] Adding few blueprint.handlers resource, test to be optimized later

[coheigea] Recording .gitmergeinfo Changes

[sberyozkin] [CXF-6402] One more update

[sberyozkin] [CXF-6402] Fixing checkstyle issues

[sberyozkin] [CXF-6408] Preventing NPE

[ay] [CXF-6406] WS-RM persistence with RMTxStore does not work with JNDI Lookup

[coheigea] [CXF-6414] - Add a way of including TLS protocols in the Jetty server

[coheigea] Recording .gitmergeinfo Changes

[coheigea] Reverting change to the Jetty Server Engine

[coheigea] Fixing backmerge for 3.0

------------------------------------------
[...truncated 42226 lines...]
[ERROR] <https://builds.apache.org/job/CXF-3.0-deploy/ws/distribution/javadoc/target/sources/org/apache/cxf/xkms/model/xmldsig/ObjectFactory.java>:467:
warning - Tag @link: reference not found: byte[]
[ERROR] <https://builds.apache.org/job/CXF-3.0-deploy/ws/distribution/javadoc/target/sources/org/apache/cxf/xkms/model/xmldsig/ObjectFactory.java>:476:
warning - Tag @link: reference not found: byte[]
[ERROR] <https://builds.apache.org/job/CXF-3.0-deploy/ws/distribution/javadoc/target/sources/org/apache/cxf/xkms/model/xmldsig/ObjectFactory.java>:485:
warning - Tag @link: reference not found: byte[]
[ERROR] <https://builds.apache.org/job/CXF-3.0-deploy/ws/distribution/javadoc/target/sources/org/apache/cxf/xkms/model/xmldsig/ObjectFactory.java>:521:
warning - Tag @link: reference not found: byte[]
[ERROR] <https://builds.apache.org/job/CXF-3.0-deploy/ws/distribution/javadoc/target/sources/org/apache/cxf/xkms/model/xmldsig/ObjectFactory.java>:530:
warning - Tag @link: reference not found: byte[]
[ERROR] <https://builds.apache.org/job/CXF-3.0-deploy/ws/distribution/javadoc/target/sources/org/apache/cxf/xkms/model/xmldsig/ObjectFactory.java>:548:
warning - Tag @link: reference not found: byte[]
[ERROR] <https://builds.apache.org/job/CXF-3.0-deploy/ws/distribution/javadoc/target/sources/org/apache/cxf/xkms/model/xmldsig/PGPDataType.java>:91:
warning - Tag @link: reference not found: byte[]
[ERROR] <https://builds.apache.org/job/CXF-3.0-deploy/ws/distribution/javadoc/target/sources/org/apache/cxf/xkms/model/xmldsig/PGPDataType.java>:91:
warning - Tag @link: reference not found: byte[]
[ERROR] <https://builds.apache.org/job/CXF-3.0-deploy/ws/distribution/javadoc/target/sources/org/apache/cxf/xkms/model/xmldsig/SPKIDataType.java>:69:
warning - Tag @link: reference not found: byte[]
[ERROR] <https://builds.apache.org/job/CXF-3.0-deploy/ws/distribution/javadoc/target/sources/org/apache/cxf/xkms/model/xmldsig/X509DataType.java>:86:
warning - Tag @link: reference not found: byte[]
[ERROR] <https://builds.apache.org/job/CXF-3.0-deploy/ws/distribution/javadoc/target/sources/org/apache/cxf/xkms/model/xmldsig/X509DataType.java>:86:
warning - Tag @link: reference not found: byte[]
[ERROR] <https://builds.apache.org/job/CXF-3.0-deploy/ws/distribution/javadoc/target/sources/org/apache/cxf/xkms/model/xmldsig/X509DataType.java>:86:
warning - Tag @link: reference not found: byte[]
[ERROR] <https://builds.apache.org/job/CXF-3.0-deploy/ws/distribution/javadoc/target/sources/org/apache/cxf/transport/http/asyncclient/SharedInputBuffer.java>:48:
warning - Tag @link: can't find consumeContent(ContentDecoder) in org.apache.cxf.transport.http.asyncclient.SharedInputBuffer
[ERROR] <https://builds.apache.org/job/CXF-3.0-deploy/ws/distribution/javadoc/target/sources/org/apache/cxf/transport/http/asyncclient/SharedOutputBuffer.java>:49:
warning - Tag @link: can't find produceContent(ContentEncoder) in org.apache.cxf.transport.http.asyncclient.SharedOutputBuffer
[ERROR] <https://builds.apache.org/job/CXF-3.0-deploy/ws/distribution/javadoc/target/sources/org/apache/cxf/jaxrs/provider/xmlbeans/XMLBeanStreamSerializer.java>:51:
warning - @param argument "obj" is not a parameter name.
[ERROR] <https://builds.apache.org/job/CXF-3.0-deploy/ws/distribution/javadoc/target/sources/org/apache/cxf/aegis/util/NamespaceHelper.java>:181:
warning - @return tag has no arguments.
[ERROR] <https://builds.apache.org/job/CXF-3.0-deploy/ws/distribution/javadoc/target/sources/org/apache/cxf/aegis/util/NamespaceHelper.java>:291:
warning - @return tag has no arguments.
[ERROR] <https://builds.apache.org/job/CXF-3.0-deploy/ws/distribution/javadoc/target/sources/org/apache/cxf/aegis/util/NamespaceHelper.java>:54:
warning - @param argument "nsUri" is not a parameter name.
[ERROR] <https://builds.apache.org/job/CXF-3.0-deploy/ws/distribution/javadoc/target/sources/org/apache/cxf/aegis/util/NamespaceHelper.java>:82:
warning - @param argument "nsUri" is not a parameter name.
[ERROR] <https://builds.apache.org/job/CXF-3.0-deploy/ws/distribution/javadoc/target/sources/org/apache/cxf/ws/addressing/soap/MAPCodec.java>:469:
warning - @param argument "the" is not a parameter name.
[ERROR] <https://builds.apache.org/job/CXF-3.0-deploy/ws/distribution/javadoc/target/sources/org/apache/cxf/ws/addressing/soap/MAPCodec.java>:628:
warning - @param argument "marshaller" is not a parameter name.
[ERROR] <https://builds.apache.org/job/CXF-3.0-deploy/ws/distribution/javadoc/target/sources/org/apache/cxf/ws/addressing/soap/MAPCodec.java>:690:
warning - @param argument "header" is not a parameter name.
[ERROR] <https://builds.apache.org/job/CXF-3.0-deploy/ws/distribution/javadoc/target/sources/org/apache/cxf/ws/addressing/soap/MAPCodec.java>:690:
warning - @param argument "marshaller" is not a parameter name.
[ERROR] <https://builds.apache.org/job/CXF-3.0-deploy/ws/distribution/javadoc/target/sources/org/apache/cxf/ws/addressing/soap/MAPCodec.java>:710:
warning - @param argument "marshaller" is not a parameter name.
[ERROR] <https://builds.apache.org/job/CXF-3.0-deploy/ws/distribution/javadoc/target/sources/org/apache/cxf/ws/addressing/soap/VersionTransformer.java>:84:
warning - @param argument "header" is not a parameter name.
[ERROR] <https://builds.apache.org/job/CXF-3.0-deploy/ws/distribution/javadoc/target/sources/org/apache/cxf/ws/addressing/soap/VersionTransformer.java>:138:
warning - @param argument "marshaller" is not a parameter name.
[ERROR] <https://builds.apache.org/job/CXF-3.0-deploy/ws/distribution/javadoc/target/sources/org/apache/cxf/common/logging/Slf4jLogger.java>:50:
warning - Tag @link: reference not found: org.slf4j.bridge.SLF4JBridgeHandler
[ERROR] <https://builds.apache.org/job/CXF-3.0-deploy/ws/distribution/javadoc/target/sources/org/apache/cxf/rs/security/oauth/data/Permission.java>:62:
warning - @param argument "isDefault" is not a parameter name.
[ERROR] <https://builds.apache.org/job/CXF-3.0-deploy/ws/distribution/javadoc/target/sources/org/apache/cxf/rs/security/oauth/data/RequestToken.java>:46:
warning - @param argument "oauthVerifier" is not a parameter name.
[ERROR] <https://builds.apache.org/job/CXF-3.0-deploy/ws/distribution/javadoc/target/sources/org/apache/cxf/ws/rm/soap/RetransmissionQueueImpl.java>:862:
warning - @return tag has no arguments.
[ERROR] <https://builds.apache.org/job/CXF-3.0-deploy/ws/distribution/javadoc/target/sources/org/apache/cxf/ws/rm/soap/RetransmissionQueueImpl.java>:902:
warning - @return tag has no arguments.
[ERROR] <https://builds.apache.org/job/CXF-3.0-deploy/ws/distribution/javadoc/target/sources/org/apache/cxf/ws/rm/soap/RetransmissionQueueImpl.java>:333:
warning - @param argument "ctx" is not a parameter name.
[ERROR] <https://builds.apache.org/job/CXF-3.0-deploy/ws/distribution/javadoc/target/sources/org/apache/cxf/ws/rm/soap/RetransmissionQueueImpl.java>:377:
warning - @pre is an unknown tag.
[ERROR] <https://builds.apache.org/job/CXF-3.0-deploy/ws/distribution/javadoc/target/sources/org/apache/cxf/ws/rm/soap/RetransmissionQueueImpl.java>:386:
warning - @pre is an unknown tag.
[ERROR] <https://builds.apache.org/job/CXF-3.0-deploy/ws/distribution/javadoc/target/sources/org/apache/cxf/ws/rm/soap/RetransmissionQueueImpl.java>:399:
warning - @pre is an unknown tag.
[ERROR] <https://builds.apache.org/job/CXF-3.0-deploy/ws/distribution/javadoc/target/sources/org/apache/cxf/ws/rm/soap/RetransmissionQueueImpl.java>:422:
warning - @param argument "ctx" is not a parameter name.
[ERROR] <https://builds.apache.org/job/CXF-3.0-deploy/ws/distribution/javadoc/target/sources/org/apache/cxf/ws/rm/soap/RetransmissionQueueImpl.java>:651:
warning - @param argument "if" is not a parameter name.
[ERROR] <https://builds.apache.org/job/CXF-3.0-deploy/ws/distribution/javadoc/target/sources/org/apache/cxf/aegis/type/TypeCreator.java>:72:
warning - @return tag has no arguments.
[ERROR] <https://builds.apache.org/job/CXF-3.0-deploy/ws/distribution/javadoc/target/sources/org/apache/cxf/aegis/type/TypeCreator.java>:36:
warning - @return tag has no arguments.
[ERROR] <https://builds.apache.org/job/CXF-3.0-deploy/ws/distribution/javadoc/target/sources/org/apache/cxf/aegis/type/DefaultTypeMapping.java>:357:
warning - @return tag has no arguments.
[ERROR] <https://builds.apache.org/job/CXF-3.0-deploy/ws/distribution/javadoc/target/sources/org/apache/cxf/aegis/type/DefaultTypeMapping.java>:307:
warning - @return tag has no arguments.
[ERROR] <https://builds.apache.org/job/CXF-3.0-deploy/ws/distribution/javadoc/target/sources/org/apache/cxf/aegis/type/TypeCreationOptions.java>:75:
warning - @return tag has no arguments.
[ERROR] <https://builds.apache.org/job/CXF-3.0-deploy/ws/distribution/javadoc/target/sources/org/apache/cxf/aegis/type/TypeCreationOptions.java>:51:
warning - @return tag has no arguments.
[ERROR] <https://builds.apache.org/job/CXF-3.0-deploy/ws/distribution/javadoc/target/sources/org/apache/cxf/aegis/type/TypeCreationOptions.java>:63:
warning - @return tag has no arguments.
[ERROR] <https://builds.apache.org/job/CXF-3.0-deploy/ws/distribution/javadoc/target/sources/org/apache/cxf/aegis/type/TypeCreationOptions.java>:87:
warning - @return tag has no arguments.
[ERROR] <https://builds.apache.org/job/CXF-3.0-deploy/ws/distribution/javadoc/target/sources/org/apache/cxf/aegis/type/TypeCreationOptions.java>:119:
warning - @return tag has no arguments.
[ERROR] <https://builds.apache.org/job/CXF-3.0-deploy/ws/distribution/javadoc/target/sources/org/apache/cxf/aegis/type/TypeCreationOptions.java>:101:
warning - @return tag has no arguments.
[ERROR] <https://builds.apache.org/job/CXF-3.0-deploy/ws/distribution/javadoc/target/sources/org/apache/cxf/aegis/type/TypeUtil.java>:104:
warning - @return tag has no arguments.
[ERROR] <https://builds.apache.org/job/CXF-3.0-deploy/ws/distribution/javadoc/target/sources/org/apache/cxf/aegis/type/TypeUtil.java>:243:
warning - @return tag has no arguments.
[ERROR] <https://builds.apache.org/job/CXF-3.0-deploy/ws/distribution/javadoc/target/sources/org/apache/cxf/aegis/type/TypeUtil.java>:172:
warning - @return tag has no arguments.
[ERROR] <https://builds.apache.org/job/CXF-3.0-deploy/ws/distribution/javadoc/target/sources/org/apache/cxf/rs/security/cors/CrossOriginResourceSharingFilter.java>:75:
warning - @LocalPreflight is an unknown tag.
[ERROR] <https://builds.apache.org/job/CXF-3.0-deploy/ws/distribution/javadoc/target/sources/org/apache/cxf/rs/security/cors/CrossOriginResourceSharingFilter.java>:620:
warning - Tag @link: reference not found: CrossResourceSharing
[ERROR] <https://builds.apache.org/job/CXF-3.0-deploy/ws/distribution/javadoc/target/sources/org/apache/cxf/rs/security/cors/CrossOriginResourceSharingFilter.java>:620:
warning - Tag @link: reference not found: CrossResourceSharing
[ERROR] <https://builds.apache.org/job/CXF-3.0-deploy/ws/distribution/javadoc/target/sources/org/apache/cxf/jca/inbound/DispatchMDBInvoker.java>:49:
warning - @param argument "messageEndpoint" is not a parameter name.
[ERROR] <https://builds.apache.org/job/CXF-3.0-deploy/ws/distribution/javadoc/target/sources/org/apache/cxf/jca/inbound/DispatchMDBMessageListener.java>:40:
warning - @return tag has no arguments.
[ERROR] <https://builds.apache.org/job/CXF-3.0-deploy/ws/distribution/javadoc/target/sources/org/apache/cxf/jca/inbound/MDBInvoker.java>:42:
warning - Tag @link: reference not found: DispatchMBDInvoker
[ERROR] <https://builds.apache.org/job/CXF-3.0-deploy/ws/distribution/javadoc/target/sources/org/apache/cxf/jca/inbound/MDBInvoker.java>:52:
warning - @param argument "messageEndpoint" is not a parameter name.
[ERROR] <https://builds.apache.org/job/CXF-3.0-deploy/ws/distribution/javadoc/target/sources/org/apache/cxf/tools/common/AbstractCXFToolContainer.java>:266:
warning - @param argument "stringArrayKeys," is not a parameter name.
[ERROR] <https://builds.apache.org/job/CXF-3.0-deploy/ws/distribution/javadoc/target/sources/org/apache/cxf/tools/common/ToolContext.java>:124:
warning - @return tag has no arguments.
[ERROR] <https://builds.apache.org/job/CXF-3.0-deploy/ws/distribution/javadoc/target/sources/org/apache/cxf/jaxrs/utils/JAXRSUtils.java>:1227:
warning - @param argument "message" is not a parameter name.
[ERROR] <https://builds.apache.org/job/CXF-3.0-deploy/ws/distribution/javadoc/target/sources/org/apache/cxf/jaxrs/utils/JAXRSUtils.java>:1438:
warning - @param argument "mimeTypesA" is not a parameter name.
[ERROR] <https://builds.apache.org/job/CXF-3.0-deploy/ws/distribution/javadoc/target/sources/org/apache/cxf/jaxrs/utils/JAXRSUtils.java>:1438:
warning - @param argument "mimeTypesB" is not a parameter name.
[ERROR] <https://builds.apache.org/job/CXF-3.0-deploy/ws/distribution/javadoc/target/sources/org/apache/cxf/xkms/crypto/CryptoProviderFactory.java>:49:
warning - @return tag has no arguments.
[ERROR] <https://builds.apache.org/job/CXF-3.0-deploy/ws/distribution/javadoc/target/sources/org/apache/cxf/xkms/crypto/CryptoProviderFactory.java>:33:
warning - @return tag has no arguments.
[ERROR] <https://builds.apache.org/job/CXF-3.0-deploy/ws/distribution/javadoc/target/sources/org/apache/cxf/xkms/crypto/CryptoProviderFactory.java>:58:
warning - @return tag has no arguments.
[ERROR] <https://builds.apache.org/job/CXF-3.0-deploy/ws/distribution/javadoc/target/sources/org/apache/cxf/xkms/crypto/CryptoProviderFactory.java>:67:
warning - @return tag has no arguments.
[ERROR] <https://builds.apache.org/job/CXF-3.0-deploy/ws/distribution/javadoc/target/sources/org/apache/cxf/xkms/crypto/CryptoProviderFactory.java>:77:
warning - @return tag has no arguments.
[ERROR] <https://builds.apache.org/job/CXF-3.0-deploy/ws/distribution/javadoc/target/sources/org/apache/cxf/aegis/type/mtom/AbstractXOPType.java>:195:
warning - @return tag has no arguments.
[ERROR] <https://builds.apache.org/job/CXF-3.0-deploy/ws/distribution/javadoc/target/sources/org/apache/cxf/aegis/type/mtom/AbstractXOPType.java>:88:
warning - @return tag has no arguments.
[ERROR] <https://builds.apache.org/job/CXF-3.0-deploy/ws/distribution/javadoc/target/sources/org/apache/cxf/aegis/type/mtom/AbstractXOPType.java>:189:
warning - @return tag has no arguments.
[ERROR] <https://builds.apache.org/job/CXF-3.0-deploy/ws/distribution/javadoc/target/sources/org/apache/cxf/transport/http_jetty/JettyHTTPDestination.java>:90:
warning - @param argument "b" is not a parameter name.
[ERROR] <https://builds.apache.org/job/CXF-3.0-deploy/ws/distribution/javadoc/target/sources/org/apache/cxf/transport/http_jetty/JettyHTTPServerEngine.java>:176:
warning - @return tag has no arguments.
[ERROR] <https://builds.apache.org/job/CXF-3.0-deploy/ws/distribution/javadoc/target/sources/org/apache/cxf/transport/http_jetty/JettyHTTPServerEngine.java>:168:
warning - @return tag has no arguments.
[ERROR] <https://builds.apache.org/job/CXF-3.0-deploy/ws/distribution/javadoc/target/sources/org/apache/cxf/transport/http_jetty/JettyHTTPServerEngine.java>:231:
warning - @return tag has no arguments.
[ERROR] <https://builds.apache.org/job/CXF-3.0-deploy/ws/distribution/javadoc/target/sources/org/apache/cxf/transport/http_jetty/JettyHTTPServerEngine.java>:757:
warning - @return tag has no arguments.
[ERROR] <https://builds.apache.org/job/CXF-3.0-deploy/ws/distribution/javadoc/target/sources/org/apache/cxf/transport/http_jetty/JettyHTTPServerEngineFactory.java>:265:
warning - @return tag has no arguments.
[ERROR] <https://builds.apache.org/job/CXF-3.0-deploy/ws/distribution/javadoc/target/sources/org/apache/cxf/jaxrs/ext/multipart/AttachmentBuilder.java>:74:
warning - @return tag has no arguments.
[ERROR] <https://builds.apache.org/job/CXF-3.0-deploy/ws/distribution/javadoc/target/sources/org/apache/cxf/frontend/ServerFactoryBean.java>:349:
warning - @param argument "locaiton" is not a parameter name.
[ERROR] <https://builds.apache.org/job/CXF-3.0-deploy/ws/distribution/javadoc/target/sources/org/apache/cxf/tools/corba/processors/idl/TypesUtils.java>:46:
warning - @return tag has no arguments.
[ERROR] <https://builds.apache.org/job/CXF-3.0-deploy/ws/distribution/javadoc/target/sources/org/apache/cxf/jaxrs/client/ClientConfiguration.java>:174:
warning - Tag @link: reference not found: WebApplicationException
[ERROR] <https://builds.apache.org/job/CXF-3.0-deploy/ws/distribution/javadoc/target/sources/org/apache/cxf/jaxrs/client/ClientConfiguration.java>:185:
warning - Tag @link: reference not found: ClientException
[ERROR] <https://builds.apache.org/job/CXF-3.0-deploy/ws/distribution/javadoc/target/sources/org/apache/cxf/jaxrs/client/ClientConfiguration.java>:174:
warning - Tag @link: reference not found: WebApplicationException
[ERROR] <https://builds.apache.org/job/CXF-3.0-deploy/ws/distribution/javadoc/target/sources/org/apache/cxf/jaxrs/client/ClientConfiguration.java>:185:
warning - Tag @link: reference not found: ClientException
[ERROR] <https://builds.apache.org/job/CXF-3.0-deploy/ws/distribution/javadoc/target/sources/org/apache/cxf/jaxrs/client/ClientState.java>:48:
warning - @return tag has no arguments.
[ERROR] <https://builds.apache.org/job/CXF-3.0-deploy/ws/distribution/javadoc/target/sources/org/apache/cxf/jaxrs/client/ClientState.java>:90:
warning - @param argument "templates" is not a parameter name.
[ERROR] <https://builds.apache.org/job/CXF-3.0-deploy/ws/distribution/javadoc/target/sources/org/apache/cxf/jaxrs/client/JAXRSClientFactoryBean.java>:102:
warning - @param argument "secondsToKeepState" is not a parameter name.
[ERROR] <https://builds.apache.org/job/CXF-3.0-deploy/ws/distribution/javadoc/target/sources/org/apache/cxf/jaxrs/client/JAXRSClientFactoryBean.java>:176:
warning - @param argument "cls" is not a parameter name.
[ERROR] <https://builds.apache.org/job/CXF-3.0-deploy/ws/distribution/javadoc/target/sources/org/apache/cxf/jaxrs/client/WebClient.java>:137:
warning - @param argument "baseURI" is not a parameter name.
[ERROR] <https://builds.apache.org/job/CXF-3.0-deploy/ws/distribution/javadoc/target/sources/org/apache/cxf/jaxrs/client/WebClient.java>:146:
warning - @param argument "baseURI" is not a parameter name.
[ERROR] <https://builds.apache.org/job/CXF-3.0-deploy/ws/distribution/javadoc/target/sources/org/apache/cxf/jaxrs/client/WebClient.java>:161:
warning - @param argument "baseURI" is not a parameter name.
[ERROR] <https://builds.apache.org/job/CXF-3.0-deploy/ws/distribution/javadoc/target/sources/org/apache/cxf/jaxrs/client/WebClient.java>:252:
warning - @param argument "client" is not a parameter name.
[ERROR] <https://builds.apache.org/job/CXF-3.0-deploy/ws/distribution/javadoc/target/sources/org/apache/cxf/jaxrs/client/WebClient.java>:576:
warning - @param argument "memberClass" is not a parameter name.
[ERROR] <https://builds.apache.org/job/CXF-3.0-deploy/ws/distribution/javadoc/target/sources/org/apache/cxf/jaxrs/client/WebClient.java>:599:
warning - @param argument "body" is not a parameter name.
[ERROR] <https://builds.apache.org/job/CXF-3.0-deploy/ws/distribution/javadoc/target/sources/org/apache/cxf/jaxrs/client/WebClient.java>:610:
warning - @param argument "body" is not a parameter name.
[ERROR] <https://builds.apache.org/job/CXF-3.0-deploy/ws/distribution/javadoc/target/sources/org/apache/cxf/jaxrs/client/WebClient.java>:784:
warning - @param argument "queryString" is not a parameter name.
[ERROR] <https://builds.apache.org/job/CXF-3.0-deploy/ws/distribution/javadoc/target/sources/org/apache/cxf/xkms/crypto/CryptoProviderFactory.java>:41:
warning - @param argument "cryptoProperties" is not a parameter name.
[ERROR] <https://builds.apache.org/job/CXF-3.0-deploy/ws/distribution/javadoc/target/sources/org/apache/cxf/xkms/crypto/CryptoProviderFactory.java>:58:
warning - @param argument "xkmsClient" is not a parameter name.
[ERROR] <https://builds.apache.org/job/CXF-3.0-deploy/ws/distribution/javadoc/target/sources/org/apache/cxf/jaxrs/ext/search/client/SearchConditionBuilder.java>:32:
warning - Tag @link: reference not found: org.apache.cxf.jaxrs.ext.search.FiqlParser FiqlParser
[ERROR] java.lang.ClassCastException: com.sun.tools.javadoc.ClassDocImpl cannot be cast to
com.sun.javadoc.AnnotationTypeDoc
[ERROR] at com.sun.tools.javadoc.AnnotationDescImpl.annotationType(AnnotationDescImpl.java:46)
[ERROR] at com.sun.tools.doclets.internal.toolkit.util.Util.isDeprecated(Util.java:811)
[ERROR] at com.sun.tools.doclets.formats.html.PackageWriterImpl.writeClassesSummary(PackageWriterImpl.java:114)
[ERROR] at com.sun.tools.doclets.internal.toolkit.builders.PackageSummaryBuilder.buildClassSummary(PackageSummaryBuilder.java:175)
[ERROR] at sun.reflect.GeneratedMethodAccessor93.invoke(Unknown Source)
[ERROR] at sun.reflect.DelegatingMethodAccessorImpl.invoke(DelegatingMethodAccessorImpl.java:25)
[ERROR] at java.lang.reflect.Method.invoke(Method.java:597)
[ERROR] at com.sun.tools.doclets.internal.toolkit.builders.PackageSummaryBuilder.invokeMethod(PackageSummaryBuilder.java:81)
[ERROR] at com.sun.tools.doclets.internal.toolkit.builders.AbstractBuilder.build(AbstractBuilder.java:90)
[ERROR] at com.sun.tools.doclets.internal.toolkit.builders.PackageSummaryBuilder.buildSummary(PackageSummaryBuilder.java:148)
[ERROR] at sun.reflect.GeneratedMethodAccessor90.invoke(Unknown Source)
[ERROR] at sun.reflect.DelegatingMethodAccessorImpl.invoke(DelegatingMethodAccessorImpl.java:25)
[ERROR] at java.lang.reflect.Method.invoke(Method.java:597)
[ERROR] at com.sun.tools.doclets.internal.toolkit.builders.PackageSummaryBuilder.invokeMethod(PackageSummaryBuilder.java:81)
[ERROR] at com.sun.tools.doclets.internal.toolkit.builders.AbstractBuilder.build(AbstractBuilder.java:90)
[ERROR] at com.sun.tools.doclets.internal.toolkit.builders.PackageSummaryBuilder.buildPackageDoc(PackageSummaryBuilder.java:106)
[ERROR] at sun.reflect.GeneratedMethodAccessor88.invoke(Unknown Source)
[ERROR] at sun.reflect.DelegatingMethodAccessorImpl.invoke(DelegatingMethodAccessorImpl.java:25)
[ERROR] at java.lang.reflect.Method.invoke(Method.java:597)
[ERROR] at com.sun.tools.doclets.internal.toolkit.builders.PackageSummaryBuilder.invokeMethod(PackageSummaryBuilder.java:81)
[ERROR] at com.sun.tools.doclets.internal.toolkit.builders.AbstractBuilder.build(AbstractBuilder.java:90)
[ERROR] at com.sun.tools.doclets.internal.toolkit.builders.PackageSummaryBuilder.build(PackageSummaryBuilder.java:92)
[ERROR] at com.sun.tools.doclets.formats.html.HtmlDoclet.generatePackageFiles(HtmlDoclet.java:183)
[ERROR] at com.sun.tools.doclets.internal.toolkit.AbstractDoclet.startGeneration(AbstractDoclet.java:120)
[ERROR] at com.sun.tools.doclets.internal.toolkit.AbstractDoclet.start(AbstractDoclet.java:64)
[ERROR] at com.sun.tools.doclets.formats.html.HtmlDoclet.start(HtmlDoclet.java:42)
[ERROR] at com.sun.tools.doclets.standard.Standard.start(Standard.java:23)
[ERROR] at sun.reflect.NativeMethodAccessorImpl.invoke0(Native Method)
[ERROR] at sun.reflect.NativeMethodAccessorImpl.invoke(NativeMethodAccessorImpl.java:39)
[ERROR] at sun.reflect.DelegatingMethodAccessorImpl.invoke(DelegatingMethodAccessorImpl.java:25)
[ERROR] at java.lang.reflect.Method.invoke(Method.java:597)
[ERROR] at com.sun.tools.javadoc.DocletInvoker.invoke(DocletInvoker.java:269)
[ERROR] at com.sun.tools.javadoc.DocletInvoker.start(DocletInvoker.java:143)
[ERROR] at com.sun.tools.javadoc.Start.parseAndExecute(Start.java:340)
[ERROR] at com.sun.tools.javadoc.Start.begin(Start.java:128)
[ERROR] at com.sun.tools.javadoc.Main.execute(Main.java:41)
[ERROR] at com.sun.tools.javadoc.Main.main(Main.java:31)
[ERROR] java.lang.ClassCastException: com.sun.tools.javadoc.ClassDocImpl cannot be cast to
com.sun.javadoc.AnnotationTypeDoc
[ERROR] at com.sun.tools.javadoc.AnnotationDescImpl.annotationType(AnnotationDescImpl.java:46)
[ERROR] at com.sun.tools.doclets.internal.toolkit.util.Util.isDeprecated(Util.java:811)
[ERROR] at com.sun.tools.doclets.formats.html.PackageWriterImpl.writeClassesSummary(PackageWriterImpl.java:114)
[ERROR] at com.sun.tools.doclets.internal.toolkit.builders.PackageSummaryBuilder.buildClassSummary(PackageSummaryBuilder.java:175)
[ERROR] at sun.reflect.GeneratedMethodAccessor93.invoke(Unknown Source)
[ERROR] at sun.reflect.DelegatingMethodAccessorImpl.invoke(DelegatingMethodAccessorImpl.java:25)
[ERROR] at java.lang.reflect.Method.invoke(Method.java:597)
[ERROR] at com.sun.tools.doclets.internal.toolkit.builders.PackageSummaryBuilder.invokeMethod(PackageSummaryBuilder.java:81)
[ERROR] at com.sun.tools.doclets.internal.toolkit.builders.AbstractBuilder.build(AbstractBuilder.java:90)
[ERROR] at com.sun.tools.doclets.internal.toolkit.builders.PackageSummaryBuilder.buildSummary(PackageSummaryBuilder.java:148)
[ERROR] at sun.reflect.GeneratedMethodAccessor90.invoke(Unknown Source)
[ERROR] at sun.reflect.DelegatingMethodAccessorImpl.invoke(DelegatingMethodAccessorImpl.java:25)
[ERROR] at java.lang.reflect.Method.invoke(Method.java:597)
[ERROR] at com.sun.tools.doclets.internal.toolkit.builders.PackageSummaryBuilder.invokeMethod(PackageSummaryBuilder.java:81)
[ERROR] at com.sun.tools.doclets.internal.toolkit.builders.AbstractBuilder.build(AbstractBuilder.java:90)
[ERROR] at com.sun.tools.doclets.internal.toolkit.builders.PackageSummaryBuilder.buildPackageDoc(PackageSummaryBuilder.java:106)
[ERROR] at sun.reflect.GeneratedMethodAccessor88.invoke(Unknown Source)
[ERROR] at sun.reflect.DelegatingMethodAccessorImpl.invoke(DelegatingMethodAccessorImpl.java:25)
[ERROR] at java.lang.reflect.Method.invoke(Method.java:597)
[ERROR] at com.sun.tools.doclets.internal.toolkit.builders.PackageSummaryBuilder.invokeMethod(PackageSummaryBuilder.java:81)
[ERROR] at com.sun.tools.doclets.internal.toolkit.builders.AbstractBuilder.build(AbstractBuilder.java:90)
[ERROR] at com.sun.tools.doclets.internal.toolkit.builders.PackageSummaryBuilder.build(PackageSummaryBuilder.java:92)
[ERROR] at com.sun.tools.doclets.formats.html.HtmlDoclet.generatePackageFiles(HtmlDoclet.java:183)
[ERROR] at com.sun.tools.doclets.internal.toolkit.AbstractDoclet.startGeneration(AbstractDoclet.java:120)
[ERROR] at com.sun.tools.doclets.internal.toolkit.AbstractDoclet.start(AbstractDoclet.java:64)
[ERROR] at com.sun.tools.doclets.formats.html.HtmlDoclet.start(HtmlDoclet.java:42)
[ERROR] at com.sun.tools.doclets.standard.Standard.start(Standard.java:23)
[ERROR] at sun.reflect.NativeMethodAccessorImpl.invoke0(Native Method)
[ERROR] at sun.reflect.NativeMethodAccessorImpl.invoke(NativeMethodAccessorImpl.java:39)
[ERROR] at sun.reflect.DelegatingMethodAccessorImpl.invoke(DelegatingMethodAccessorImpl.java:25)
[ERROR] at java.lang.reflect.Method.invoke(Method.java:597)
[ERROR] at com.sun.tools.javadoc.DocletInvoker.invoke(DocletInvoker.java:269)
[ERROR] at com.sun.tools.javadoc.DocletInvoker.start(DocletInvoker.java:143)
[ERROR] at com.sun.tools.javadoc.Start.parseAndExecute(Start.java:340)
[ERROR] at com.sun.tools.javadoc.Start.begin(Start.java:128)
[ERROR] at com.sun.tools.javadoc.Main.execute(Main.java:41)
[ERROR] at com.sun.tools.javadoc.Main.main(Main.java:31)
[ERROR] <https://builds.apache.org/job/CXF-3.0-deploy/ws/distribution/javadoc/target/sources/org/apache/cxf/jaxrs/ext/xml/ElementClass.java>:32:
warning - Tag @link: reference not found: Response
[ERROR] java.lang.ClassCastException: com.sun.tools.javadoc.ClassDocImpl cannot be cast to
com.sun.javadoc.AnnotationTypeDoc
[ERROR] at com.sun.tools.javadoc.AnnotationDescImpl.annotationType(AnnotationDescImpl.java:46)
[ERROR] at com.sun.tools.doclets.internal.toolkit.util.Util.isDeprecated(Util.java:811)
[ERROR] at com.sun.tools.doclets.formats.html.PackageWriterImpl.writeClassesSummary(PackageWriterImpl.java:114)
[ERROR] at com.sun.tools.doclets.internal.toolkit.builders.PackageSummaryBuilder.buildClassSummary(PackageSummaryBuilder.java:175)
[ERROR] at sun.reflect.GeneratedMethodAccessor93.invoke(Unknown Source)
[ERROR] at sun.reflect.DelegatingMethodAccessorImpl.invoke(DelegatingMethodAccessorImpl.java:25)
[ERROR] at java.lang.reflect.Method.invoke(Method.java:597)
[ERROR] at com.sun.tools.doclets.internal.toolkit.builders.PackageSummaryBuilder.invokeMethod(PackageSummaryBuilder.java:81)
[ERROR] at com.sun.tools.doclets.internal.toolkit.builders.AbstractBuilder.build(AbstractBuilder.java:90)
[ERROR] at com.sun.tools.doclets.internal.toolkit.builders.PackageSummaryBuilder.buildSummary(PackageSummaryBuilder.java:148)
[ERROR] at sun.reflect.GeneratedMethodAccessor90.invoke(Unknown Source)
[ERROR] at sun.reflect.DelegatingMethodAccessorImpl.invoke(DelegatingMethodAccessorImpl.java:25)
[ERROR] at java.lang.reflect.Method.invoke(Method.java:597)
[ERROR] at com.sun.tools.doclets.internal.toolkit.builders.PackageSummaryBuilder.invokeMethod(PackageSummaryBuilder.java:81)
[ERROR] at com.sun.tools.doclets.internal.toolkit.builders.AbstractBuilder.build(AbstractBuilder.java:90)
[ERROR] at com.sun.tools.doclets.internal.toolkit.builders.PackageSummaryBuilder.buildPackageDoc(PackageSummaryBuilder.java:106)
[ERROR] at sun.reflect.GeneratedMethodAccessor88.invoke(Unknown Source)
[ERROR] at sun.reflect.DelegatingMethodAccessorImpl.invoke(DelegatingMethodAccessorImpl.java:25)
[ERROR] at java.lang.reflect.Method.invoke(Method.java:597)
[ERROR] at com.sun.tools.doclets.internal.toolkit.builders.PackageSummaryBuilder.invokeMethod(PackageSummaryBuilder.java:81)
[ERROR] at com.sun.tools.doclets.internal.toolkit.builders.AbstractBuilder.build(AbstractBuilder.java:90)
[ERROR] at com.sun.tools.doclets.internal.toolkit.builders.PackageSummaryBuilder.build(PackageSummaryBuilder.java:92)
[ERROR] at com.sun.tools.doclets.formats.html.HtmlDoclet.generatePackageFiles(HtmlDoclet.java:183)
[ERROR] at com.sun.tools.doclets.internal.toolkit.AbstractDoclet.startGeneration(AbstractDoclet.java:120)
[ERROR] at com.sun.tools.doclets.internal.toolkit.AbstractDoclet.start(AbstractDoclet.java:64)
[ERROR] at com.sun.tools.doclets.formats.html.HtmlDoclet.start(HtmlDoclet.java:42)
[ERROR] at com.sun.tools.doclets.standard.Standard.start(Standard.java:23)
[ERROR] at sun.reflect.NativeMethodAccessorImpl.invoke0(Native Method)
[ERROR] at sun.reflect.NativeMethodAccessorImpl.invoke(NativeMethodAccessorImpl.java:39)
[ERROR] at sun.reflect.DelegatingMethodAccessorImpl.invoke(DelegatingMethodAccessorImpl.java:25)
[ERROR] at java.lang.reflect.Method.invoke(Method.java:597)
[ERROR] at com.sun.tools.javadoc.DocletInvoker.invoke(DocletInvoker.java:269)
[ERROR] at com.sun.tools.javadoc.DocletInvoker.start(DocletInvoker.java:143)
[ERROR] at com.sun.tools.javadoc.Start.parseAndExecute(Start.java:340)
[ERROR] at com.sun.tools.javadoc.Start.begin(Start.java:128)
[ERROR] at com.sun.tools.javadoc.Main.execute(Main.java:41)
[ERROR] at com.sun.tools.javadoc.Main.main(Main.java:31)
[ERROR] <https://builds.apache.org/job/CXF-3.0-deploy/ws/distribution/javadoc/target/sources/org/apache/cxf/transport/https/httpclient/PublicSuffixMatcherLoader.java>:45:
warning - Tag @link: reference not found: org.apache.http.conn.util.PublicSuffixMatcher
[ERROR] java.lang.ClassCastException: com.sun.tools.javadoc.ClassDocImpl cannot be cast to
com.sun.javadoc.AnnotationTypeDoc
[ERROR] at com.sun.tools.javadoc.AnnotationDescImpl.annotationType(AnnotationDescImpl.java:46)
[ERROR] at com.sun.tools.doclets.internal.toolkit.util.ClassUseMapper.mapAnnotations(ClassUseMapper.java:439)
[ERROR] at com.sun.tools.doclets.internal.toolkit.util.ClassUseMapper.<init>(ClassUseMapper.java:183)
[ERROR] at com.sun.tools.doclets.formats.html.ClassUseWriter.generate(ClassUseWriter.java:109)
[ERROR] at com.sun.tools.doclets.formats.html.HtmlDoclet.generateOtherFiles(HtmlDoclet.java:92)
[ERROR] at com.sun.tools.doclets.internal.toolkit.AbstractDoclet.startGeneration(AbstractDoclet.java:122)
[ERROR] at com.sun.tools.doclets.internal.toolkit.AbstractDoclet.start(AbstractDoclet.java:64)
[ERROR] at com.sun.tools.doclets.formats.html.HtmlDoclet.start(HtmlDoclet.java:42)
[ERROR] at com.sun.tools.doclets.standard.Standard.start(Standard.java:23)
[ERROR] at sun.reflect.NativeMethodAccessorImpl.invoke0(Native Method)
[ERROR] at sun.reflect.NativeMethodAccessorImpl.invoke(NativeMethodAccessorImpl.java:39)
[ERROR] at sun.reflect.DelegatingMethodAccessorImpl.invoke(DelegatingMethodAccessorImpl.java:25)
[ERROR] at java.lang.reflect.Method.invoke(Method.java:597)
[ERROR] at com.sun.tools.javadoc.DocletInvoker.invoke(DocletInvoker.java:269)
[ERROR] at com.sun.tools.javadoc.DocletInvoker.start(DocletInvoker.java:143)
[ERROR] at com.sun.tools.javadoc.Start.parseAndExecute(Start.java:340)
[ERROR] at com.sun.tools.javadoc.Start.begin(Start.java:128)
[ERROR] at com.sun.tools.javadoc.Main.execute(Main.java:41)
[ERROR] at com.sun.tools.javadoc.Main.main(Main.java:31)
[ERROR] 
[ERROR] Command line was: /home/jenkins/tools/java/jdk1.6.0_45-32/jre/../bin/javadoc -J-Xmx768m
-J-Xms128m @options @argfile
[ERROR] 
[ERROR] Refer to the generated Javadoc files in '<https://builds.apache.org/job/CXF-3.0-deploy/ws/distribution/javadoc/target/apidocs'>
dir.
[ERROR] -> [Help 1]
[ERROR] 
[ERROR] To see the full stack trace of the errors, re-run Maven with the -e switch.
[ERROR] Re-run Maven using the -X switch to enable full debug logging.
[ERROR] 
[ERROR] For more information about the errors and possible solutions, please read the following
articles:
[ERROR] [Help 1] http://cwiki.apache.org/confluence/display/MAVEN/MojoExecutionException
[ERROR] 
[ERROR] After correcting the problems, you can resume the build with the command
[ERROR]   mvn <goals> -rf :cxf-distribution-javadoc
Build step 'Invoke top-level Maven targets' marked build as failure

Mime
View raw message