cxf-notifications mailing list archives

Site index · List index
Message view « Date » · « Thread »
Top « Date » · « Thread »
From Apache Jenkins Server <jenk...@builds.apache.org>
Subject Build failed in Jenkins: CXF-3.0-deploy » Apache CXF JAX-WS System Tests #547
Date Wed, 31 Dec 2014 06:47:23 GMT
See <https://builds.apache.org/job/CXF-3.0-deploy/org.apache.cxf.systests$cxf-systests-jaxws/547/>

------------------------------------------
[INFO]                                                                         
[INFO] ------------------------------------------------------------------------
[INFO] Building Apache CXF JAX-WS System Tests 3.0.4-SNAPSHOT
[INFO] ------------------------------------------------------------------------
[INFO] 
[INFO] --- maven-clean-plugin:2.5:clean (default-clean) @ cxf-systests-jaxws ---
[INFO] 
[INFO] --- maven-bundle-plugin:2.4.0:cleanVersions (versions) @ cxf-systests-jaxws ---
[INFO] 
[INFO] --- cxf-xml2fastinfoset-plugin:3.0.0:xml2fastinfoset (xml2fastinfoset) @ cxf-systests-jaxws
---
[INFO] 
[INFO] --- maven-remote-resources-plugin:1.5:process (default) @ cxf-systests-jaxws ---
[INFO] 
[INFO] --- maven-resources-plugin:2.6:resources (default-resources) @ cxf-systests-jaxws ---
[INFO] Using 'UTF-8' encoding to copy filtered resources.
[INFO] skip non existing resourceDirectory <https://builds.apache.org/job/CXF-3.0-deploy/org.apache.cxf.systests$cxf-systests-jaxws/ws/src/main/java>
[INFO] skip non existing resourceDirectory <https://builds.apache.org/job/CXF-3.0-deploy/org.apache.cxf.systests$cxf-systests-jaxws/ws/src/main/resources>
[INFO] skip non existing resourceDirectory <https://builds.apache.org/job/CXF-3.0-deploy/org.apache.cxf.systests$cxf-systests-jaxws/ws/src/main/resources-filtered>
[INFO] skip non existing resourceDirectory <https://builds.apache.org/job/CXF-3.0-deploy/org.apache.cxf.systests$cxf-systests-jaxws/ws/target/generated/src/main/resources>
[INFO] Copying 3 resources
[INFO] 
[INFO] --- maven-compiler-plugin:3.1:compile (default-compile) @ cxf-systests-jaxws ---
[INFO] No sources to compile
[INFO] 
[INFO] --- cxf-codegen-plugin:3.0.4-SNAPSHOT:wsdl2java (generate-test-sources) @ cxf-systests-jaxws
---
[INFO] Running code generation in fork mode...
[INFO] Building jar: /tmp/cxf-tmp-562265/cxf-codegen2098766843217791965.jar
[WARNING] Dec 31, 2014 6:45:43 AM org.apache.cxf.tools.wsdlto.databinding.jaxb.JAXBDataBinding
checkEncoding
[WARNING] WARNING: Version 2.1.14-hudson-jaxb-ri-2.1-pushtomaven-240--SNAPSHOT of JAXB XJC
does not support setting an encoding.  Using default file encoding of ISO-8859-1.
[WARNING] Dec 31, 2014 6:45:44 AM org.apache.cxf.tools.wsdlto.databinding.jaxb.JAXBDataBinding
checkEncoding
[WARNING] WARNING: Version 2.1.14-hudson-jaxb-ri-2.1-pushtomaven-240--SNAPSHOT of JAXB XJC
does not support setting an encoding.  Using default file encoding of ISO-8859-1.
[INFO] 
[INFO] --- maven-resources-plugin:2.6:testResources (default-testResources) @ cxf-systests-jaxws
---
[INFO] Using 'UTF-8' encoding to copy filtered resources.
[INFO] Copying 50 resources
[INFO] Copying 13 resources
[INFO] skip non existing resourceDirectory <https://builds.apache.org/job/CXF-3.0-deploy/org.apache.cxf.systests$cxf-systests-jaxws/ws/target/generated/src/test/resources>
[INFO] Copying 3 resources
[INFO] 
[INFO] --- maven-compiler-plugin:3.1:testCompile (default-testCompile) @ cxf-systests-jaxws
---
[INFO] Changes detected - recompiling the module!
[INFO] Compiling 179 source files to <https://builds.apache.org/job/CXF-3.0-deploy/org.apache.cxf.systests$cxf-systests-jaxws/ws/target/test-classes>
[INFO] -------------------------------------------------------------
[ERROR] COMPILATION ERROR : 
[INFO] -------------------------------------------------------------
[ERROR] <https://builds.apache.org/job/CXF-3.0-deploy/org.apache.cxf.systests$cxf-systests-jaxws/ws/src/test/java/org/apache/cxf/systest/dispatch/DispatchClientServerWithHugeResponseTest.java>:[178,17]
unreported exception java.lang.Throwable; must be caught or declared to be thrown
[ERROR] <https://builds.apache.org/job/CXF-3.0-deploy/org.apache.cxf.systests$cxf-systests-jaxws/ws/src/test/java/org/apache/cxf/systest/dispatch/DispatchClientServerWithHugeResponseTest.java>:[184,21]
unreported exception java.lang.Throwable; must be caught or declared to be thrown
[ERROR] <https://builds.apache.org/job/CXF-3.0-deploy/org.apache.cxf.systests$cxf-systests-jaxws/ws/src/test/java/org/apache/cxf/systest/dispatch/DispatchClientServerWithHugeResponseTest.java>:[189,17]
unreported exception java.lang.Throwable; must be caught or declared to be thrown
[INFO] 3 errors 
[INFO] -------------------------------------------------------------

Mime
View raw message