cxf-notifications mailing list archives

Site index · List index
Message view « Date » · « Thread »
Top « Date » · « Thread »
From Apache Jenkins Server <jenk...@builds.apache.org>
Subject Build failed in Jenkins: CXF-trunk-deploy #1474
Date Tue, 26 Aug 2014 06:57:24 GMT
See <https://builds.apache.org/job/CXF-trunk-deploy/1474/changes>

Changes:

[sberyozkin] [CXF-5899] Better support for injecting Configuration

[reta] CXF-5923: Create sample to demonstrate usage of search extension with Lucene and Tika.
Upgraded Apache Lucene to version 4.9

[sberyozkin] [CXF-5969] Passing generic type to ParamConverter

------------------------------------------
Started by an SCM change
Building remotely on H11 (Ubuntu ubuntu) in workspace <https://builds.apache.org/job/CXF-trunk-deploy/ws/>
 > git rev-parse --is-inside-work-tree
Fetching changes from the remote Git repository
 > git config remote.origin.url https://git-wip-us.apache.org/repos/asf/cxf.git
Fetching upstream changes from https://git-wip-us.apache.org/repos/asf/cxf.git
 > git --version
 > git fetch --tags --progress https://git-wip-us.apache.org/repos/asf/cxf.git +refs/heads/*:refs/remotes/origin/*
 > git rev-parse origin/master^{commit}
Checking out Revision 5fa0cbed4531ba3580fac246ddd896b316fa06a7 (origin/master)
 > git config core.sparsecheckout
 > git checkout -f 5fa0cbed4531ba3580fac246ddd896b316fa06a7
 > git rev-list 816e1a5ef4c0992a7d084a0529e42d9ad6a4a3c6
Parsing POMs
Modules changed, recalculating dependency graph
maven3-agent.jar already up to date
maven3-interceptor.jar already up to date
maven3-interceptor-commons.jar already up to date
[CXF-trunk-deploy] $ /home/jenkins/tools/java/latest1.7/bin/java -da -dsa -XX:MaxPermSize=256m
-Xmx1024M -cp /home/jenkins/jenkins-slave/maven3-agent.jar:/home/jenkins/jenkins-slave/tools/hudson.tasks.Maven_MavenInstallation/Maven_3.0.5/boot/plexus-classworlds-2.4.jar
org.jvnet.hudson.maven3.agent.Maven3Main /home/jenkins/jenkins-slave/tools/hudson.tasks.Maven_MavenInstallation/Maven_3.0.5
/home/jenkins/jenkins-slave/slave.jar /home/jenkins/jenkins-slave/maven3-interceptor.jar /home/jenkins/jenkins-slave/maven3-interceptor-commons.jar
33581
<===[JENKINS REchannel started
MOTING CAPACITY]===>   log4j:WARN No appenders could be found for logger (org.apache.commons.beanutils.converters.BooleanConverter).
log4j:WARN Please initialize the log4j system properly.
Executing Maven:  -B -f <https://builds.apache.org/job/CXF-trunk-deploy/ws/pom.xml>
-Dmaven.repo.local=/home/jenkins/jenkins-slave/maven-repositories/2 -U -B -e clean install
-Pjaxws22,deploy,everything,nochecks -Dmaven.test.skip.exec=true -V -DobrRepository=NONE
Apache Maven 3.0.5 (r01de14724cdef164cd33c7c8c2fe155faf9602da; 2013-02-19 13:51:28+0000)
Maven home: /home/jenkins/jenkins-slave/tools/hudson.tasks.Maven_MavenInstallation/Maven_3.0.5
Java version: 1.7.0_25, vendor: Oracle Corporation
Java home: /home/jenkins/tools/java/jdk1.7.0_25-32/jre
Default locale: en_US, platform encoding: ANSI_X3.4-1968
OS name: "linux", version: "3.13.0-32-generic", arch: "i386", family: "unix"
[INFO] Error stacktraces are turned on.
[INFO] Scanning for projects...
Downloading: http://repo.maven.apache.org/maven2/org/apache/maven/archetype/archetype-packaging/2.1/archetype-packaging-2.1.pom
Downloaded: http://repo.maven.apache.org/maven2/org/apache/maven/archetype/archetype-packaging/2.1/archetype-packaging-2.1.pom
(2 KB at 5.5 KB/sec)
Downloading: http://repo.maven.apache.org/maven2/org/apache/maven/archetype/maven-archetype/2.1/maven-archetype-2.1.pom
Downloaded: http://repo.maven.apache.org/maven2/org/apache/maven/archetype/maven-archetype/2.1/maven-archetype-2.1.pom
(14 KB at 126.6 KB/sec)
Downloading: http://repo.maven.apache.org/maven2/org/apache/maven/archetype/archetype-packaging/2.1/archetype-packaging-2.1.jar
Downloaded: http://repo.maven.apache.org/maven2/org/apache/maven/archetype/archetype-packaging/2.1/archetype-packaging-2.1.jar
(8 KB at 98.4 KB/sec)
Downloading: http://repo.maven.apache.org/maven2/org/apache/felix/maven-bundle-plugin/maven-metadata.xml
Downloaded: http://repo.maven.apache.org/maven2/org/apache/felix/maven-bundle-plugin/maven-metadata.xml
(838 B at 10.9 KB/sec)
[ERROR] The build could not read 1 project -> [Help 1]
org.apache.maven.project.ProjectBuildingException: Some problems were encountered while processing
the POMs:
[WARNING] 'build.plugins.plugin.version' for org.eclipse.tycho:tycho-packaging-plugin is missing.
@ line 72, column 21
[WARNING] 'build.plugins.plugin.version' for org.apache.servicemix.tooling:depends-maven-plugin
is missing. @ line 137, column 21
[WARNING] 'build.plugins.plugin.version' for org.apache.servicemix.tooling:depends-maven-plugin
is missing. @ line 149, column 21
[ERROR] 'dependencies.dependency.version' for org.apache.lucene:lucene-core:jar must be a
valid version but is '${cxf.lucene.version}'. @ line 113, column 22
[ERROR] 'dependencies.dependency.version' for org.apache.lucene:lucene-analyzers-common:jar
must be a valid version but is '${cxf.lucene.version}'. @ line 118, column 22
[WARNING] 'build.plugins.plugin.version' for org.apache.felix:maven-bundle-plugin is missing.
@ line 45, column 10
[WARNING] 'build.plugins.plugin.version' for org.apache.maven.plugins:maven-war-plugin is
missing. @ line 34, column 10

	at org.apache.maven.project.DefaultProjectBuilder.build(DefaultProjectBuilder.java:363)
	at org.apache.maven.DefaultMaven.collectProjects(DefaultMaven.java:636)
	at org.apache.maven.DefaultMaven.getProjectsForMavenReactor(DefaultMaven.java:585)
	at org.apache.maven.DefaultMaven.doExecute(DefaultMaven.java:234)
	at org.apache.maven.DefaultMaven.execute(DefaultMaven.java:156)
	at org.jvnet.hudson.maven3.launcher.Maven3Launcher.main(Maven3Launcher.java:117)
	at sun.reflect.NativeMethodAccessorImpl.invoke0(Native Method)
	at sun.reflect.NativeMethodAccessorImpl.invoke(NativeMethodAccessorImpl.java:57)
	at sun.reflect.DelegatingMethodAccessorImpl.invoke(DelegatingMethodAccessorImpl.java:43)
	at java.lang.reflect.Method.invoke(Method.java:606)
	at org.codehaus.plexus.classworlds.launcher.Launcher.launchStandard(Launcher.java:329)
	at org.codehaus.plexus.classworlds.launcher.Launcher.launch(Launcher.java:239)
	at org.jvnet.hudson.maven3.agent.Maven3Main.launch(Maven3Main.java:178)
	at sun.reflect.NativeMethodAccessorImpl.invoke0(Native Method)
	at sun.reflect.NativeMethodAccessorImpl.invoke(NativeMethodAccessorImpl.java:57)
	at sun.reflect.DelegatingMethodAccessorImpl.invoke(DelegatingMethodAccessorImpl.java:43)
	at java.lang.reflect.Method.invoke(Method.java:606)
	at hudson.maven.Maven3Builder.call(Maven3Builder.java:134)
	at hudson.maven.Maven3Builder.call(Maven3Builder.java:69)
	at hudson.remoting.UserRequest.perform(UserRequest.java:118)
	at hudson.remoting.UserRequest.perform(UserRequest.java:48)
	at hudson.remoting.Request$2.run(Request.java:328)
	at hudson.remoting.InterceptingExecutorService$1.call(InterceptingExecutorService.java:72)
	at java.util.concurrent.FutureTask$Sync.innerRun(FutureTask.java:334)
	at java.util.concurrent.FutureTask.run(FutureTask.java:166)
	at java.util.concurrent.ThreadPoolExecutor.runWorker(ThreadPoolExecutor.java:1145)
	at java.util.concurrent.ThreadPoolExecutor$Worker.run(ThreadPoolExecutor.java:615)
	at java.lang.Thread.run(Thread.java:724)
[ERROR]   
[ERROR]   The project org.apache.cxf.samples:jax_rs_search:3.1.0-SNAPSHOT (<https://builds.apache.org/job/CXF-trunk-deploy/ws/distribution/src/main/release/samples/jax_rs/search/pom.xml)>
has 2 errors
[ERROR]     'dependencies.dependency.version' for org.apache.lucene:lucene-core:jar must be
a valid version but is '${cxf.lucene.version}'. @ line 113, column 22
[ERROR]     'dependencies.dependency.version' for org.apache.lucene:lucene-analyzers-common:jar
must be a valid version but is '${cxf.lucene.version}'. @ line 118, column 22
[ERROR] 
[ERROR] Re-run Maven using the -X switch to enable full debug logging.
[ERROR] 
[ERROR] For more information about the errors and possible solutions, please read the following
articles:
[ERROR] [Help 1] http://cwiki.apache.org/confluence/display/MAVEN/ProjectBuildingException
channel stopped

Mime
View raw message