cxf-notifications mailing list archives

Site index · List index
Message view « Date » · « Thread »
Top « Date » · « Thread »
From Apache Jenkins Server <jenk...@builds.apache.org>
Subject Build failed in Jenkins: CXF-2.7-deploy #286
Date Sun, 23 Mar 2014 07:17:28 GMT
See <https://builds.apache.org/job/CXF-2.7-deploy/286/changes>

Changes:

[asoldano] Adding .pmdruleset.xml to .gitignore

[asoldano] [CXF-5626] Restore former MessageContext into WebServiceContext instead of clearing
it

[dkulp] The merge log entry things are no longer appicable with git based merges

[dkulp] [CXF-5630] If the client sets the ROBUST_ONEWAY flag, process any fault returned.

[dkulp] Recording .gitmergeinfo Changes

[dkulp] Update to the latest Woodstox releases

[dkulp] Update the Blueprint parsing for JAXB objects to allow propertly placeholders.

[dkulp] Recording .gitmergeinfo Changes

[dkulp] [CXF-5635] Optimize the LoggingOutInterceptor to only cache up  to the limit...

[dkulp] Recording .gitmergeinfo Changes

[dkulp] [CXF-5635] Optimize the LoggingInInterceptor to only slurp in "limit" bytes from the
InputStream then replay those bytes, then allow the rest to stream like normal.  Should prevent
very large temp files if logging is on.

[dkulp] THe advanced merge was eating any JIRA ID's stuck in brackets

[dkulp] Recording .gitmergeinfo Changes

------------------------------------------
[...truncated 34113 lines...]
[INFO] 
[INFO] --- maven-antrun-plugin:1.7:run (process-sources-xsl) @ apache-cxf ---
[WARNING] Parameter tasks is deprecated, use target instead
[INFO] Executing tasks

main:
[INFO] Executed tasks
[INFO] 
[INFO] --- maven-remote-resources-plugin:1.5:process (default) @ apache-cxf ---
[INFO] 
[INFO] --- maven-bundle-plugin:2.4.0:manifest (bundle-manifest) @ apache-cxf ---
[WARNING] Ignoring project type pom - supportedProjectTypes = [jar, bundle]
[INFO] 
[INFO] --- maven-source-plugin:2.1.2:jar-no-fork (attach-sources) @ apache-cxf ---
[INFO] 
[INFO] --- maven-javadoc-plugin:2.9.1:jar (attach-javadocs) @ apache-cxf ---
[INFO] Not executing Javadoc as the project is not a Java classpath-capable package
[INFO] 
[INFO] --- maven-site-plugin:3.2:attach-descriptor (attach-descriptor) @ apache-cxf ---
[INFO] 
[INFO] --- maven-dependency-plugin:2.8:unpack (unpack-javadoc) @ apache-cxf ---
[INFO] Configured Artifact: org.apache.cxf:cxf-api:javadoc:2.7.11-SNAPSHOT:jar
[INFO] Unpacking /x1/jenkins/jenkins-slave/workspace/CXF-2.7-deploy/api/target/cxf-api-2.7.11-SNAPSHOT-javadoc.jar
to /x1/jenkins/jenkins-slave/workspace/CXF-2.7-deploy/distribution/target/javadoc with includes
"" and excludes ""
[INFO] 
[INFO] --- maven-assembly-plugin:2.4:single (distribution-package-bin) @ apache-cxf ---
[INFO] Reading assembly descriptor: src/main/assembly/bin.xml
[WARNING] Cannot include project artifact: org.apache.cxf:apache-cxf:pom:2.7.11-SNAPSHOT;
it doesn't have an associated file or directory.
[WARNING] Cannot include project artifact: org.apache.cxf:apache-cxf:pom:2.7.11-SNAPSHOT;
it doesn't have an associated file or directory.
[WARNING] Cannot include project artifact: org.apache.cxf:apache-cxf:pom:2.7.11-SNAPSHOT;
it doesn't have an associated file or directory.
[INFO] Copying files to /x1/jenkins/jenkins-slave/workspace/CXF-2.7-deploy/distribution/target/apache-cxf-2.7.11-SNAPSHOT
[WARNING] Assembly file: /x1/jenkins/jenkins-slave/workspace/CXF-2.7-deploy/distribution/target/apache-cxf-2.7.11-SNAPSHOT
is not a regular file (it may be a directory). It cannot be attached to the project build
for installation or deployment.
[WARNING] Cannot include project artifact: org.apache.cxf:apache-cxf:pom:2.7.11-SNAPSHOT;
it doesn't have an associated file or directory.
[WARNING] Cannot include project artifact: org.apache.cxf:apache-cxf:pom:2.7.11-SNAPSHOT;
it doesn't have an associated file or directory.
[WARNING] Cannot include project artifact: org.apache.cxf:apache-cxf:pom:2.7.11-SNAPSHOT;
it doesn't have an associated file or directory.
[INFO] Building tar: /x1/jenkins/jenkins-slave/workspace/CXF-2.7-deploy/distribution/target/apache-cxf-2.7.11-SNAPSHOT.tar.gz
[WARNING] Cannot include project artifact: org.apache.cxf:apache-cxf:pom:2.7.11-SNAPSHOT;
it doesn't have an associated file or directory.
[WARNING] Cannot include project artifact: org.apache.cxf:apache-cxf:pom:2.7.11-SNAPSHOT;
it doesn't have an associated file or directory.
[WARNING] Cannot include project artifact: org.apache.cxf:apache-cxf:pom:2.7.11-SNAPSHOT;
it doesn't have an associated file or directory.
[INFO] Building zip: /x1/jenkins/jenkins-slave/workspace/CXF-2.7-deploy/distribution/target/apache-cxf-2.7.11-SNAPSHOT.zip
[INFO] 
[INFO] --- maven-assembly-plugin:2.4:single (distribution-package-src) @ apache-cxf ---
[INFO] Reading assembly descriptor: src/main/assembly/src.xml
[INFO] Building tar: /x1/jenkins/jenkins-slave/workspace/CXF-2.7-deploy/distribution/target/apache-cxf-2.7.11-SNAPSHOT-src.tar.gz
[INFO] ------------------------------------------------------------------------
[INFO] Reactor Summary:
[INFO] 
[INFO] Apache CXF ........................................ SUCCESS [4.715s]
[INFO] Apache CXF Parent ................................. SUCCESS [3.808s]
[INFO] Apache CXF API .................................... SUCCESS [33.175s]
[INFO] Apache CXF Woodstox/MSV Schema Validation ......... SUCCESS [4.720s]
[INFO] Apache CXF XML Schema Validation with Xerces ...... SUCCESS [3.852s]
[INFO] Apache CXF Common ................................. SUCCESS [2.499s]
[INFO] Apache CXF Runtime Core ........................... SUCCESS [7.490s]
[INFO] Apache CXF Command Line Tools Common .............. SUCCESS [5.936s]
[INFO] Apache CXF Runtime JAXB DataBinding ............... SUCCESS [4.959s]
[INFO] Apache CXF Runtime SOAP Binding ................... SUCCESS [6.568s]
[INFO] Apache CXF Command Line Tools Validator ........... SUCCESS [9.562s]
[INFO] Apache CXF Command Line Tools WSDLTo Core ......... SUCCESS [5.251s]
[INFO] Apache CXF Command Line Tools WSDLTo JAXWS Frontend  SUCCESS [4.699s]
[INFO] Apache CXF Runtime JavaScript Client Generator Projects  SUCCESS [1.988s]
[INFO] Apache CXF Runtime JavaScript Client Generator .... SUCCESS [3.853s]
[INFO] Apache CXF Command Line Tools WSDL to JavaScript Front End  SUCCESS [3.950s]
[INFO] Apache CXF Command Line Tools WSDLTo JAXB Databinding  SUCCESS [4.092s]
[INFO] Apache CXF Maven Plugins .......................... SUCCESS [1.221s]
[INFO] Apache CXF WSDL Validator Maven2 Plugin ........... SUCCESS [5.059s]
[INFO] Apache CXF Code Generation Maven2 Plugins ......... SUCCESS [5.298s]
[INFO] Apache CXF Test Utilities ......................... SUCCESS [40.279s]
[INFO] Apache CXF Runtime Management ..................... SUCCESS [5.896s]
[INFO] Apache CXF Runtime JMS Transport .................. SUCCESS [5.792s]
[INFO] Apache CXF Runtime XML Binding .................... SUCCESS [4.433s]
[INFO] Apache CXF Runtime Local Transport ................ SUCCESS [4.015s]
[INFO] Apache CXF Runtime WS Policy ...................... SUCCESS [11.337s]
[INFO] Apache CXF Runtime HTTP Transport ................. SUCCESS [7.514s]
[INFO] Apache CXF Runtime HTTP Jetty Transport ........... SUCCESS [6.544s]
[INFO] Apache CXF Runtime Simple Frontend ................ SUCCESS [4.395s]
[INFO] Apache CXF Runtime WS Addressing .................. SUCCESS [4.612s]
[INFO] Apache CXF Runtime JAX-WS Frontend ................ SUCCESS [8.980s]
[INFO] Apache CXF Runtime XmlBeans DataBinding ........... SUCCESS [8.752s]
[INFO] Apache CXF Command Line Tools WSDLTo Test ......... SUCCESS [4.467s]
[INFO] Apache CXF Command Line Tools WSDLTo Misctools .... SUCCESS [5.270s]
[INFO] Apache CXF Command Line Tools ..................... SUCCESS [1.999s]
[INFO] Apache CXF Command Line Tools WSDLTo .............. SUCCESS [1.850s]
[INFO] Apache CXF Runtime Aegis Databinding .............. SUCCESS [6.726s]
[INFO] Apache CXF Command Line Tools JavaTo WS ........... SUCCESS [8.441s]
[INFO] Apache CXF Command Line Tools JavaTo .............. SUCCESS [1.776s]
[INFO] Apache CXF Runtime JAX-RS Frontend ................ SUCCESS [11.662s]
[INFO] Apache CXF Command Line Tools WADLTo JAXRS Frontend  SUCCESS [3.566s]
[INFO] Apache CXF Command Line Tools WADLTo .............. SUCCESS [1.686s]
[INFO] Apache CXF Runtime CORBA Binding .................. SUCCESS [6.657s]
[INFO] Apache CXF Command Line Tools CORBA ............... SUCCESS [6.756s]
[INFO] Apache CXF Runtime SDO DataBinding ................ SUCCESS [8.459s]
[INFO] Apache CXF Runtime JiBX DataBinding ............... SUCCESS [4.861s]
[INFO] Apache CXF Runtime Object Binding ................. SUCCESS [6.347s]
[INFO] Apache CXF Runtime Colocated Binding .............. SUCCESS [3.439s]
[INFO] Apache CXF Runtime ................................ SUCCESS [0.872s]
[INFO] Apache CXF Runtime Bindings ....................... SUCCESS [2.423s]
[INFO] Apache CXF Runtime Clustering ..................... SUCCESS [3.180s]
[INFO] Apache CXF Runtime JavaScript Frontend ............ SUCCESS [5.255s]
[INFO] Apache CXF Runtime HTTP Async Transport ........... SUCCESS [3.760s]
[INFO] Apache CXF Runtime UDP Transport .................. SUCCESS [3.934s]
[INFO] Apache CXF Runtime WS Reliable Messaging .......... SUCCESS [7.655s]
[INFO] Apache CXF Runtime WS MetadataExchange ............ SUCCESS [3.125s]
[INFO] Apache CXF Runtime WS Security .................... SUCCESS [12.012s]
[INFO] Apache CXF JAX-RS Extensions: Providers ........... SUCCESS [4.756s]
[INFO] Apache CXF JAX-RS Extensions: Search .............. SUCCESS [4.996s]
[INFO] Apache CXF RS XML Security ........................ SUCCESS [5.495s]
[INFO] Apache CXF RS SSO SAML ............................ SUCCESS [5.146s]
[INFO] Apache CXF Runtime RS Security OAuth Parent ....... SUCCESS [1.601s]
[INFO] Apache CXF Runtime OAuth 1.0a ..................... SUCCESS [6.499s]
[INFO] Apache CXF Runtime OAuth 2.0 ...................... SUCCESS [5.588s]
[INFO] Apache CXF Runtime OAuth 2.0 SAML ................. SUCCESS [4.836s]
[INFO] Apache CXF RS Cross-Origin Resource Sharing ....... SUCCESS [3.658s]
[INFO] Apache CXF Runtime Web Management ................. SUCCESS [12.957s]
[INFO] Apache CXF Runtime JavaScript Client Generator Tests  SUCCESS [3.490s]
[INFO] Apache CXF Runtime Security functionality ......... SUCCESS [6.620s]
[INFO] Apache CXF JCA Connection ......................... SUCCESS [5.000s]
[INFO] Apache CXF Integration ............................ SUCCESS [1.542s]
[INFO] Apache CXF Java2WS Maven2 Plugin .................. SUCCESS [4.469s]
[INFO] Apache CXF WADL2Java Code Generation Maven2 Plugin  SUCCESS [5.112s]
[INFO] Apache CXF CORBA Tools Maven2 Plugins ............. SUCCESS [5.183s]
[INFO] Apache CXF Archetype - Simple JAX-WS Java First ... SUCCESS [4.967s]
[INFO] Apache CXF Archetype - Simple JAX-RS webapp ....... SUCCESS [2.743s]
[INFO] Apache CXF Maven Archetypes ....................... SUCCESS [1.571s]
[INFO] Apache CXF STS Core ............................... SUCCESS [9.610s]
[INFO] Apache CXF STS war deployment ..................... SUCCESS [6.359s]
[INFO] Apache CXF STS basic systests ..................... SUCCESS [7.007s]
[INFO] Apache CXF STS advanced systests .................. SUCCESS [6.036s]
[INFO] Apache CXF Services ............................... SUCCESS [2.050s]
[INFO] Apache CXF STS service ............................ SUCCESS [2.108s]
[INFO] Apache CXF STS systests ........................... SUCCESS [3.236s]
[INFO] Apache CXF WSN API ................................ SUCCESS [11.971s]
[INFO] Apache CXF WSN Core ............................... SUCCESS [6.633s]
[INFO] Apache CXF WSN OSGi ............................... SUCCESS [4.019s]
[INFO] Apache CXF WSN service ............................ SUCCESS [1.831s]
[INFO] Apache CXF WS-Discovery API ....................... SUCCESS [6.121s]
[INFO] Apache CXF WS-Discovery Service ................... SUCCESS [2.048s]
[INFO] Apache CXF WS-Discovery ........................... SUCCESS [1.193s]
[INFO] Apache CXF XKMS Common ............................ SUCCESS [8.024s]
[INFO] Apache CXF XKMS X509 Handlers ..................... SUCCESS [5.705s]
[INFO] Apache CXF XKMS Service ........................... SUCCESS [4.885s]
[INFO] Apache CXF XKMS Client ............................ SUCCESS [3.996s]
[INFO] Apache CXF XKMS Karaf Features .................... SUCCESS [2.929s]
[INFO] Apache CXF XKMS OSGi deployment ................... SUCCESS [2.972s]
[INFO] Apache CXF XKMS Service war deployment ............ SUCCESS [3.523s]
[INFO] Apache CXF Karaf Parent ........................... SUCCESS [1.555s]
[INFO] Apache CXF Karaf Features ......................... SUCCESS [3.542s]
[INFO] Apache CXF Karaf Commands ......................... SUCCESS [4.661s]
[INFO] Apache CXF XKMS Integration Tests ................. SUCCESS [5.666s]
[INFO] Apache CXF XKMS ................................... SUCCESS [1.045s]
[INFO] Apache CXF Bundle Parent .......................... SUCCESS [2.471s]
[INFO] Apache CXF Bundle Jar ............................. SUCCESS [2:28.669s]
[INFO] Apache CXF Minimal Bundle Jar ..................... SUCCESS [1:27.464s]
[INFO] Apache CXF JAX-RS Bundle Jar ...................... SUCCESS [40.072s]
[INFO] Apache CXF Compatibility Bundle Jar ............... SUCCESS [1:23.160s]
[INFO] Apache CXF Container Integration System Tests ..... SUCCESS [1.554s]
[INFO] Apache CXF Container Integration Test Webapp ...... SUCCESS [4.945s]
[INFO] Apache CXF Container Integration Test Grizzly ..... SUCCESS [2.369s]
[INFO] Apache CXF Uncategorized System Tests ............. SUCCESS [9.593s]
[INFO] Apache CXF Transport System Tests ................. SUCCESS [4.783s]
[INFO] Apache CXF Transport System Tests JMS ............. SUCCESS [4.157s]
[INFO] Apache CXF JAX-WS System Tests .................... SUCCESS [7.174s]
[INFO] Apache CXF Databinding System Tests ............... SUCCESS [11.473s]
[INFO] Apache CXF JAX-RS System Tests .................... SUCCESS [10.635s]
[INFO] Apache CXF WS-* Specifications System Tests ....... SUCCESS [6.231s]
[INFO] Apache CXF WS-RM Specifications System Tests ...... SUCCESS [3.762s]
[INFO] Apache CXF WS-Security System Tests ............... SUCCESS [11.573s]
[INFO] Apache CXF WS-Security Interop System Tests ....... SUCCESS [10.259s]
[INFO] Apache CXF JAX-RS System Advanced Security Tests .. SUCCESS [2.677s]
[INFO] Test for writing wsdl to repo ..................... SUCCESS [5.485s]
[INFO] Test for generating code from wsdl in repo ........ SUCCESS [8.194s]
[INFO] Apache CXF System Tests ........................... SUCCESS [1.191s]
[INFO] Apache CXF System Tests for Maven Plugins ......... SUCCESS [1.494s]
[INFO] Apache CXF Manifest Jar ........................... SUCCESS [3.201s]
[INFO] Apache CXF Samples ................................ SUCCESS [0.145s]
[INFO] Colocated Demo using Document/Literal Style ....... SUCCESS [3.802s]
[INFO] JavaScript Client Demo using Document/Literal Style  SUCCESS [2.116s]
[INFO] Generated JavaScript Sample using JAX-WS and JSR-181  SUCCESS [0.144s]
[INFO] Java First demo service using the JAXWSFactoryBeans  SUCCESS [0.082s]
[INFO] Java First demo using JMS ......................... SUCCESS [0.087s]
[INFO] JAX-RS Content Negotiation Demo ................... SUCCESS [0.083s]
[INFO] JAX-RS Basic Demo With HTTPS communications ....... SUCCESS [0.130s]
[INFO] JAX-RS Basic Demo ................................. SUCCESS [0.062s]
[INFO] CXF sample using a callback object ................ SUCCESS [1.345s]
[INFO] WSDL first demo using BARE Style in XML Binding (pure XML over HTTP)  SUCCESS [1.366s]
[INFO] JAX-WS Dispatch/Provider Demo ..................... SUCCESS [1.518s]
[INFO] WSDL first demo using Document/Literal Style and XMLBeans DataBinding  SUCCESS [3.034s]
[INFO] WSDL first demo using SOAP12 in Document/Literal Style  SUCCESS [1.343s]
[INFO] CXF Dynamic Client Sample ......................... SUCCESS [1.495s]
[INFO] JMS Transport Queue Demo using Document-Literal Style  SUCCESS [1.488s]
[INFO] WSDL first demo using the jms transport and jmsConfigFeature  SUCCESS [1.503s]
[INFO] RESTful Hello World Demo .......................... SUCCESS [0.093s]
[INFO] WSDL first demo using Document/Literal Style ...... SUCCESS [2.607s]
[INFO] CXF sample using the Aegis Binding without any webservice  SUCCESS [0.178s]
[INFO] Java First demo using JAX-WS APIs ................. SUCCESS [0.897s]
[INFO] WS-RM Demo ........................................ SUCCESS [1.518s]
[INFO] CXF Sample of Stream GZIP Interceptor ............. SUCCESS [1.319s]
[INFO] Spring HTTP Sample ................................ SUCCESS [1.082s]
[INFO] Spring HTTP Servlet demo with ruby support ........ SUCCESS [2.210s]
[INFO] Spring HTTP Servlet demo with groovy support ...... SUCCESS [1.480s]
[INFO] Hello world javascript demo ....................... SUCCESS [1.373s]
[INFO] CXF WS-Security UT Demo ........................... SUCCESS [1.268s]
[INFO] WS-Security UT Sign Demo .......................... SUCCESS [1.378s]
[INFO] CXF WS-Security Sign Encoding Demo ................ SUCCESS [1.689s]
[INFO] WS-Security UT Policy Demo ........................ SUCCESS [1.292s]
[INFO] MTOM Demo for SWA and XOP ......................... SUCCESS [1.339s]
[INFO] JAX-WS Asynchronous Demo using Document/Literal Style  SUCCESS [2.916s]
[INFO] Java First POJO Sample ............................ SUCCESS [0.096s]
[INFO] WS-Policy Demo .................................... SUCCESS [1.404s]
[INFO] Hello World Client Demo using JavaScript .......... SUCCESS [1.330s]
[INFO] WSDL first demo using HTTPS ....................... SUCCESS [1.329s]
[INFO] WS-Addressing Demo ................................ SUCCESS [1.354s]
[INFO] Sample using SOAP Headers ......................... SUCCESS [1.304s]
[INFO] SOAP/JMS Transport Specification Demo using Document-Literal Style  SUCCESS [1.389s]
[INFO] CXF sample using WRAPPED Style in XML Binding (pure XML over HTTP)  SUCCESS [1.227s]
[INFO] CXF sample using code first POJO's and the Aegis Binding  SUCCESS [0.180s]
[INFO] Sample of JAX-* Service Using an Aegis Client ..... SUCCESS [0.094s]
[INFO] JAX-WS Handler Demo ............................... SUCCESS [1.417s]
[INFO] WSDL first demo using RPC-Literal Style ........... SUCCESS [1.186s]
[INFO] JMS Transport Publish/Subscribe Demo using Document-Literal Style  SUCCESS [1.428s]
[INFO] JAX-RS Spring Security Demo ....................... SUCCESS [1.315s]
[INFO] LogBrowser ........................................ SUCCESS [0.091s]
[INFO] WS-Notification Demo .............................. SUCCESS [0.096s]
[INFO] CXF STS Demo ...................................... SUCCESS [1.450s]
[INFO] Bank sample using JAX-WS API's to talk via CORBA/IIOP  SUCCESS [1.692s]
[INFO] Bank sample using JAX-WS API's to talk via CORBA/IIOP  SUCCESS [1.798s]
[INFO] hello-world sample using JAX-WS API's to talk via CORBA/IIOP  SUCCESS [1.547s]
[INFO] OAuth 1.0a server ................................. SUCCESS [1.421s]
[INFO] OAuth 1.0a client ................................. SUCCESS [0.478s]
[INFO] JAX-RS Minimal OSGI Demo .......................... SUCCESS [1.698s]
[INFO] WS-Discovery Sample ............................... SUCCESS [1.354s]
[INFO] Apache CXF Distribution ........................... FAILURE [1:49.159s]
[INFO] ------------------------------------------------------------------------
[INFO] BUILD FAILURE
[INFO] ------------------------------------------------------------------------
[INFO] Total time: 20:32.914s
[INFO] Finished at: Sun Mar 23 07:13:42 UTC 2014
[INFO] Final Memory: 221M/855M
[INFO] ------------------------------------------------------------------------
[ERROR] Failed to execute goal org.apache.maven.plugins:maven-assembly-plugin:2.4:single (distribution-package-src)
on project apache-cxf: Failed to create assembly: Error creating assembly archive src: Problem
creating TAR: request to write '0' bytes exceeds size in header of '-256071510' bytes ->
[Help 1]
[ERROR] 
[ERROR] To see the full stack trace of the errors, re-run Maven with the -e switch.
[ERROR] Re-run Maven using the -X switch to enable full debug logging.
[ERROR] 
[ERROR] For more information about the errors and possible solutions, please read the following
articles:
[ERROR] [Help 1] http://cwiki.apache.org/confluence/display/MAVEN/MojoExecutionException
[ERROR] 
[ERROR] After correcting the problems, you can resume the build with the command
[ERROR]   mvn <goals> -rf :apache-cxf
Build step 'Invoke top-level Maven targets' marked build as failure

Mime
View raw message