cxf-notifications mailing list archives

Site index · List index
Message view « Date » · « Thread »
Top « Date » · « Thread »
From Apache Jenkins Server <jenk...@builds.apache.org>
Subject Build failed in Jenkins: CXF-2.6-deploy #310
Date Thu, 31 Oct 2013 08:24:05 GMT
See <https://builds.apache.org/job/CXF-2.6-deploy/310/changes>

Changes:

[dkulp] Blocking revisions 1536518,1536866,1536867,1536868,1536869,1536872,1536875,1537203,1537204,1537205,1537214,1537215,1537271,1537273,1537282
via  git from
https://svn.apache.org/repos/asf/cxf/branches/2.7.x-fixes

[dkulp] Recording revisions 1537285 via  git from
https://svn.apache.org/repos/asf/cxf/branches/2.7.x-fixes

[dkulp] Merged revisions 1537285 via  git cherry-pick from
https://svn.apache.org/repos/asf/cxf/branches/2.7.x-fixes

........
  r1537285 | dkulp | 2013-10-30 16:30:17 -0400 (Wed, 30 Oct 2013) | 11 lines

  Merged revisions 1537281 via  git cherry-pick from
  https://svn.apache.org/repos/asf/cxf/trunk

  ........
    r1537281 | dkulp | 2013-10-30 16:26:05 -0400 (Wed, 30 Oct 2013) | 3 lines

    [CXF-5366] DigestAuthSupplier should output the algorithm
    Patch from Evgeny Shakin applied

  ........

........

[asoldano] Merged revisions 1537127 via svnmerge from 
https://svn.apache.org/repos/asf/cxf/branches/2.7.x-fixes

................
  r1537127 | asoldano | 2013-10-30 16:18:20 +0100 (Wed, 30 Oct 2013) | 9 lines
  
  Merged revisions 1537121 via svnmerge from 
  https://svn.apache.org/repos/asf/cxf/trunk
  
  ........
    r1537121 | asoldano | 2013-10-30 15:58:53 +0100 (Wed, 30 Oct 2013) | 2 lines
    
    [CXF-5341] Committing patch from Rebecca Searls, thanks!
  ........
................

------------------------------------------
[...truncated 26745 lines...]
[INFO] Apache CXF Woodstox/MSV Schema Validation ......... SUCCESS [5.415s]
[INFO] Apache CXF XML Schema Validation with Xerces ...... SUCCESS [4.542s]
[INFO] Apache CXF Common ................................. SUCCESS [3.003s]
[INFO] Apache CXF Runtime Core ........................... SUCCESS [9.623s]
[INFO] Apache CXF Command Line Tools Common .............. SUCCESS [6.882s]
[INFO] Apache CXF Runtime JAXB DataBinding ............... SUCCESS [7.088s]
[INFO] Apache CXF Runtime SOAP Binding ................... SUCCESS [9.462s]
[INFO] Apache CXF Command Line Tools Validator ........... SUCCESS [6.949s]
[INFO] Apache CXF Command Line Tools WSDLTo Core ......... SUCCESS [7.361s]
[INFO] Apache CXF Command Line Tools WSDLTo JAXWS Frontend  SUCCESS [6.895s]
[INFO] Apache CXF Runtime JavaScript Client Generator Projects  SUCCESS [1.688s]
[INFO] Apache CXF Runtime JavaScript Client Generator .... SUCCESS [5.402s]
[INFO] Apache CXF Command Line Tools WSDL to JavaScript Front End  SUCCESS [4.881s]
[INFO] Apache CXF Command Line Tools WSDLTo JAXB Databinding  SUCCESS [5.624s]
[INFO] Apache CXF Maven Plugins .......................... SUCCESS [1.727s]
[INFO] Apache CXF WSDL Validator Maven2 Plugin ........... SUCCESS [6.272s]
[INFO] Apache CXF Code Generation Maven2 Plugins ......... SUCCESS [8.154s]
[INFO] Apache CXF Test Utilities ......................... SUCCESS [36.124s]
[INFO] Apache CXF Runtime Management ..................... SUCCESS [6.350s]
[INFO] Apache CXF Runtime JMS Transport .................. SUCCESS [10.212s]
[INFO] Apache CXF Runtime XML Binding .................... SUCCESS [6.193s]
[INFO] Apache CXF Runtime Local Transport ................ SUCCESS [4.837s]
[INFO] Apache CXF Runtime WS Policy ...................... SUCCESS [9.546s]
[INFO] Apache CXF Runtime HTTP Transport ................. SUCCESS [8.956s]
[INFO] Apache CXF Runtime HTTP Jetty Transport ........... SUCCESS [7.446s]
[INFO] Apache CXF Runtime Simple Frontend ................ SUCCESS [6.699s]
[INFO] Apache CXF Runtime WS Addressing .................. SUCCESS [6.412s]
[INFO] Apache CXF Runtime JAX-WS Frontend ................ SUCCESS [14.395s]
[INFO] Apache CXF Runtime XmlBeans DataBinding ........... SUCCESS [10.061s]
[INFO] Apache CXF Command Line Tools WSDLTo Test ......... SUCCESS [4.008s]
[INFO] Apache CXF Command Line Tools WSDLTo Misctools .... SUCCESS [5.920s]
[INFO] Apache CXF Command Line Tools ..................... SUCCESS [1.652s]
[INFO] Apache CXF Command Line Tools WSDLTo .............. SUCCESS [1.722s]
[INFO] Apache CXF Runtime Aegis Databinding .............. SUCCESS [10.162s]
[INFO] Apache CXF Command Line Tools JavaTo WS ........... SUCCESS [8.945s]
[INFO] Apache CXF Command Line Tools JavaTo .............. SUCCESS [1.686s]
[INFO] Apache CXF Runtime JAX-RS Frontend ................ SUCCESS [11.863s]
[INFO] Apache CXF Command Line Tools WADLTo JAXRS Frontend  SUCCESS [4.864s]
[INFO] Apache CXF Command Line Tools WADLTo .............. SUCCESS [1.566s]
[INFO] Apache CXF Runtime CORBA Binding .................. SUCCESS [7.770s]
[INFO] Apache CXF Command Line Tools CORBA ............... SUCCESS [9.798s]
[INFO] Apache CXF Runtime SDO DataBinding ................ SUCCESS [7.863s]
[INFO] Apache CXF Runtime JiBX DataBinding ............... SUCCESS [6.453s]
[INFO] Apache CXF Runtime Object Binding ................. SUCCESS [4.840s]
[INFO] Apache CXF Runtime Colocated Binding .............. SUCCESS [4.948s]
[INFO] Apache CXF Runtime ................................ SUCCESS [1.852s]
[INFO] Apache CXF Runtime Bindings ....................... SUCCESS [1.576s]
[INFO] Apache CXF Runtime Clustering ..................... SUCCESS [7.549s]
[INFO] Apache CXF Runtime JavaScript Frontend ............ SUCCESS [5.007s]
[INFO] Apache CXF Runtime WS Reliable Messaging .......... SUCCESS [9.120s]
[INFO] Apache CXF Runtime WS MetadataExchange ............ SUCCESS [5.015s]
[INFO] Apache CXF Runtime WS Security .................... SUCCESS [12.032s]
[INFO] Apache CXF JAX-RS Extensions: Providers ........... SUCCESS [7.290s]
[INFO] Apache CXF JAX-RS Extensions: Search .............. SUCCESS [7.313s]
[INFO] Apache CXF RS XML Security ........................ SUCCESS [6.623s]
[INFO] Apache CXF RS SSO SAML ............................ SUCCESS [6.092s]
[INFO] Apache CXF Runtime RS Security OAuth Parent ....... SUCCESS [2.049s]
[INFO] Apache CXF Runtime OAuth 1.0a ..................... SUCCESS [8.593s]
[INFO] Apache CXF Runtime OAuth 2.0 ...................... SUCCESS [8.289s]
[INFO] Apache CXF RS Cross-Origin Resource Sharing ....... SUCCESS [6.293s]
[INFO] Apache CXF Runtime Web Management ................. SUCCESS [15.212s]
[INFO] Apache CXF Runtime JavaScript Client Generator Tests  SUCCESS [6.360s]
[INFO] Apache CXF JCA Connection ......................... SUCCESS [6.608s]
[INFO] Apache CXF Integration ............................ SUCCESS [1.818s]
[INFO] Apache CXF Java2WS Maven2 Plugin .................. SUCCESS [5.727s]
[INFO] Apache CXF WADL2Java Code Generation Maven2 Plugin  SUCCESS [5.886s]
[INFO] Apache CXF CORBA Tools Maven2 Plugins ............. SUCCESS [5.825s]
[INFO] Apache CXF Archetype - Simple JAX-WS Java First ... SUCCESS [6.041s]
[INFO] Apache CXF Archetype - Simple JAX-RS webapp ....... SUCCESS [3.583s]
[INFO] Apache CXF Maven Archetypes ....................... SUCCESS [1.705s]
[INFO] Apache CXF STS Core ............................... SUCCESS [16.514s]
[INFO] Apache CXF STS war deployment ..................... SUCCESS [13.056s]
[INFO] Apache CXF STS basic systests ..................... SUCCESS [11.546s]
[INFO] Apache CXF STS advanced systests .................. SUCCESS [6.838s]
[INFO] Apache CXF Services ............................... SUCCESS [1.618s]
[INFO] Apache CXF STS service ............................ SUCCESS [1.510s]
[INFO] Apache CXF STS systests ........................... SUCCESS [1.995s]
[INFO] Apache CXF WSN API ................................ SUCCESS [10.966s]
[INFO] Apache CXF WSN Core ............................... SUCCESS [7.747s]
[INFO] Apache CXF WSN OSGi ............................... SUCCESS [6.215s]
[INFO] Apache CXF WSN service ............................ SUCCESS [1.495s]
[INFO] Apache CXF Karaf Parent ........................... SUCCESS [1.835s]
[INFO] Apache CXF Karaf Features ......................... SUCCESS [7.082s]
[INFO] Apache CXF Karaf Commands ......................... SUCCESS [5.582s]
[INFO] Apache CXF Bundle Parent .......................... SUCCESS [2.889s]
[INFO] Apache CXF Bundle Jar ............................. SUCCESS [2:21.313s]
[INFO] Apache CXF Minimal Bundle Jar ..................... SUCCESS [1:25.940s]
[INFO] Apache CXF JAX-RS Bundle Jar ...................... SUCCESS [40.802s]
[INFO] Apache CXF Compatibility Bundle Jar ............... SUCCESS [1:22.265s]
[INFO] Apache CXF Container Integration System Tests ..... SUCCESS [1.864s]
[INFO] Apache CXF Container Integration Test Webapp ...... SUCCESS [6.524s]
[INFO] Apache CXF Container Integration Test Grizzly ..... SUCCESS [6.913s]
[INFO] Apache CXF Uncategorized System Tests ............. FAILURE [11.996s]
[INFO] Apache CXF Transport System Tests ................. SKIPPED
[INFO] Apache CXF Transport System Tests JMS ............. SKIPPED
[INFO] Apache CXF JAX-WS System Tests .................... SKIPPED
[INFO] Apache CXF Databinding System Tests ............... SKIPPED
[INFO] Apache CXF JAX-RS System Tests .................... SKIPPED
[INFO] Apache CXF WS-* Specifications System Tests ....... SKIPPED
[INFO] Apache CXF WS-RM Specifications System Tests ...... SKIPPED
[INFO] Apache CXF WS-Security System Tests ............... SKIPPED
[INFO] Apache CXF WS-Security Interop System Tests ....... SKIPPED
[INFO] Apache CXF JAX-RS System Advanced Security Tests .. SKIPPED
[INFO] Test for writing wsdl to repo ..................... SKIPPED
[INFO] Test for generating code from wsdl in repo ........ SKIPPED
[INFO] Apache CXF System Tests ........................... SKIPPED
[INFO] Apache CXF System Tests for Maven Plugins ......... SKIPPED
[INFO] Apache CXF Manifest Jar ........................... SKIPPED
[INFO] Apache CXF Samples ................................ SKIPPED
[INFO] Colocated Demo using Document/Literal Style ....... SKIPPED
[INFO] JavaScript Client Demo using Document/Literal Style  SKIPPED
[INFO] Generated JavaScript Sample using JAX-WS and JSR-181  SKIPPED
[INFO] Java First demo service using the JAXWSFactoryBeans  SKIPPED
[INFO] Java First demo using JMS ......................... SKIPPED
[INFO] JAX-RS Content Negotiation Demo ................... SKIPPED
[INFO] JAX-RS Basic Demo With HTTPS communications ....... SKIPPED
[INFO] JAX-RS Basic Demo ................................. SKIPPED
[INFO] CXF sample using a callback object ................ SKIPPED
[INFO] WSDL first demo using BARE Style in XML Binding (pure XML over HTTP)  SKIPPED
[INFO] JAX-WS Dispatch/Provider Demo ..................... SKIPPED
[INFO] WSDL first demo using Document/Literal Style and XMLBeans DataBinding  SKIPPED
[INFO] WSDL first demo using SOAP12 in Document/Literal Style  SKIPPED
[INFO] CXF Dynamic Client Sample ......................... SKIPPED
[INFO] JMS Transport Queue Demo using Document-Literal Style  SKIPPED
[INFO] WSDL first demo using the jms transport and jmsConfigFeature  SKIPPED
[INFO] RESTful Hello World Demo .......................... SKIPPED
[INFO] WSDL first demo using Document/Literal Style ...... SKIPPED
[INFO] CXF sample using the Aegis Binding without any webservice  SKIPPED
[INFO] Java First demo using JAX-WS APIs ................. SKIPPED
[INFO] WS-RM Demo ........................................ SKIPPED
[INFO] CXF Sample of Stream GZIP Interceptor ............. SKIPPED
[INFO] Spring HTTP Sample ................................ SKIPPED
[INFO] Spring HTTP Servlet demo with ruby support ........ SKIPPED
[INFO] Spring HTTP Servlet demo with groovy support ...... SKIPPED
[INFO] Hello world javascript demo ....................... SKIPPED
[INFO] CXF WS-Security UT Demo ........................... SKIPPED
[INFO] WS-Security UT Sign Demo .......................... SKIPPED
[INFO] CXF WS-Security Sign Encoding Demo ................ SKIPPED
[INFO] WS-Security UT Policy Demo ........................ SKIPPED
[INFO] MTOM Demo for SWA and XOP ......................... SKIPPED
[INFO] JAX-WS Asynchronous Demo using Document/Literal Style  SKIPPED
[INFO] Java First POJO Sample ............................ SKIPPED
[INFO] WS-Policy Demo .................................... SKIPPED
[INFO] Hello World Client Demo using JavaScript .......... SKIPPED
[INFO] WSDL first demo using HTTPS ....................... SKIPPED
[INFO] WS-Addressing Demo ................................ SKIPPED
[INFO] Sample using SOAP Headers ......................... SKIPPED
[INFO] SOAP/JMS Transport Specification Demo using Document-Literal Style  SKIPPED
[INFO] CXF sample using WRAPPED Style in XML Binding (pure XML over HTTP)  SKIPPED
[INFO] CXF sample using code first POJO's and the Aegis Binding  SKIPPED
[INFO] Sample of JAX-* Service Using an Aegis Client ..... SKIPPED
[INFO] JAX-WS Handler Demo ............................... SKIPPED
[INFO] WSDL first demo using RPC-Literal Style ........... SKIPPED
[INFO] JMS Transport Publish/Subscribe Demo using Document-Literal Style  SKIPPED
[INFO] JAX-RS Spring Security Demo ....................... SKIPPED
[INFO] LogBrowser ........................................ SKIPPED
[INFO] WS-Notification Demo .............................. SKIPPED
[INFO] CXF STS Demo ...................................... SKIPPED
[INFO] Bank sample using JAX-WS API's to talk via CORBA/IIOP  SKIPPED
[INFO] Bank sample using JAX-WS API's to talk via CORBA/IIOP  SKIPPED
[INFO] hello-world sample using JAX-WS API's to talk via CORBA/IIOP  SKIPPED
[INFO] OAuth 1.0a server ................................. SKIPPED
[INFO] OAuth 1.0a client ................................. SKIPPED
[INFO] JAX-RS Minimal OSGI Demo .......................... SKIPPED
[INFO] Apache CXF Distribution ........................... SKIPPED
[INFO] ------------------------------------------------------------------------
[INFO] BUILD FAILURE
[INFO] ------------------------------------------------------------------------
[INFO] Total time: 17:14.302s
[INFO] Finished at: Thu Oct 31 08:24:04 UTC 2013
[INFO] Final Memory: 110M/429M
[INFO] ------------------------------------------------------------------------
[ERROR] Failed to execute goal org.apache.maven.plugins:maven-compiler-plugin:3.1:testCompile
(default-testCompile) on project cxf-systests-uncategorized: Compilation failure: Compilation
failure:
[ERROR] <https://builds.apache.org/job/CXF-2.6-deploy/ws/cxf-2.6.x-fixes/systests/uncategorized/target/generated/src/test/java/org/apache/cxf/hello_world_corba/GreeterCORBAService.java>:[63,9]
cannot find symbol
[ERROR] symbol  : constructor Service(java.net.URL,javax.xml.namespace.QName,javax.xml.ws.WebServiceFeature[])
[ERROR] location: class javax.xml.ws.Service
[ERROR] <https://builds.apache.org/job/CXF-2.6-deploy/ws/cxf-2.6.x-fixes/systests/uncategorized/target/generated/src/test/java/org/apache/cxf/hello_world_corba/GreeterCORBAService.java>:[71,9]
cannot find symbol
[ERROR] symbol  : constructor Service(java.net.URL,javax.xml.namespace.QName,javax.xml.ws.WebServiceFeature[])
[ERROR] location: class javax.xml.ws.Service
[ERROR] <https://builds.apache.org/job/CXF-2.6-deploy/ws/cxf-2.6.x-fixes/systests/uncategorized/target/generated/src/test/java/org/apache/cxf/hello_world_corba/GreeterCORBAService.java>:[79,9]
cannot find symbol
[ERROR] symbol  : constructor Service(java.net.URL,javax.xml.namespace.QName,javax.xml.ws.WebServiceFeature[])
[ERROR] location: class javax.xml.ws.Service
[ERROR] <https://builds.apache.org/job/CXF-2.6-deploy/ws/cxf-2.6.x-fixes/systests/uncategorized/target/generated/src/test/java/org/apache/cxf/soapfault/SoapFaultService.java>:[63,9]
cannot find symbol
[ERROR] symbol  : constructor Service(java.net.URL,javax.xml.namespace.QName,javax.xml.ws.WebServiceFeature[])
[ERROR] location: class javax.xml.ws.Service
[ERROR] <https://builds.apache.org/job/CXF-2.6-deploy/ws/cxf-2.6.x-fixes/systests/uncategorized/target/generated/src/test/java/org/apache/cxf/soapfault/SoapFaultService.java>:[71,9]
cannot find symbol
[ERROR] symbol  : constructor Service(java.net.URL,javax.xml.namespace.QName,javax.xml.ws.WebServiceFeature[])
[ERROR] location: class javax.xml.ws.Service
[ERROR] <https://builds.apache.org/job/CXF-2.6-deploy/ws/cxf-2.6.x-fixes/systests/uncategorized/target/generated/src/test/java/org/apache/cxf/soapfault/SoapFaultService.java>:[79,9]
cannot find symbol
[ERROR] symbol  : constructor Service(java.net.URL,javax.xml.namespace.QName,javax.xml.ws.WebServiceFeature[])
[ERROR] location: class javax.xml.ws.Service
[ERROR] <https://builds.apache.org/job/CXF-2.6-deploy/ws/cxf-2.6.x-fixes/systests/uncategorized/target/generated/src/test/java/testnotification/NotificationService.java>:[63,9]
cannot find symbol
[ERROR] symbol  : constructor Service(java.net.URL,javax.xml.namespace.QName,javax.xml.ws.WebServiceFeature[])
[ERROR] location: class javax.xml.ws.Service
[ERROR] <https://builds.apache.org/job/CXF-2.6-deploy/ws/cxf-2.6.x-fixes/systests/uncategorized/target/generated/src/test/java/testnotification/NotificationService.java>:[71,9]
cannot find symbol
[ERROR] symbol  : constructor Service(java.net.URL,javax.xml.namespace.QName,javax.xml.ws.WebServiceFeature[])
[ERROR] location: class javax.xml.ws.Service
[ERROR] <https://builds.apache.org/job/CXF-2.6-deploy/ws/cxf-2.6.x-fixes/systests/uncategorized/target/generated/src/test/java/testnotification/NotificationService.java>:[79,9]
cannot find symbol
[ERROR] symbol  : constructor Service(java.net.URL,javax.xml.namespace.QName,javax.xml.ws.WebServiceFeature[])
[ERROR] location: class javax.xml.ws.Service
[ERROR] <https://builds.apache.org/job/CXF-2.6-deploy/ws/cxf-2.6.x-fixes/systests/uncategorized/target/generated/src/test/java/org/apache/cxf/pizza/PizzaService.java>:[63,9]
cannot find symbol
[ERROR] symbol  : constructor Service(java.net.URL,javax.xml.namespace.QName,javax.xml.ws.WebServiceFeature[])
[ERROR] location: class javax.xml.ws.Service
[ERROR] <https://builds.apache.org/job/CXF-2.6-deploy/ws/cxf-2.6.x-fixes/systests/uncategorized/target/generated/src/test/java/org/apache/cxf/pizza/PizzaService.java>:[71,9]
cannot find symbol
[ERROR] symbol  : constructor Service(java.net.URL,javax.xml.namespace.QName,javax.xml.ws.WebServiceFeature[])
[ERROR] location: class javax.xml.ws.Service
[ERROR] <https://builds.apache.org/job/CXF-2.6-deploy/ws/cxf-2.6.x-fixes/systests/uncategorized/target/generated/src/test/java/org/apache/cxf/pizza/PizzaService.java>:[79,9]
cannot find symbol
[ERROR] symbol  : constructor Service(java.net.URL,javax.xml.namespace.QName,javax.xml.ws.WebServiceFeature[])
[ERROR] location: class javax.xml.ws.Service
[ERROR] <https://builds.apache.org/job/CXF-2.6-deploy/ws/cxf-2.6.x-fixes/systests/uncategorized/target/generated/src/test/java/org/apache/hello_world_rpclit/SOAPServiceRPCLit.java>:[63,9]
cannot find symbol
[ERROR] symbol  : constructor Service(java.net.URL,javax.xml.namespace.QName,javax.xml.ws.WebServiceFeature[])
[ERROR] location: class javax.xml.ws.Service
[ERROR] <https://builds.apache.org/job/CXF-2.6-deploy/ws/cxf-2.6.x-fixes/systests/uncategorized/target/generated/src/test/java/org/apache/hello_world_rpclit/SOAPServiceRPCLit.java>:[71,9]
cannot find symbol
[ERROR] symbol  : constructor Service(java.net.URL,javax.xml.namespace.QName,javax.xml.ws.WebServiceFeature[])
[ERROR] location: class javax.xml.ws.Service
[ERROR] <https://builds.apache.org/job/CXF-2.6-deploy/ws/cxf-2.6.x-fixes/systests/uncategorized/target/generated/src/test/java/org/apache/hello_world_rpclit/SOAPServiceRPCLit.java>:[79,9]
cannot find symbol
[ERROR] symbol  : constructor Service(java.net.URL,javax.xml.namespace.QName,javax.xml.ws.WebServiceFeature[])
[ERROR] location: class javax.xml.ws.Service
[ERROR] <https://builds.apache.org/job/CXF-2.6-deploy/ws/cxf-2.6.x-fixes/systests/uncategorized/target/generated/src/test/java/org/apache/cxf/pizza_wrapped/PizzaService.java>:[63,9]
cannot find symbol
[ERROR] symbol  : constructor Service(java.net.URL,javax.xml.namespace.QName,javax.xml.ws.WebServiceFeature[])
[ERROR] location: class javax.xml.ws.Service
[ERROR] <https://builds.apache.org/job/CXF-2.6-deploy/ws/cxf-2.6.x-fixes/systests/uncategorized/target/generated/src/test/java/org/apache/cxf/pizza_wrapped/PizzaService.java>:[71,9]
cannot find symbol
[ERROR] symbol  : constructor Service(java.net.URL,javax.xml.namespace.QName,javax.xml.ws.WebServiceFeature[])
[ERROR] location: class javax.xml.ws.Service
[ERROR] <https://builds.apache.org/job/CXF-2.6-deploy/ws/cxf-2.6.x-fixes/systests/uncategorized/target/generated/src/test/java/org/apache/cxf/pizza_wrapped/PizzaService.java>:[79,9]
cannot find symbol
[ERROR] symbol  : constructor Service(java.net.URL,javax.xml.namespace.QName,javax.xml.ws.WebServiceFeature[])
[ERROR] location: class javax.xml.ws.Service
[ERROR] <https://builds.apache.org/job/CXF-2.6-deploy/ws/cxf-2.6.x-fixes/systests/uncategorized/target/generated/src/test/java/org/apache/cxf/systest/mtom_feature/HelloService.java>:[63,9]
cannot find symbol
[ERROR] symbol  : constructor Service(java.net.URL,javax.xml.namespace.QName,javax.xml.ws.WebServiceFeature[])
[ERROR] location: class javax.xml.ws.Service
[ERROR] <https://builds.apache.org/job/CXF-2.6-deploy/ws/cxf-2.6.x-fixes/systests/uncategorized/target/generated/src/test/java/org/apache/cxf/systest/mtom_feature/HelloService.java>:[71,9]
cannot find symbol
[ERROR] symbol  : constructor Service(java.net.URL,javax.xml.namespace.QName,javax.xml.ws.WebServiceFeature[])
[ERROR] location: class javax.xml.ws.Service
[ERROR] <https://builds.apache.org/job/CXF-2.6-deploy/ws/cxf-2.6.x-fixes/systests/uncategorized/target/generated/src/test/java/org/apache/cxf/systest/mtom_feature/HelloService.java>:[79,9]
cannot find symbol
[ERROR] symbol  : constructor Service(java.net.URL,javax.xml.namespace.QName,javax.xml.ws.WebServiceFeature[])
[ERROR] location: class javax.xml.ws.Service
[ERROR] -> [Help 1]
[ERROR] 
[ERROR] To see the full stack trace of the errors, re-run Maven with the -e switch.
[ERROR] Re-run Maven using the -X switch to enable full debug logging.
[ERROR] 
[ERROR] For more information about the errors and possible solutions, please read the following
articles:
[ERROR] [Help 1] http://cwiki.apache.org/confluence/display/MAVEN/MojoFailureException
[ERROR] 
[ERROR] After correcting the problems, you can resume the build with the command
[ERROR]   mvn <goals> -rf :cxf-systests-uncategorized
Build step 'Invoke top-level Maven targets' marked build as failure
ERROR: Maven JVM terminated unexpectedly with exit code 143


Mime
View raw message