cxf-notifications mailing list archives

Site index · List index
Message view « Date » · « Thread »
Top « Date » · « Thread »
From Apache Jenkins Server <jenk...@builds.apache.org>
Subject Build failed in Jenkins: CXF-2.6-deploy #271
Date Wed, 21 Aug 2013 07:00:29 GMT
See <https://builds.apache.org/job/CXF-2.6-deploy/271/changes>

Changes:

[sergeyb] Merged revisions 1515924 via svnmerge from 
https://svn.apache.org/repos/asf/cxf/branches/2.7.x-fixes

................
  r1515924 | sergeyb | 2013-08-20 22:05:19 +0300 (Tue, 20 Aug 2013) | 9 lines
  
  Merged revisions 1515922 via svnmerge from 
  https://svn.apache.org/repos/asf/cxf/trunk
  
  ........
    r1515922 | sergeyb | 2013-08-20 22:00:10 +0300 (Tue, 20 Aug 2013) | 1 line
    
    [CXF-5212] Checking for superclass when looking for context setters, patch on behalf of
Thorsten Hoeger applied
  ........
................

[ay] Merged revisions 1515848 via  svn merge from
https://svn.apache.org/repos/asf/cxf/branches/2.7.x-fixes

........
  r1515848 | ay | 2013-08-20 17:45:20 +0200 (Tue, 20 Aug 2013) | 9 lines
  
  Merged revisions 1515822 via  svn merge from
  https://svn.apache.org/repos/asf/cxf/trunk
  
  ........
    r1515822 | ay | 2013-08-20 15:36:39 +0200 (Tue, 20 Aug 2013) | 1 line
    
    [CXF-5218] WS-RM destination's fault handling to distinguish protocol related faults from
other faults
  ........
  
........

[sergeyb] Merged revisions 1515825 via svnmerge from 
https://svn.apache.org/repos/asf/cxf/branches/2.7.x-fixes

................
  r1515825 | sergeyb | 2013-08-20 16:51:25 +0300 (Tue, 20 Aug 2013) | 13 lines
  
  Merged revisions 1515823-1515824 via svnmerge from 
  https://svn.apache.org/repos/asf/cxf/trunk
  
  ........
    r1515823 | sergeyb | 2013-08-20 16:38:29 +0300 (Tue, 20 Aug 2013) | 1 line
    
    [CXF-5204] Taking care of TypeVars wrapped in GenericEntity too
  ........
    r1515824 | sergeyb | 2013-08-20 16:46:00 +0300 (Tue, 20 Aug 2013) | 1 line
    
    Minor update to the test
  ........
................

[sergeyb] Merged revisions 1515798 via svnmerge from 
https://svn.apache.org/repos/asf/cxf/branches/2.7.x-fixes

................
  r1515798 | sergeyb | 2013-08-20 15:32:24 +0300 (Tue, 20 Aug 2013) | 9 lines
  
  Merged revisions 1515796 via svnmerge from 
  https://svn.apache.org/repos/asf/cxf/trunk
  
  ........
    r1515796 | sergeyb | 2013-08-20 15:21:40 +0300 (Tue, 20 Aug 2013) | 1 line
    
    [CXF-5204] Some more work to do with handling TypeVariable
  ........
................

------------------------------------------
[...truncated 18194 lines...]
 This can be caused by compile errors in Eclipse because Eclipse creates 
valid class files regardless of compile errors.
The following package(s) import from the default package null
[INFO] 
[INFO] --- jibx-maven-plugin:1.2.4.5:bind (compile-binding) @ cxf-systests-jaxrs ---
[INFO] Running JiBX binding compiler (single-module mode) on 1 binding file(s)
Verification failure on class org.apache.cxf.systest.jaxrs.codegen.jibx.Book:
  VERIFIED_REJECTED
Repository.lookup() failed. FILE NOT FOUND?

Verification failure on class org.apache.cxf.systest.jaxrs.codegen.jibx.JiBX_bindingBook_access:
  VERIFIED_REJECTED
Repository.lookup() failed. FILE NOT FOUND?

Verification failure on class org.apache.cxf.systest.jaxrs.codegen.jibx.JiBX_bindingFactory:
  VERIFIED_REJECTED
Repository.lookup() failed. FILE NOT FOUND?

[INFO] 
[INFO] --- maven-resources-plugin:2.6:testResources (default-testResources) @ cxf-systests-jaxrs
---
[INFO] Using 'UTF-8' encoding to copy filtered resources.
[INFO] Copying 104 resources
[INFO] Copying 61 resources
[INFO] skip non existing resourceDirectory <https://builds.apache.org/job/CXF-2.6-deploy/ws/cxf-2.6.x-fixes/systests/jaxrs/target/generated/src/test/resources>
[INFO] Copying 3 resources
[INFO] 
[INFO] --- maven-compiler-plugin:3.1:testCompile (default-testCompile) @ cxf-systests-jaxrs
---
[INFO] Changes detected - recompiling the module!
[INFO] Compiling 171 source files to <https://builds.apache.org/job/CXF-2.6-deploy/ws/cxf-2.6.x-fixes/systests/jaxrs/target/test-classes>
[INFO] -------------------------------------------------------------
[ERROR] COMPILATION ERROR : 
[INFO] -------------------------------------------------------------
[ERROR] <https://builds.apache.org/job/CXF-2.6-deploy/ws/cxf-2.6.x-fixes/systests/jaxrs/src/test/java/org/apache/cxf/systest/jaxrs/security/SecureBookStore.java>:[35,37]
cannot find symbol
symbol: class AbstractSecureBookStore
public class SecureBookStore extends AbstractSecureBookStore implements SecureBookInterface
{
[ERROR] <https://builds.apache.org/job/CXF-2.6-deploy/ws/cxf-2.6.x-fixes/systests/jaxrs/src/test/java/org/apache/cxf/systest/jaxrs/security/SecureBookStore.java>:[72,13]
cannot find symbol
symbol  : variable securityContext
location: class org.apache.cxf.systest.jaxrs.security.SecureBookStore
[ERROR] <https://builds.apache.org/job/CXF-2.6-deploy/ws/cxf-2.6.x-fixes/systests/jaxrs/src/test/java/org/apache/cxf/systest/jaxrs/security/SecureBookStore.java>:[73,15]
cannot find symbol
symbol  : variable securityContext
location: class org.apache.cxf.systest.jaxrs.security.SecureBookStore
[ERROR] <https://builds.apache.org/job/CXF-2.6-deploy/ws/cxf-2.6.x-fixes/systests/jaxrs/src/test/java/org/apache/cxf/systest/jaxrs/security/SecureBookStore.java>:[74,16]
cannot find symbol
symbol  : variable securityContext
location: class org.apache.cxf.systest.jaxrs.security.SecureBookStore
[ERROR] <https://builds.apache.org/job/CXF-2.6-deploy/ws/cxf-2.6.x-fixes/systests/jaxrs/src/test/java/org/apache/cxf/systest/jaxrs/CustomJAXRSInvoker.java>:[44,22]
incomparable types: java.lang.Class<capture of ?> and java.lang.Class<org.apache.cxf.systest.jaxrs.security.SecureBookStore>
[INFO] 5 errors 
[INFO] -------------------------------------------------------------
[INFO] ------------------------------------------------------------------------
[INFO] Reactor Summary:
[INFO] 
[INFO] Apache CXF ........................................ SUCCESS [11.418s]
[INFO] Apache CXF Parent ................................. SUCCESS [3.900s]
[INFO] Apache CXF API .................................... SUCCESS [48.422s]
[INFO] Apache CXF Woodstox/MSV Schema Validation ......... SUCCESS [7.249s]
[INFO] Apache CXF XML Schema Validation with Xerces ...... SUCCESS [6.530s]
[INFO] Apache CXF Common ................................. SUCCESS [2.162s]
[INFO] Apache CXF Runtime Core ........................... SUCCESS [16.839s]
[INFO] Apache CXF Command Line Tools Common .............. SUCCESS [10.979s]
[INFO] Apache CXF Runtime JAXB DataBinding ............... SUCCESS [8.930s]
[INFO] Apache CXF Runtime SOAP Binding ................... SUCCESS [12.310s]
[INFO] Apache CXF Command Line Tools Validator ........... SUCCESS [9.666s]
[INFO] Apache CXF Command Line Tools WSDLTo Core ......... SUCCESS [8.249s]
[INFO] Apache CXF Command Line Tools WSDLTo JAXWS Frontend  SUCCESS [9.843s]
[INFO] Apache CXF Runtime JavaScript Client Generator Projects  SUCCESS [8.303s]
[INFO] Apache CXF Runtime JavaScript Client Generator .... SUCCESS [9.607s]
[INFO] Apache CXF Command Line Tools WSDL to JavaScript Front End  SUCCESS [7.531s]
[INFO] Apache CXF Command Line Tools WSDLTo JAXB Databinding  SUCCESS [7.135s]
[INFO] Apache CXF Maven Plugins .......................... SUCCESS [1.912s]
[INFO] Apache CXF WSDL Validator Maven2 Plugin ........... SUCCESS [8.781s]
[INFO] Apache CXF Code Generation Maven2 Plugins ......... SUCCESS [13.018s]
[INFO] Apache CXF Test Utilities ......................... SUCCESS [52.061s]
[INFO] Apache CXF Runtime Management ..................... SUCCESS [10.665s]
[INFO] Apache CXF Runtime JMS Transport .................. SUCCESS [12.301s]
[INFO] Apache CXF Runtime XML Binding .................... SUCCESS [8.474s]
[INFO] Apache CXF Runtime Local Transport ................ SUCCESS [7.393s]
[INFO] Apache CXF Runtime WS Policy ...................... SUCCESS [14.681s]
[INFO] Apache CXF Runtime HTTP Transport ................. SUCCESS [16.142s]
[INFO] Apache CXF Runtime HTTP Jetty Transport ........... SUCCESS [11.104s]
[INFO] Apache CXF Runtime Simple Frontend ................ SUCCESS [11.142s]
[INFO] Apache CXF Runtime WS Addressing .................. SUCCESS [9.450s]
[INFO] Apache CXF Runtime JAX-WS Frontend ................ SUCCESS [18.523s]
[INFO] Apache CXF Runtime XmlBeans DataBinding ........... SUCCESS [11.438s]
[INFO] Apache CXF Command Line Tools WSDLTo Test ......... SUCCESS [8.785s]
[INFO] Apache CXF Command Line Tools WSDLTo Misctools .... SUCCESS [9.216s]
[INFO] Apache CXF Command Line Tools ..................... SUCCESS [2.048s]
[INFO] Apache CXF Command Line Tools WSDLTo .............. SUCCESS [1.812s]
[INFO] Apache CXF Runtime Aegis Databinding .............. SUCCESS [17.802s]
[INFO] Apache CXF Command Line Tools JavaTo WS ........... SUCCESS [14.317s]
[INFO] Apache CXF Command Line Tools JavaTo .............. SUCCESS [2.481s]
[INFO] Apache CXF Runtime JAX-RS Frontend ................ SUCCESS [26.696s]
[INFO] Apache CXF Command Line Tools WADLTo JAXRS Frontend  SUCCESS [10.597s]
[INFO] Apache CXF Command Line Tools WADLTo .............. SUCCESS [1.957s]
[INFO] Apache CXF Runtime CORBA Binding .................. SUCCESS [17.218s]
[INFO] Apache CXF Command Line Tools CORBA ............... SUCCESS [18.276s]
[INFO] Apache CXF Runtime SDO DataBinding ................ SUCCESS [9.369s]
[INFO] Apache CXF Runtime JiBX DataBinding ............... SUCCESS [9.358s]
[INFO] Apache CXF Runtime Object Binding ................. SUCCESS [8.376s]
[INFO] Apache CXF Runtime Colocated Binding .............. SUCCESS [8.459s]
[INFO] Apache CXF Runtime ................................ SUCCESS [2.414s]
[INFO] Apache CXF Runtime Bindings ....................... SUCCESS [2.189s]
[INFO] Apache CXF Runtime Clustering ..................... SUCCESS [10.087s]
[INFO] Apache CXF Runtime JavaScript Frontend ............ SUCCESS [8.295s]
[INFO] Apache CXF Runtime WS Reliable Messaging .......... SUCCESS [18.038s]
[INFO] Apache CXF Runtime WS MetadataExchange ............ SUCCESS [8.029s]
[INFO] Apache CXF Runtime WS Security .................... SUCCESS [31.342s]
[INFO] Apache CXF JAX-RS Extensions: Providers ........... SUCCESS [10.331s]
[INFO] Apache CXF JAX-RS Extensions: Search .............. SUCCESS [13.358s]
[INFO] Apache CXF RS XML Security ........................ SUCCESS [9.793s]
[INFO] Apache CXF RS SSO SAML ............................ SUCCESS [10.058s]
[INFO] Apache CXF Runtime RS Security OAuth Parent ....... SUCCESS [2.584s]
[INFO] Apache CXF Runtime OAuth 1.0a ..................... SUCCESS [12.495s]
[INFO] Apache CXF Runtime OAuth 2.0 ...................... SUCCESS [12.104s]
[INFO] Apache CXF RS Cross-Origin Resource Sharing ....... SUCCESS [7.394s]
[INFO] Apache CXF Runtime Web Management ................. SUCCESS [58.250s]
[INFO] Apache CXF Runtime JavaScript Client Generator Tests  SUCCESS [4.630s]
[INFO] Apache CXF JCA Connection ......................... SUCCESS [11.101s]
[INFO] Apache CXF Integration ............................ SUCCESS [2.924s]
[INFO] Apache CXF Java2WS Maven2 Plugin .................. SUCCESS [10.822s]
[INFO] Apache CXF WADL2Java Code Generation Maven2 Plugin  SUCCESS [12.322s]
[INFO] Apache CXF CORBA Tools Maven2 Plugins ............. SUCCESS [11.978s]
[INFO] Apache CXF Archetype - Simple JAX-WS Java First ... SUCCESS [10.864s]
[INFO] Apache CXF Archetype - Simple JAX-RS webapp ....... SUCCESS [7.767s]
[INFO] Apache CXF Maven Archetypes ....................... SUCCESS [2.466s]
[INFO] Apache CXF STS Core ............................... SUCCESS [16.367s]
[INFO] Apache CXF STS war deployment ..................... SUCCESS [19.345s]
[INFO] Apache CXF STS basic systests ..................... SUCCESS [9.891s]
[INFO] Apache CXF STS advanced systests .................. SUCCESS [9.751s]
[INFO] Apache CXF Services ............................... SUCCESS [5.750s]
[INFO] Apache CXF STS service ............................ SUCCESS [3.151s]
[INFO] Apache CXF STS systests ........................... SUCCESS [2.426s]
[INFO] Apache CXF WSN API ................................ SUCCESS [17.426s]
[INFO] Apache CXF WSN Core ............................... SUCCESS [13.778s]
[INFO] Apache CXF WSN OSGi ............................... SUCCESS [8.881s]
[INFO] Apache CXF WSN service ............................ SUCCESS [2.383s]
[INFO] Apache CXF Karaf Parent ........................... SUCCESS [3.690s]
[INFO] Apache CXF Karaf Features ......................... SUCCESS [5.061s]
[INFO] Apache CXF Karaf Commands ......................... SUCCESS [9.495s]
[INFO] Apache CXF Bundle Parent .......................... SUCCESS [5.030s]
[INFO] Apache CXF Bundle Jar ............................. SUCCESS [5:16.253s]
[INFO] Apache CXF Minimal Bundle Jar ..................... SUCCESS [3:16.864s]
[INFO] Apache CXF JAX-RS Bundle Jar ...................... SUCCESS [1:44.930s]
[INFO] Apache CXF Compatibility Bundle Jar ............... SUCCESS [3:22.792s]
[INFO] Apache CXF Container Integration System Tests ..... SUCCESS [9.117s]
[INFO] Apache CXF Container Integration Test Webapp ...... SUCCESS [15.293s]
[INFO] Apache CXF Uncategorized System Tests ............. SUCCESS [14.395s]
[INFO] Apache CXF Transport System Tests ................. SUCCESS [11.991s]
[INFO] Apache CXF Transport System Tests JMS ............. SUCCESS [11.729s]
[INFO] Apache CXF JAX-WS System Tests .................... SUCCESS [9.468s]
[INFO] Apache CXF Databinding System Tests ............... SUCCESS [11.168s]
[INFO] Apache CXF JAX-RS System Tests .................... FAILURE [8.135s]
[INFO] Apache CXF WS-* Specifications System Tests ....... SKIPPED
[INFO] Apache CXF WS-RM Specifications System Tests ...... SKIPPED
[INFO] Apache CXF WS-Security System Tests ............... SKIPPED
[INFO] Apache CXF WS-Security Interop System Tests ....... SKIPPED
[INFO] Apache CXF JAX-RS System Advanced Security Tests .. SKIPPED
[INFO] Test for writing wsdl to repo ..................... SKIPPED
[INFO] Test for generating code from wsdl in repo ........ SKIPPED
[INFO] Apache CXF System Tests ........................... SKIPPED
[INFO] Apache CXF System Tests for Maven Plugins ......... SKIPPED
[INFO] Apache CXF Manifest Jar ........................... SKIPPED
[INFO] Apache CXF Samples ................................ SKIPPED
[INFO] Colocated Demo using Document/Literal Style ....... SKIPPED
[INFO] JavaScript Client Demo using Document/Literal Style  SKIPPED
[INFO] Generated JavaScript Sample using JAX-WS and JSR-181  SKIPPED
[INFO] Java First demo service using the JAXWSFactoryBeans  SKIPPED
[INFO] Java First demo using JMS ......................... SKIPPED
[INFO] JAX-RS Content Negotiation Demo ................... SKIPPED
[INFO] JAX-RS Basic Demo With HTTPS communications ....... SKIPPED
[INFO] JAX-RS Basic Demo ................................. SKIPPED
[INFO] CXF sample using a callback object ................ SKIPPED
[INFO] WSDL first demo using BARE Style in XML Binding (pure XML over HTTP)  SKIPPED
[INFO] JAX-WS Dispatch/Provider Demo ..................... SKIPPED
[INFO] WSDL first demo using Document/Literal Style and XMLBeans DataBinding  SKIPPED
[INFO] WSDL first demo using SOAP12 in Document/Literal Style  SKIPPED
[INFO] CXF Dynamic Client Sample ......................... SKIPPED
[INFO] JMS Transport Queue Demo using Document-Literal Style  SKIPPED
[INFO] WSDL first demo using the jms transport and jmsConfigFeature  SKIPPED
[INFO] RESTful Hello World Demo .......................... SKIPPED
[INFO] WSDL first demo using Document/Literal Style ...... SKIPPED
[INFO] CXF sample using the Aegis Binding without any webservice  SKIPPED
[INFO] Java First demo using JAX-WS APIs ................. SKIPPED
[INFO] WS-RM Demo ........................................ SKIPPED
[INFO] CXF Sample of Stream GZIP Interceptor ............. SKIPPED
[INFO] Spring HTTP Sample ................................ SKIPPED
[INFO] Spring HTTP Servlet demo with ruby support ........ SKIPPED
[INFO] Spring HTTP Servlet demo with groovy support ...... SKIPPED
[INFO] Hello world javascript demo ....................... SKIPPED
[INFO] CXF WS-Security UT Demo ........................... SKIPPED
[INFO] WS-Security UT Sign Demo .......................... SKIPPED
[INFO] CXF WS-Security Sign Encoding Demo ................ SKIPPED
[INFO] WS-Security UT Policy Demo ........................ SKIPPED
[INFO] MTOM Demo for SWA and XOP ......................... SKIPPED
[INFO] JAX-WS Asynchronous Demo using Document/Literal Style  SKIPPED
[INFO] Java First POJO Sample ............................ SKIPPED
[INFO] WS-Policy Demo .................................... SKIPPED
[INFO] Hello World Client Demo using JavaScript .......... SKIPPED
[INFO] WSDL first demo using HTTPS ....................... SKIPPED
[INFO] WS-Addressing Demo ................................ SKIPPED
[INFO] Sample using SOAP Headers ......................... SKIPPED
[INFO] SOAP/JMS Transport Specification Demo using Document-Literal Style  SKIPPED
[INFO] CXF sample using WRAPPED Style in XML Binding (pure XML over HTTP)  SKIPPED
[INFO] CXF sample using code first POJO's and the Aegis Binding  SKIPPED
[INFO] Sample of JAX-* Service Using an Aegis Client ..... SKIPPED
[INFO] JAX-WS Handler Demo ............................... SKIPPED
[INFO] WSDL first demo using RPC-Literal Style ........... SKIPPED
[INFO] JMS Transport Publish/Subscribe Demo using Document-Literal Style  SKIPPED
[INFO] JAX-RS Spring Security Demo ....................... SKIPPED
[INFO] LogBrowser ........................................ SKIPPED
[INFO] WS-Notification Demo .............................. SKIPPED
[INFO] CXF STS Demo ...................................... SKIPPED
[INFO] Bank sample using JAX-WS API's to talk via CORBA/IIOP  SKIPPED
[INFO] Bank sample using JAX-WS API's to talk via CORBA/IIOP  SKIPPED
[INFO] hello-world sample using JAX-WS API's to talk via CORBA/IIOP  SKIPPED
[INFO] OAuth 1.0a server ................................. SKIPPED
[INFO] OAuth 1.0a client ................................. SKIPPED
[INFO] JAX-RS Minimal OSGI Demo .......................... SKIPPED
[INFO] Apache CXF Distribution ........................... SKIPPED
[INFO] ------------------------------------------------------------------------
[INFO] BUILD FAILURE
[INFO] ------------------------------------------------------------------------
[INFO] Total time: 31:45.787s
[INFO] Finished at: Wed Aug 21 07:00:27 UTC 2013
[INFO] Final Memory: 115M/249M
[INFO] ------------------------------------------------------------------------
[ERROR] Failed to execute goal org.apache.maven.plugins:maven-compiler-plugin:3.1:testCompile
(default-testCompile) on project cxf-systests-jaxrs: Compilation failure: Compilation failure:
[ERROR] <https://builds.apache.org/job/CXF-2.6-deploy/ws/cxf-2.6.x-fixes/systests/jaxrs/src/test/java/org/apache/cxf/systest/jaxrs/security/SecureBookStore.java>:[35,37]
cannot find symbol
[ERROR] symbol: class AbstractSecureBookStore
[ERROR] public class SecureBookStore extends AbstractSecureBookStore implements SecureBookInterface
{
[ERROR] <https://builds.apache.org/job/CXF-2.6-deploy/ws/cxf-2.6.x-fixes/systests/jaxrs/src/test/java/org/apache/cxf/systest/jaxrs/security/SecureBookStore.java>:[72,13]
cannot find symbol
[ERROR] symbol  : variable securityContext
[ERROR] location: class org.apache.cxf.systest.jaxrs.security.SecureBookStore
[ERROR] <https://builds.apache.org/job/CXF-2.6-deploy/ws/cxf-2.6.x-fixes/systests/jaxrs/src/test/java/org/apache/cxf/systest/jaxrs/security/SecureBookStore.java>:[73,15]
cannot find symbol
[ERROR] symbol  : variable securityContext
[ERROR] location: class org.apache.cxf.systest.jaxrs.security.SecureBookStore
[ERROR] <https://builds.apache.org/job/CXF-2.6-deploy/ws/cxf-2.6.x-fixes/systests/jaxrs/src/test/java/org/apache/cxf/systest/jaxrs/security/SecureBookStore.java>:[74,16]
cannot find symbol
[ERROR] symbol  : variable securityContext
[ERROR] location: class org.apache.cxf.systest.jaxrs.security.SecureBookStore
[ERROR] <https://builds.apache.org/job/CXF-2.6-deploy/ws/cxf-2.6.x-fixes/systests/jaxrs/src/test/java/org/apache/cxf/systest/jaxrs/CustomJAXRSInvoker.java>:[44,22]
incomparable types: java.lang.Class<capture of ?> and java.lang.Class<org.apache.cxf.systest.jaxrs.security.SecureBookStore>
[ERROR] -> [Help 1]
[ERROR] 
[ERROR] To see the full stack trace of the errors, re-run Maven with the -e switch.
[ERROR] Re-run Maven using the -X switch to enable full debug logging.
[ERROR] 
[ERROR] For more information about the errors and possible solutions, please read the following
articles:
[ERROR] [Help 1] http://cwiki.apache.org/confluence/display/MAVEN/MojoFailureException
[ERROR] 
[ERROR] After correcting the problems, you can resume the build with the command
[ERROR]   mvn <goals> -rf :cxf-systests-jaxrs
Build step 'Invoke top-level Maven targets' marked build as failure

Mime
View raw message