cxf-notifications mailing list archives

Site index · List index
Message view « Date » · « Thread »
Top « Date » · « Thread »
From Apache Jenkins Server <jenk...@builds.apache.org>
Subject Build failed in Jenkins: CXF-DOSGi #392
Date Mon, 26 Aug 2013 09:32:03 GMT
See <https://builds.apache.org/job/CXF-DOSGi/392/changes>

Changes:

[cschneider] DOSGI-204 Update OSGi spec and felix

------------------------------------------
Started by an SCM change
Building remotely on ubuntu4 in workspace <https://builds.apache.org/job/CXF-DOSGi/ws/>
Updating http://svn.apache.org/repos/asf/cxf/dosgi/trunk at revision '2013-08-26T09:31:23.606
+0000'
U         distribution/features/src/main/resources/features.xml
U         distribution/multi-bundle/pom.xml
U         distribution/multi-bundle2/pom.xml
U         distribution/multi-bundle2/src/main/xsl/felix_distro_config.xslt
D         distribution/multi-bundle2/src/main/resources/META-INF/NOTICE.jdom
U         distribution/pom.xml
U         systests2/common/pom.xml
U         systests2/multi-bundle/src/test/java/org/apache/cxf/dosgi/systests2/multi/MultiBundleTools.java
U         systests2/multi-bundle/src/test/java/org/apache/cxf/dosgi/systests2/multi/AbstractDosgiTest.java
U         systests2/multi-bundle/src/test/java/org/apache/cxf/dosgi/systests2/multi/TestDiscoveryExport.java
U         systests2/multi-bundle/src/test/java/org/apache/cxf/dosgi/systests2/multi/TestImportService.java
U         systests2/multi-bundle/src/test/java/org/apache/cxf/dosgi/systests2/multi/TestExportService.java
U         systests2/multi-bundle/pom.xml
U         samples/spring_dm/pom.xml
U         samples/ds/client/pom.xml
U         samples/ds/pom.xml
U         samples/discovery/pom.xml
U         samples/discovery/client/pom.xml
U         samples/discovery/impl/pom.xml
U         samples/greeter_rest/impl2/pom.xml
U         samples/greeter_rest/pom.xml
U         samples/greeter_rest/client/pom.xml
U         samples/greeter_rest/impl/pom.xml
U         samples/security_filter/pom.xml
U         samples/greeter/pom.xml
U         samples/greeter/client/pom.xml
U         samples/greeter/impl/pom.xml
U         discovery/local/src/test/java/org/apache/cxf/dosgi/discovery/local/internal/LocalDiscoveryTest.java
U         discovery/local/pom.xml
U         discovery/distributed/cxf-discovery/pom.xml
U         discovery/distributed/zookeeper-server/pom.xml
U         discovery/distributed/zookeeper-server-config/pom.xml
U         parent/pom.xml
U         dsw/cxf-dsw/pom.xml
U         dsw/cxf-dsw/src/test/java/org/apache/cxf/dosgi/dsw/handlers/HttpServiceManagerTest.java
U         dsw/cxf-dsw/src/test/java/org/apache/cxf/dosgi/dsw/qos/IntentTrackerTest.java
U         dsw/cxf-topology-manager/src/test/java/org/apache/cxf/dosgi/topologymanager/util/SimpleServiceTrackerTest.java
U         dsw/cxf-topology-manager/src/main/java/org/apache/cxf/dosgi/topologymanager/util/SimpleServiceTracker.java
U         dsw/cxf-topology-manager/pom.xml
At revision 1517477
Parsing POMs
Downloaded artifact http://repository.apache.org/snapshots/org/apache/cxf/dosgi/cxf-dosgi-ri/1.6-SNAPSHOT/maven-metadata.xml
Downloaded artifact http://repository.apache.org/snapshots/org/apache/cxf/dosgi/cxf-dosgi-ri/1.6-SNAPSHOT/cxf-dosgi-ri-1.6-20130826.050647-19.pom
ERROR: Failed to parse POMs
hudson.util.IOException2: remote file operation failed: <https://builds.apache.org/job/CXF-DOSGi/ws/trunk>
at hudson.remoting.Channel@74bb2385:ubuntu4
	at hudson.FilePath.act(FilePath.java:905)
	at hudson.FilePath.act(FilePath.java:882)
	at hudson.maven.MavenModuleSetBuild$MavenModuleSetBuildExecution.parsePoms(MavenModuleSetBuild.java:920)
	at hudson.maven.MavenModuleSetBuild$MavenModuleSetBuildExecution.doRun(MavenModuleSetBuild.java:652)
	at hudson.model.AbstractBuild$AbstractBuildExecution.run(AbstractBuild.java:567)
	at hudson.model.Run.execute(Run.java:1603)
	at hudson.maven.MavenModuleSetBuild.run(MavenModuleSetBuild.java:506)
	at hudson.model.ResourceController.execute(ResourceController.java:88)
	at hudson.model.Executor.run(Executor.java:247)
Caused by: hudson.remoting.ProxyException: hudson.maven.MavenModuleSetBuild$MavenExecutionException:
org.apache.maven.project.ProjectBuildingException: Some problems were encountered while processing
the POMs:
[WARNING] 'parent.relativePath' points at org.apache.cxf.dosgi.samples:cxf-dosgi-ri-samples-spring-dm-parent
instead of org.apache.cxf.dosgi.samples:cxf-dosgi-ri-bundles-spring-dm-parent, please verify
your project structure @ line 29, column 11
[WARNING] 'parent.relativePath' points at org.apache.cxf.dosgi.samples:cxf-dosgi-ri-samples-spring-dm-parent
instead of org.apache.cxf.dosgi.samples:cxf-dosgi-ri-bundles-spring-dm-parent, please verify
your project structure @ line 29, column 11
[WARNING] 'parent.relativePath' points at org.apache.cxf.dosgi.samples:cxf-dosgi-ri-samples-spring-dm-parent
instead of org.apache.cxf.dosgi.samples:cxf-dosgi-ri-bundles-spring-dm-parent, please verify
your project structure @ line 29, column 11
[WARNING] 'parent.relativePath' points at org.apache.cxf.dosgi.samples:cxf-dosgi-ri-samples-ds-parent
instead of org.apache.cxf.dosgi.samples:cxf-dosgi-ri-bundles-ds-parent, please verify your
project structure @ line 29, column 11
[WARNING] 'parent.relativePath' points at org.apache.cxf.dosgi.samples:cxf-dosgi-ri-samples-ds-parent
instead of org.apache.cxf.dosgi.samples:cxf-dosgi-ri-bundles-ds-parent, please verify your
project structure @ line 28, column 11
[WARNING] 'parent.relativePath' points at org.apache.cxf.dosgi.samples:cxf-dosgi-ri-samples-ds-parent
instead of org.apache.cxf.dosgi.samples:cxf-dosgi-ri-bundles-ds-parent, please verify your
project structure @ line 21, column 13
[ERROR] 'dependencies.dependency.version' for org.osgi:org.osgi.compendium:jar is missing.
@ line 32, column 21
[WARNING] 'parent.relativePath' points at org.apache.cxf.dosgi.samples:cxf-dosgi-ri-samples-discovery-parent
instead of org.apache.cxf.dosgi.samples:cxf-dosgi-ri-bundles-discovery-parent, please verify
your project structure @ line 29, column 11
[WARNING] 'parent.relativePath' points at org.apache.cxf.dosgi.samples:cxf-dosgi-ri-samples-discovery-parent
instead of org.apache.cxf.dosgi.samples:cxf-dosgi-ri-bundles-discovery-parent, please verify
your project structure @ line 21, column 13
[WARNING] 'parent.relativePath' points at org.apache.cxf.dosgi.samples:cxf-dosgi-ri-samples-discovery-parent
instead of org.apache.cxf.dosgi.samples:cxf-dosgi-ri-bundles-discovery-parent, please verify
your project structure @ line 21, column 13
[ERROR] 'dependencies.dependency.version' for org.osgi:org.osgi.compendium:jar is missing.
@ line 32, column 21

	at hudson.maven.MavenModuleSetBuild$PomParser.invoke(MavenModuleSetBuild.java:1323)
	at hudson.maven.MavenModuleSetBuild$PomParser.invoke(MavenModuleSetBuild.java:1058)
	at hudson.FilePath$FileCallableWrapper.call(FilePath.java:2417)
	at hudson.remoting.UserRequest.perform(UserRequest.java:118)
	at hudson.remoting.UserRequest.perform(UserRequest.java:48)
	at hudson.remoting.Request$2.run(Request.java:326)
	at hudson.remoting.InterceptingExecutorService$1.call(InterceptingExecutorService.java:72)
	at java.util.concurrent.FutureTask$Sync.innerRun(FutureTask.java:334)
	at java.util.concurrent.FutureTask.run(FutureTask.java:166)
	at java.util.concurrent.ThreadPoolExecutor.runWorker(ThreadPoolExecutor.java:1146)
	at java.util.concurrent.ThreadPoolExecutor$Worker.run(ThreadPoolExecutor.java:615)
	at java.lang.Thread.run(Thread.java:679)
Caused by: hudson.remoting.ProxyException: org.apache.maven.project.ProjectBuildingException:
Some problems were encountered while processing the POMs:
[WARNING] 'parent.relativePath' points at org.apache.cxf.dosgi.samples:cxf-dosgi-ri-samples-spring-dm-parent
instead of org.apache.cxf.dosgi.samples:cxf-dosgi-ri-bundles-spring-dm-parent, please verify
your project structure @ line 29, column 11
[WARNING] 'parent.relativePath' points at org.apache.cxf.dosgi.samples:cxf-dosgi-ri-samples-spring-dm-parent
instead of org.apache.cxf.dosgi.samples:cxf-dosgi-ri-bundles-spring-dm-parent, please verify
your project structure @ line 29, column 11
[WARNING] 'parent.relativePath' points at org.apache.cxf.dosgi.samples:cxf-dosgi-ri-samples-spring-dm-parent
instead of org.apache.cxf.dosgi.samples:cxf-dosgi-ri-bundles-spring-dm-parent, please verify
your project structure @ line 29, column 11
[WARNING] 'parent.relativePath' points at org.apache.cxf.dosgi.samples:cxf-dosgi-ri-samples-ds-parent
instead of org.apache.cxf.dosgi.samples:cxf-dosgi-ri-bundles-ds-parent, please verify your
project structure @ line 29, column 11
[WARNING] 'parent.relativePath' points at org.apache.cxf.dosgi.samples:cxf-dosgi-ri-samples-ds-parent
instead of org.apache.cxf.dosgi.samples:cxf-dosgi-ri-bundles-ds-parent, please verify your
project structure @ line 28, column 11
[WARNING] 'parent.relativePath' points at org.apache.cxf.dosgi.samples:cxf-dosgi-ri-samples-ds-parent
instead of org.apache.cxf.dosgi.samples:cxf-dosgi-ri-bundles-ds-parent, please verify your
project structure @ line 21, column 13
[ERROR] 'dependencies.dependency.version' for org.osgi:org.osgi.compendium:jar is missing.
@ line 32, column 21
[WARNING] 'parent.relativePath' points at org.apache.cxf.dosgi.samples:cxf-dosgi-ri-samples-discovery-parent
instead of org.apache.cxf.dosgi.samples:cxf-dosgi-ri-bundles-discovery-parent, please verify
your project structure @ line 29, column 11
[WARNING] 'parent.relativePath' points at org.apache.cxf.dosgi.samples:cxf-dosgi-ri-samples-discovery-parent
instead of org.apache.cxf.dosgi.samples:cxf-dosgi-ri-bundles-discovery-parent, please verify
your project structure @ line 21, column 13
[WARNING] 'parent.relativePath' points at org.apache.cxf.dosgi.samples:cxf-dosgi-ri-samples-discovery-parent
instead of org.apache.cxf.dosgi.samples:cxf-dosgi-ri-bundles-discovery-parent, please verify
your project structure @ line 21, column 13
[ERROR] 'dependencies.dependency.version' for org.osgi:org.osgi.compendium:jar is missing.
@ line 32, column 21

	at org.apache.maven.project.DefaultProjectBuilder.build(DefaultProjectBuilder.java:364)
	at hudson.maven.MavenEmbedder.buildProjects(MavenEmbedder.java:361)
	at hudson.maven.MavenEmbedder.readProjects(MavenEmbedder.java:331)
	at hudson.maven.MavenModuleSetBuild$PomParser.invoke(MavenModuleSetBuild.java:1260)
	... 11 more

Mime
View raw message