cxf-notifications mailing list archives

Site index · List index
Message view « Date » · « Thread »
Top « Date » · « Thread »
From Apache Jenkins Server <jenk...@builds.apache.org>
Subject Build failed in Jenkins: CXF-2.6-deploy #263
Date Wed, 07 Aug 2013 06:29:41 GMT
See <https://builds.apache.org/job/CXF-2.6-deploy/263/changes>

Changes:

[dkulp] Blocking revisions 1510515 via  git from
https://svn.apache.org/repos/asf/cxf/branches/2.7.x-fixes

------------------------------------------
[...truncated 7583 lines...]
[INFO] --- maven-resources-plugin:2.6:testResources (default-testResources) @ cxf-rt-rs-security-oauth2
---
[INFO] Using 'UTF-8' encoding to copy filtered resources.
[INFO] Copying 0 resource
[INFO] skip non existing resourceDirectory <https://builds.apache.org/job/CXF-2.6-deploy/ws/cxf-2.6.x-fixes/rt/rs/security/oauth-parent/oauth2/src/test/resources>
[INFO] skip non existing resourceDirectory <https://builds.apache.org/job/CXF-2.6-deploy/ws/cxf-2.6.x-fixes/rt/rs/security/oauth-parent/oauth2/target/generated/src/test/resources>
[INFO] Copying 3 resources
[INFO] 
[INFO] --- maven-compiler-plugin:3.1:testCompile (default-testCompile) @ cxf-rt-rs-security-oauth2
---
[INFO] Changes detected - recompiling the module!
[INFO] Compiling 7 source files to <https://builds.apache.org/job/CXF-2.6-deploy/ws/cxf-2.6.x-fixes/rt/rs/security/oauth-parent/oauth2/target/test-classes>
[INFO] -------------------------------------------------------------
[ERROR] COMPILATION ERROR : 
[INFO] -------------------------------------------------------------
[ERROR] <https://builds.apache.org/job/CXF-2.6-deploy/ws/cxf-2.6.x-fixes/rt/rs/security/oauth-parent/oauth2/src/test/java/org/apache/cxf/rs/security/oauth2/grants/OAuthDataProviderImpl.java>:[35,5]
method does not override a method from its superclass
[ERROR] <https://builds.apache.org/job/CXF-2.6-deploy/ws/cxf-2.6.x-fixes/rt/rs/security/oauth-parent/oauth2/src/test/java/org/apache/cxf/rs/security/oauth2/grants/OAuthDataProviderImpl.java>:[68,5]
method does not override a method from its superclass
[INFO] 2 errors 
[INFO] -------------------------------------------------------------
[INFO] ------------------------------------------------------------------------
[INFO] Reactor Summary:
[INFO] 
[INFO] Apache CXF ........................................ SUCCESS [9.888s]
[INFO] Apache CXF Parent ................................. SUCCESS [4.208s]
[INFO] Apache CXF API .................................... SUCCESS [51.385s]
[INFO] Apache CXF Woodstox/MSV Schema Validation ......... SUCCESS [7.662s]
[INFO] Apache CXF XML Schema Validation with Xerces ...... SUCCESS [6.826s]
[INFO] Apache CXF Common ................................. SUCCESS [9.652s]
[INFO] Apache CXF Runtime Core ........................... SUCCESS [19.301s]
[INFO] Apache CXF Command Line Tools Common .............. SUCCESS [11.845s]
[INFO] Apache CXF Runtime JAXB DataBinding ............... SUCCESS [16.921s]
[INFO] Apache CXF Runtime SOAP Binding ................... SUCCESS [13.040s]
[INFO] Apache CXF Command Line Tools Validator ........... SUCCESS [8.508s]
[INFO] Apache CXF Command Line Tools WSDLTo Core ......... SUCCESS [9.718s]
[INFO] Apache CXF Command Line Tools WSDLTo JAXWS Frontend  SUCCESS [9.662s]
[INFO] Apache CXF Runtime JavaScript Client Generator Projects  SUCCESS [4.406s]
[INFO] Apache CXF Runtime JavaScript Client Generator .... SUCCESS [7.717s]
[INFO] Apache CXF Command Line Tools WSDL to JavaScript Front End  SUCCESS [7.009s]
[INFO] Apache CXF Command Line Tools WSDLTo JAXB Databinding  SUCCESS [8.423s]
[INFO] Apache CXF Maven Plugins .......................... SUCCESS [3.153s]
[INFO] Apache CXF WSDL Validator Maven2 Plugin ........... SUCCESS [7.502s]
[INFO] Apache CXF Code Generation Maven2 Plugins ......... SUCCESS [14.044s]
[INFO] Apache CXF Test Utilities ......................... SUCCESS [45.435s]
[INFO] Apache CXF Runtime Management ..................... SUCCESS [9.079s]
[INFO] Apache CXF Runtime JMS Transport .................. SUCCESS [17.489s]
[INFO] Apache CXF Runtime XML Binding .................... SUCCESS [8.021s]
[INFO] Apache CXF Runtime Local Transport ................ SUCCESS [7.117s]
[INFO] Apache CXF Runtime WS Policy ...................... SUCCESS [14.357s]
[INFO] Apache CXF Runtime HTTP Transport ................. SUCCESS [15.577s]
[INFO] Apache CXF Runtime HTTP Jetty Transport ........... SUCCESS [9.886s]
[INFO] Apache CXF Runtime Simple Frontend ................ SUCCESS [9.521s]
[INFO] Apache CXF Runtime WS Addressing .................. SUCCESS [8.249s]
[INFO] Apache CXF Runtime JAX-WS Frontend ................ SUCCESS [26.255s]
[INFO] Apache CXF Runtime XmlBeans DataBinding ........... SUCCESS [9.763s]
[INFO] Apache CXF Command Line Tools WSDLTo Test ......... SUCCESS [8.355s]
[INFO] Apache CXF Command Line Tools WSDLTo Misctools .... SUCCESS [8.598s]
[INFO] Apache CXF Command Line Tools ..................... SUCCESS [4.591s]
[INFO] Apache CXF Command Line Tools WSDLTo .............. SUCCESS [2.243s]
[INFO] Apache CXF Runtime Aegis Databinding .............. SUCCESS [15.460s]
[INFO] Apache CXF Command Line Tools JavaTo WS ........... SUCCESS [17.753s]
[INFO] Apache CXF Command Line Tools JavaTo .............. SUCCESS [1.997s]
[INFO] Apache CXF Runtime JAX-RS Frontend ................ SUCCESS [16.688s]
[INFO] Apache CXF Command Line Tools WADLTo JAXRS Frontend  SUCCESS [7.800s]
[INFO] Apache CXF Command Line Tools WADLTo .............. SUCCESS [2.384s]
[INFO] Apache CXF Runtime CORBA Binding .................. SUCCESS [13.915s]
[INFO] Apache CXF Command Line Tools CORBA ............... SUCCESS [14.104s]
[INFO] Apache CXF Runtime SDO DataBinding ................ SUCCESS [9.675s]
[INFO] Apache CXF Runtime JiBX DataBinding ............... SUCCESS [8.830s]
[INFO] Apache CXF Runtime Object Binding ................. SUCCESS [7.296s]
[INFO] Apache CXF Runtime Colocated Binding .............. SUCCESS [8.286s]
[INFO] Apache CXF Runtime ................................ SUCCESS [9.484s]
[INFO] Apache CXF Runtime Bindings ....................... SUCCESS [2.207s]
[INFO] Apache CXF Runtime Clustering ..................... SUCCESS [7.433s]
[INFO] Apache CXF Runtime JavaScript Frontend ............ SUCCESS [8.056s]
[INFO] Apache CXF Runtime WS Reliable Messaging .......... SUCCESS [14.246s]
[INFO] Apache CXF Runtime WS MetadataExchange ............ SUCCESS [8.014s]
[INFO] Apache CXF Runtime WS Security .................... SUCCESS [19.474s]
[INFO] Apache CXF JAX-RS Extensions: Providers ........... SUCCESS [9.840s]
[INFO] Apache CXF JAX-RS Extensions: Search .............. SUCCESS [9.155s]
[INFO] Apache CXF RS XML Security ........................ SUCCESS [9.297s]
[INFO] Apache CXF RS SSO SAML ............................ SUCCESS [9.404s]
[INFO] Apache CXF Runtime RS Security OAuth Parent ....... SUCCESS [1.849s]
[INFO] Apache CXF Runtime OAuth 1.0a ..................... SUCCESS [8.902s]
[INFO] Apache CXF Runtime OAuth 2.0 ...................... FAILURE [1.209s]
[INFO] Apache CXF RS Cross-Origin Resource Sharing ....... SKIPPED
[INFO] Apache CXF Runtime Web Management ................. SKIPPED
[INFO] Apache CXF Runtime JavaScript Client Generator Tests  SKIPPED
[INFO] Apache CXF JCA Connection ......................... SKIPPED
[INFO] Apache CXF Integration ............................ SKIPPED
[INFO] Apache CXF Java2WS Maven2 Plugin .................. SKIPPED
[INFO] Apache CXF WADL2Java Code Generation Maven2 Plugin  SKIPPED
[INFO] Apache CXF CORBA Tools Maven2 Plugins ............. SKIPPED
[INFO] Apache CXF Archetype - Simple JAX-WS Java First ... SKIPPED
[INFO] Apache CXF Archetype - Simple JAX-RS webapp ....... SKIPPED
[INFO] Apache CXF Maven Archetypes ....................... SKIPPED
[INFO] Apache CXF STS Core ............................... SKIPPED
[INFO] Apache CXF STS war deployment ..................... SKIPPED
[INFO] Apache CXF STS basic systests ..................... SKIPPED
[INFO] Apache CXF STS advanced systests .................. SKIPPED
[INFO] Apache CXF Services ............................... SKIPPED
[INFO] Apache CXF STS service ............................ SKIPPED
[INFO] Apache CXF STS systests ........................... SKIPPED
[INFO] Apache CXF WSN API ................................ SKIPPED
[INFO] Apache CXF WSN Core ............................... SKIPPED
[INFO] Apache CXF WSN OSGi ............................... SKIPPED
[INFO] Apache CXF WSN service ............................ SKIPPED
[INFO] Apache CXF Karaf Parent ........................... SKIPPED
[INFO] Apache CXF Karaf Features ......................... SKIPPED
[INFO] Apache CXF Karaf Commands ......................... SKIPPED
[INFO] Apache CXF Bundle Parent .......................... SKIPPED
[INFO] Apache CXF Bundle Jar ............................. SKIPPED
[INFO] Apache CXF Minimal Bundle Jar ..................... SKIPPED
[INFO] Apache CXF JAX-RS Bundle Jar ...................... SKIPPED
[INFO] Apache CXF Compatibility Bundle Jar ............... SKIPPED
[INFO] Apache CXF Container Integration System Tests ..... SKIPPED
[INFO] Apache CXF Container Integration Test Webapp ...... SKIPPED
[INFO] Apache CXF Uncategorized System Tests ............. SKIPPED
[INFO] Apache CXF Transport System Tests ................. SKIPPED
[INFO] Apache CXF Transport System Tests JMS ............. SKIPPED
[INFO] Apache CXF JAX-WS System Tests .................... SKIPPED
[INFO] Apache CXF Databinding System Tests ............... SKIPPED
[INFO] Apache CXF JAX-RS System Tests .................... SKIPPED
[INFO] Apache CXF WS-* Specifications System Tests ....... SKIPPED
[INFO] Apache CXF WS-RM Specifications System Tests ...... SKIPPED
[INFO] Apache CXF WS-Security System Tests ............... SKIPPED
[INFO] Apache CXF WS-Security Interop System Tests ....... SKIPPED
[INFO] Apache CXF JAX-RS System Advanced Security Tests .. SKIPPED
[INFO] Test for writing wsdl to repo ..................... SKIPPED
[INFO] Test for generating code from wsdl in repo ........ SKIPPED
[INFO] Apache CXF System Tests ........................... SKIPPED
[INFO] Apache CXF System Tests for Maven Plugins ......... SKIPPED
[INFO] Apache CXF Manifest Jar ........................... SKIPPED
[INFO] Apache CXF Samples ................................ SKIPPED
[INFO] Colocated Demo using Document/Literal Style ....... SKIPPED
[INFO] JavaScript Client Demo using Document/Literal Style  SKIPPED
[INFO] Generated JavaScript Sample using JAX-WS and JSR-181  SKIPPED
[INFO] Java First demo service using the JAXWSFactoryBeans  SKIPPED
[INFO] Java First demo using JMS ......................... SKIPPED
[INFO] JAX-RS Content Negotiation Demo ................... SKIPPED
[INFO] JAX-RS Basic Demo With HTTPS communications ....... SKIPPED
[INFO] JAX-RS Basic Demo ................................. SKIPPED
[INFO] CXF sample using a callback object ................ SKIPPED
[INFO] WSDL first demo using BARE Style in XML Binding (pure XML over HTTP)  SKIPPED
[INFO] JAX-WS Dispatch/Provider Demo ..................... SKIPPED
[INFO] WSDL first demo using Document/Literal Style and XMLBeans DataBinding  SKIPPED
[INFO] WSDL first demo using SOAP12 in Document/Literal Style  SKIPPED
[INFO] CXF Dynamic Client Sample ......................... SKIPPED
[INFO] JMS Transport Queue Demo using Document-Literal Style  SKIPPED
[INFO] WSDL first demo using the jms transport and jmsConfigFeature  SKIPPED
[INFO] RESTful Hello World Demo .......................... SKIPPED
[INFO] WSDL first demo using Document/Literal Style ...... SKIPPED
[INFO] CXF sample using the Aegis Binding without any webservice  SKIPPED
[INFO] Java First demo using JAX-WS APIs ................. SKIPPED
[INFO] WS-RM Demo ........................................ SKIPPED
[INFO] CXF Sample of Stream GZIP Interceptor ............. SKIPPED
[INFO] Spring HTTP Sample ................................ SKIPPED
[INFO] Spring HTTP Servlet demo with ruby support ........ SKIPPED
[INFO] Spring HTTP Servlet demo with groovy support ...... SKIPPED
[INFO] Hello world javascript demo ....................... SKIPPED
[INFO] CXF WS-Security UT Demo ........................... SKIPPED
[INFO] WS-Security UT Sign Demo .......................... SKIPPED
[INFO] CXF WS-Security Sign Encoding Demo ................ SKIPPED
[INFO] WS-Security UT Policy Demo ........................ SKIPPED
[INFO] MTOM Demo for SWA and XOP ......................... SKIPPED
[INFO] JAX-WS Asynchronous Demo using Document/Literal Style  SKIPPED
[INFO] Java First POJO Sample ............................ SKIPPED
[INFO] WS-Policy Demo .................................... SKIPPED
[INFO] Hello World Client Demo using JavaScript .......... SKIPPED
[INFO] WSDL first demo using HTTPS ....................... SKIPPED
[INFO] WS-Addressing Demo ................................ SKIPPED
[INFO] Sample using SOAP Headers ......................... SKIPPED
[INFO] SOAP/JMS Transport Specification Demo using Document-Literal Style  SKIPPED
[INFO] CXF sample using WRAPPED Style in XML Binding (pure XML over HTTP)  SKIPPED
[INFO] CXF sample using code first POJO's and the Aegis Binding  SKIPPED
[INFO] Sample of JAX-* Service Using an Aegis Client ..... SKIPPED
[INFO] JAX-WS Handler Demo ............................... SKIPPED
[INFO] WSDL first demo using RPC-Literal Style ........... SKIPPED
[INFO] JMS Transport Publish/Subscribe Demo using Document-Literal Style  SKIPPED
[INFO] JAX-RS Spring Security Demo ....................... SKIPPED
[INFO] LogBrowser ........................................ SKIPPED
[INFO] WS-Notification Demo .............................. SKIPPED
[INFO] CXF STS Demo ...................................... SKIPPED
[INFO] Bank sample using JAX-WS API's to talk via CORBA/IIOP  SKIPPED
[INFO] Bank sample using JAX-WS API's to talk via CORBA/IIOP  SKIPPED
[INFO] hello-world sample using JAX-WS API's to talk via CORBA/IIOP  SKIPPED
[INFO] OAuth 1.0a server ................................. SKIPPED
[INFO] OAuth 1.0a client ................................. SKIPPED
[INFO] JAX-RS Minimal OSGI Demo .......................... SKIPPED
[INFO] Apache CXF Distribution ........................... SKIPPED
[INFO] ------------------------------------------------------------------------
[INFO] BUILD FAILURE
[INFO] ------------------------------------------------------------------------
[INFO] Total time: 11:23.150s
[INFO] Finished at: Wed Aug 07 06:29:40 UTC 2013
[INFO] Final Memory: 81M/177M
[INFO] ------------------------------------------------------------------------
[ERROR] Failed to execute goal org.apache.maven.plugins:maven-compiler-plugin:3.1:testCompile
(default-testCompile) on project cxf-rt-rs-security-oauth2: Compilation failure: Compilation
failure:
[ERROR] <https://builds.apache.org/job/CXF-2.6-deploy/ws/cxf-2.6.x-fixes/rt/rs/security/oauth-parent/oauth2/src/test/java/org/apache/cxf/rs/security/oauth2/grants/OAuthDataProviderImpl.java>:[35,5]
method does not override a method from its superclass
[ERROR] <https://builds.apache.org/job/CXF-2.6-deploy/ws/cxf-2.6.x-fixes/rt/rs/security/oauth-parent/oauth2/src/test/java/org/apache/cxf/rs/security/oauth2/grants/OAuthDataProviderImpl.java>:[68,5]
method does not override a method from its superclass
[ERROR] -> [Help 1]
[ERROR] 
[ERROR] To see the full stack trace of the errors, re-run Maven with the -e switch.
[ERROR] Re-run Maven using the -X switch to enable full debug logging.
[ERROR] 
[ERROR] For more information about the errors and possible solutions, please read the following
articles:
[ERROR] [Help 1] http://cwiki.apache.org/confluence/display/MAVEN/MojoFailureException
[ERROR] 
[ERROR] After correcting the problems, you can resume the build with the command
[ERROR]   mvn <goals> -rf :cxf-rt-rs-security-oauth2
Build step 'Invoke top-level Maven targets' marked build as failure
ERROR: Failed to parse POMs
java.io.IOException: Remote call on Channel to Maven [/home/hudson/tools/java/latest1.5/bin/java,
-da, -dsa, -XX:MaxPermSize=256m, -Xmx1024M, -cp, /home/jenkins/jenkins-slave/maven-agent.jar:/home/jenkins/jenkins-slave/classworlds.jar,
hudson.maven.agent.Main, /home/hudson/tools/maven/apache-maven-2.2.1, /home/jenkins/jenkins-slave/slave.jar,
/home/jenkins/jenkins-slave/maven-interceptor.jar, 57773, /home/jenkins/jenkins-slave/maven2.1-interceptor.jar]
failed
	at hudson.remoting.Channel.call(Channel.java:722)
	at hudson.maven.ProcessCache$MavenProcess.<init>(ProcessCache.java:112)
	at hudson.maven.ProcessCache.get(ProcessCache.java:231)
	at hudson.maven.MavenModuleSetBuild$MavenModuleSetBuildExecution.doRun(MavenModuleSetBuild.java:717)
	at hudson.model.AbstractBuild$AbstractBuildExecution.run(AbstractBuild.java:586)
	at hudson.model.Run.execute(Run.java:1593)
	at hudson.maven.MavenModuleSetBuild.run(MavenModuleSetBuild.java:495)
	at hudson.model.ResourceController.execute(ResourceController.java:88)
	at hudson.model.Executor.run(Executor.java:247)
Caused by: java.lang.ClassFormatError: Failed to load hudson.maven.ProcessCache$GetSystemProperties
	at hudson.remoting.RemoteClassLoader.loadClassFile(RemoteClassLoader.java:291)
	at hudson.remoting.RemoteClassLoader.findClass(RemoteClassLoader.java:229)
	at java.lang.ClassLoader.loadClass(ClassLoader.java:307)
	at java.lang.ClassLoader.loadClass(ClassLoader.java:252)
	at java.lang.ClassLoader.loadClassInternal(ClassLoader.java:320)
	at java.lang.Class.forName0(Native Method)
	at java.lang.Class.forName(Class.java:242)
	at hudson.remoting.MultiClassLoaderSerializer$Input.resolveClass(MultiClassLoaderSerializer.java:113)
	at java.io.ObjectInputStream.readNonProxyDesc(ObjectInputStream.java:1544)
	at java.io.ObjectInputStream.readClassDesc(ObjectInputStream.java:1466)
	at java.io.ObjectInputStream.readOrdinaryObject(ObjectInputStream.java:1699)
	at java.io.ObjectInputStream.readObject0(ObjectInputStream.java:1305)
	at java.io.ObjectInputStream.readObject(ObjectInputStream.java:348)
	at hudson.remoting.UserRequest.deserialize(UserRequest.java:182)
	at hudson.remoting.UserRequest.perform(UserRequest.java:98)
	at hudson.remoting.UserRequest.perform(UserRequest.java:48)
	at hudson.remoting.Request$2.run(Request.java:326)
	at hudson.remoting.InterceptingExecutorService$1.call(InterceptingExecutorService.java:72)
	at java.util.concurrent.FutureTask$Sync.innerRun(FutureTask.java:269)
	at java.util.concurrent.FutureTask.run(FutureTask.java:123)
	at java.util.concurrent.ThreadPoolExecutor$Worker.runTask(ThreadPoolExecutor.java:651)
	at java.util.concurrent.ThreadPoolExecutor$Worker.run(ThreadPoolExecutor.java:676)
	at java.lang.Thread.run(Thread.java:595)
Caused by: java.lang.UnsupportedClassVersionError: Bad version number in .class file
	at java.lang.ClassLoader.defineClass1(Native Method)
	at java.lang.ClassLoader.defineClass(ClassLoader.java:621)
	at java.lang.ClassLoader.defineClass(ClassLoader.java:466)
	at hudson.remoting.RemoteClassLoader.loadClassFile(RemoteClassLoader.java:289)
	... 22 more

Mime
View raw message