cxf-notifications mailing list archives

Site index · List index
Message view « Date » · « Thread »
Top « Date » · « Thread »
From Apache Jenkins Server <jenk...@builds.apache.org>
Subject Build failed in Jenkins: CXF-2.6-deploy #237
Date Fri, 21 Jun 2013 06:48:59 GMT
See <https://builds.apache.org/job/CXF-2.6-deploy/237/changes>

Changes:

[ay] Merged revisions 1495091 via  svn merge from
https://svn.apache.org/repos/asf/cxf/branches/2.7.x-fixes

........
  r1495091 | ay | 2013-06-20 18:37:28 +0200 (Thu, 20 Jun 2013) | 9 lines
  
  Merged revisions 1495088 via  svn merge from
  https://svn.apache.org/repos/asf/cxf/trunk
  
  ........
    r1495088 | ay | 2013-06-20 18:33:30 +0200 (Thu, 20 Jun 2013) | 1 line
    
    minor fix on ws-rm's handling of non ws-rm messages
  ........
  
........

[ffang] Merged revisions 1493913,1494872 via svnmerge from 
https://svn.apache.org/repos/asf/cxf/branches/2.7.x-fixes

................
  r1493913 | dkulp | 2013-06-18 04:07:27 +0800 (二, 18  6 2013) | 9 lines
  
  Merged revisions 1493644 via  git cherry-pick from
  https://svn.apache.org/repos/asf/cxf/trunk
  
  ........
    r1493644 | ffang | 2013-06-17 01:20:32 -0400 (Mon, 17 Jun 2013) | 2 lines
  
    [CXF-5061]a testcase to demonstrate that valid WSDL could get generated for List of Complex
Type
  
  ........
................
  r1494872 | ffang | 2013-06-20 14:45:56 +0800 (四, 20  6 2013) | 9 lines
  
  Merged revisions 1493983 via svnmerge from 
  https://svn.apache.org/repos/asf/cxf/trunk
  
  ........
    r1493983 | ffang | 2013-06-18 09:48:16 +0800 (二, 18  6 2013) | 1 line
    
    [CXF-5061]add a package-info
  ........
................

------------------------------------------
[...truncated 16791 lines...]
Uploading: https://repository.apache.org/content/repositories/snapshots/org/apache/cxf/systests/cxf-systests-transport-jms/2.6.9-SNAPSHOT/maven-metadata.xml
Uploaded: https://repository.apache.org/content/repositories/snapshots/org/apache/cxf/systests/cxf-systests-transport-jms/2.6.9-SNAPSHOT/maven-metadata.xml
(2 KB at 4.9 KB/sec)
Uploading: https://repository.apache.org/content/repositories/snapshots/org/apache/cxf/systests/cxf-systests-transport-jms/maven-metadata.xml
Uploaded: https://repository.apache.org/content/repositories/snapshots/org/apache/cxf/systests/cxf-systests-transport-jms/maven-metadata.xml
(571 B at 0.7 KB/sec)
Uploading: https://repository.apache.org/content/repositories/snapshots/org/apache/cxf/systests/cxf-systests-transport-jms/2.6.9-SNAPSHOT/cxf-systests-transport-jms-2.6.9-20130621.064849-24-sources.jar
Uploaded: https://repository.apache.org/content/repositories/snapshots/org/apache/cxf/systests/cxf-systests-transport-jms/2.6.9-SNAPSHOT/cxf-systests-transport-jms-2.6.9-20130621.064849-24-sources.jar
(15 KB at 42.3 KB/sec)
Uploading: https://repository.apache.org/content/repositories/snapshots/org/apache/cxf/systests/cxf-systests-transport-jms/2.6.9-SNAPSHOT/maven-metadata.xml
Uploaded: https://repository.apache.org/content/repositories/snapshots/org/apache/cxf/systests/cxf-systests-transport-jms/2.6.9-SNAPSHOT/maven-metadata.xml
(2 KB at 0.9 KB/sec)
Uploading: https://repository.apache.org/content/repositories/snapshots/org/apache/cxf/systests/cxf-systests-transport-jms/2.6.9-SNAPSHOT/cxf-systests-transport-jms-2.6.9-20130621.064849-24-javadoc.jar
Uploaded: https://repository.apache.org/content/repositories/snapshots/org/apache/cxf/systests/cxf-systests-transport-jms/2.6.9-SNAPSHOT/cxf-systests-transport-jms-2.6.9-20130621.064849-24-javadoc.jar
(55 KB at 141.5 KB/sec)
Uploading: https://repository.apache.org/content/repositories/snapshots/org/apache/cxf/systests/cxf-systests-transport-jms/2.6.9-SNAPSHOT/maven-metadata.xml
Uploaded: https://repository.apache.org/content/repositories/snapshots/org/apache/cxf/systests/cxf-systests-transport-jms/2.6.9-SNAPSHOT/maven-metadata.xml
(2 KB at 1.3 KB/sec)
Uploading: https://repository.apache.org/content/repositories/snapshots/org/apache/cxf/systests/cxf-systests-transport-jms/2.6.9-SNAPSHOT/cxf-systests-transport-jms-2.6.9-20130621.064849-24-tests.jar
Uploaded: https://repository.apache.org/content/repositories/snapshots/org/apache/cxf/systests/cxf-systests-transport-jms/2.6.9-SNAPSHOT/cxf-systests-transport-jms-2.6.9-20130621.064849-24-tests.jar
(155 KB at 322.2 KB/sec)
Uploading: https://repository.apache.org/content/repositories/snapshots/org/apache/cxf/systests/cxf-systests-transport-jms/2.6.9-SNAPSHOT/maven-metadata.xml
Uploaded: https://repository.apache.org/content/repositories/snapshots/org/apache/cxf/systests/cxf-systests-transport-jms/2.6.9-SNAPSHOT/maven-metadata.xml
(2 KB at 3.0 KB/sec)
[INFO]                                                                         
[INFO] ------------------------------------------------------------------------
[INFO] Building Apache CXF JAX-WS System Tests 2.6.9-SNAPSHOT
[INFO] ------------------------------------------------------------------------
[INFO] 
[INFO] --- maven-bundle-plugin:2.3.7:cleanVersions (versions) @ cxf-systests-jaxws ---
[INFO] 
[INFO] --- cxf-xml2fastinfoset-plugin:2.5.0:xml2fastinfoset (xml2fastinfoset) @ cxf-systests-jaxws
---
[INFO] 
[INFO] --- maven-remote-resources-plugin:1.3:process (default) @ cxf-systests-jaxws ---
[INFO] 
[INFO] --- maven-resources-plugin:2.6:resources (default-resources) @ cxf-systests-jaxws ---
[INFO] Using 'UTF-8' encoding to copy filtered resources.
[INFO] skip non existing resourceDirectory /home/hudson/jenkins-slave/workspace/CXF-2.6-deploy/cxf-2.6.x-fixes/systests/jaxws/src/main/java
[INFO] skip non existing resourceDirectory /home/hudson/jenkins-slave/workspace/CXF-2.6-deploy/cxf-2.6.x-fixes/systests/jaxws/src/main/resources
[INFO] skip non existing resourceDirectory /home/hudson/jenkins-slave/workspace/CXF-2.6-deploy/cxf-2.6.x-fixes/systests/jaxws/src/main/resources-filtered
[INFO] skip non existing resourceDirectory /home/hudson/jenkins-slave/workspace/CXF-2.6-deploy/cxf-2.6.x-fixes/systests/jaxws/target/generated/src/main/resources
[INFO] Copying 3 resources
[INFO] 
[INFO] --- maven-compiler-plugin:3.1:compile (default-compile) @ cxf-systests-jaxws ---
[INFO] No sources to compile
[INFO] 
[INFO] --- maven-bundle-plugin:2.3.7:manifest (bundle-manifest) @ cxf-systests-jaxws ---
[WARNING] Manifest org.apache.cxf.systests:cxf-systests-jaxws:jar:2.6.9-SNAPSHOT : Superfluous
export-package instructions: [org.apache.cxf.*]
[INFO] 
[INFO] --- cxf-codegen-plugin:2.6.9-SNAPSHOT:wsdl2java (generate-test-sources) @ cxf-systests-jaxws
---
[INFO] 
[INFO] --- maven-resources-plugin:2.6:testResources (default-testResources) @ cxf-systests-jaxws
---
[INFO] Using 'UTF-8' encoding to copy filtered resources.
[INFO] Copying 46 resources
[INFO] Copying 13 resources
[INFO] skip non existing resourceDirectory /home/hudson/jenkins-slave/workspace/CXF-2.6-deploy/cxf-2.6.x-fixes/systests/jaxws/target/generated/src/test/resources
[INFO] Copying 3 resources
[INFO] 
[INFO] --- maven-compiler-plugin:3.1:testCompile (default-testCompile) @ cxf-systests-jaxws
---
[INFO] Changes detected - recompiling the module!
[INFO] Compiling 167 source files to /home/hudson/jenkins-slave/workspace/CXF-2.6-deploy/cxf-2.6.x-fixes/systests/jaxws/target/test-classes
[INFO] -------------------------------------------------------------
[ERROR] COMPILATION ERROR : 
[INFO] -------------------------------------------------------------
[ERROR] /home/hudson/jenkins-slave/workspace/CXF-2.6-deploy/cxf-2.6.x-fixes/systests/jaxws/src/test/java/org/apache/cxf/systest/jaxws/TestServiceImpl.java:[27,5]
method does not override a method from its superclass
[INFO] 1 error
[INFO] -------------------------------------------------------------
[INFO] ------------------------------------------------------------------------
[INFO] Reactor Summary:
[INFO] 
[INFO] Apache CXF ........................................ SUCCESS [5.665s]
[INFO] Apache CXF Parent ................................. SUCCESS [2.808s]
[INFO] Apache CXF API .................................... SUCCESS [39.631s]
[INFO] Apache CXF Woodstox/MSV Schema Validation ......... SUCCESS [7.757s]
[INFO] Apache CXF XML Schema Validation with Xerces ...... SUCCESS [6.876s]
[INFO] Apache CXF Common ................................. SUCCESS [1.598s]
[INFO] Apache CXF Runtime Core ........................... SUCCESS [20.371s]
[INFO] Apache CXF Command Line Tools Common .............. SUCCESS [11.825s]
[INFO] Apache CXF Runtime JAXB DataBinding ............... SUCCESS [9.239s]
[INFO] Apache CXF Runtime SOAP Binding ................... SUCCESS [13.638s]
[INFO] Apache CXF Command Line Tools Validator ........... SUCCESS [8.548s]
[INFO] Apache CXF Command Line Tools WSDLTo Core ......... SUCCESS [7.619s]
[INFO] Apache CXF Command Line Tools WSDLTo JAXWS Frontend  SUCCESS [9.192s]
[INFO] Apache CXF Runtime JavaScript Client Generator Projects  SUCCESS [2.435s]
[INFO] Apache CXF Runtime JavaScript Client Generator .... SUCCESS [7.641s]
[INFO] Apache CXF Command Line Tools WSDL to JavaScript Front End  SUCCESS [6.436s]
[INFO] Apache CXF Command Line Tools WSDLTo JAXB Databinding  SUCCESS [6.870s]
[INFO] Apache CXF Maven Plugins .......................... SUCCESS [1.900s]
[INFO] Apache CXF WSDL Validator Maven2 Plugin ........... SUCCESS [6.587s]
[INFO] Apache CXF Code Generation Maven2 Plugins ......... SUCCESS [10.904s]
[INFO] Apache CXF Test Utilities ......................... SUCCESS [40.112s]
[INFO] Apache CXF Runtime Management ..................... SUCCESS [7.839s]
[INFO] Apache CXF Runtime JMS Transport .................. SUCCESS [9.927s]
[INFO] Apache CXF Runtime XML Binding .................... SUCCESS [7.129s]
[INFO] Apache CXF Runtime Local Transport ................ SUCCESS [5.976s]
[INFO] Apache CXF Runtime WS Policy ...................... SUCCESS [10.785s]
[INFO] Apache CXF Runtime HTTP Transport ................. SUCCESS [10.791s]
[INFO] Apache CXF Runtime HTTP Jetty Transport ........... SUCCESS [9.009s]
[INFO] Apache CXF Runtime Simple Frontend ................ SUCCESS [8.022s]
[INFO] Apache CXF Runtime WS Addressing .................. SUCCESS [7.438s]
[INFO] Apache CXF Runtime JAX-WS Frontend ................ SUCCESS [13.813s]
[INFO] Apache CXF Runtime XmlBeans DataBinding ........... SUCCESS [9.782s]
[INFO] Apache CXF Command Line Tools WSDLTo Test ......... SUCCESS [4.603s]
[INFO] Apache CXF Command Line Tools WSDLTo Misctools .... SUCCESS [6.597s]
[INFO] Apache CXF Command Line Tools ..................... SUCCESS [1.562s]
[INFO] Apache CXF Command Line Tools WSDLTo .............. SUCCESS [1.640s]
[INFO] Apache CXF Runtime Aegis Databinding .............. SUCCESS [12.113s]
[INFO] Apache CXF Command Line Tools JavaTo WS ........... SUCCESS [9.824s]
[INFO] Apache CXF Command Line Tools JavaTo .............. SUCCESS [1.624s]
[INFO] Apache CXF Runtime JAX-RS Frontend ................ SUCCESS [14.537s]
[INFO] Apache CXF Command Line Tools WADLTo JAXRS Frontend  SUCCESS [6.762s]
[INFO] Apache CXF Command Line Tools WADLTo .............. SUCCESS [1.577s]
[INFO] Apache CXF Runtime CORBA Binding .................. SUCCESS [11.850s]
[INFO] Apache CXF Command Line Tools CORBA ............... SUCCESS [12.676s]
[INFO] Apache CXF Runtime SDO DataBinding ................ SUCCESS [7.473s]
[INFO] Apache CXF Runtime JiBX DataBinding ............... SUCCESS [10.891s]
[INFO] Apache CXF Runtime Object Binding ................. SUCCESS [6.583s]
[INFO] Apache CXF Runtime Colocated Binding .............. SUCCESS [7.148s]
[INFO] Apache CXF Runtime ................................ SUCCESS [1.385s]
[INFO] Apache CXF Runtime Bindings ....................... SUCCESS [1.489s]
[INFO] Apache CXF Runtime Clustering ..................... SUCCESS [7.072s]
[INFO] Apache CXF Runtime JavaScript Frontend ............ SUCCESS [7.467s]
[INFO] Apache CXF Runtime WS Reliable Messaging .......... SUCCESS [15.228s]
[INFO] Apache CXF Runtime WS MetadataExchange ............ SUCCESS [6.524s]
[INFO] Apache CXF Runtime WS Security .................... SUCCESS [20.314s]
[INFO] Apache CXF JAX-RS Extensions: Providers ........... SUCCESS [8.411s]
[INFO] Apache CXF JAX-RS Extensions: Search .............. SUCCESS [8.536s]
[INFO] Apache CXF RS XML Security ........................ SUCCESS [7.872s]
[INFO] Apache CXF RS SSO SAML ............................ SUCCESS [7.509s]
[INFO] Apache CXF Runtime RS Security OAuth Parent ....... SUCCESS [1.803s]
[INFO] Apache CXF Runtime OAuth 1.0a ..................... SUCCESS [7.388s]
[INFO] Apache CXF Runtime OAuth 2.0 ...................... SUCCESS [9.111s]
[INFO] Apache CXF RS Cross-Origin Resource Sharing ....... SUCCESS [5.764s]
[INFO] Apache CXF Runtime Web Management ................. SUCCESS [13.601s]
[INFO] Apache CXF Runtime JavaScript Client Generator Tests  SUCCESS [4.207s]
[INFO] Apache CXF JCA Connection ......................... SUCCESS [9.225s]
[INFO] Apache CXF Integration ............................ SUCCESS [1.555s]
[INFO] Apache CXF Java2WS Maven2 Plugin .................. SUCCESS [6.632s]
[INFO] Apache CXF WADL2Java Code Generation Maven2 Plugin  SUCCESS [7.682s]
[INFO] Apache CXF CORBA Tools Maven2 Plugins ............. SUCCESS [6.895s]
[INFO] Apache CXF Archetype - Simple JAX-WS Java First ... SUCCESS [5.885s]
[INFO] Apache CXF Archetype - Simple JAX-RS webapp ....... SUCCESS [3.705s]
[INFO] Apache CXF Maven Archetypes ....................... SUCCESS [1.809s]
[INFO] Apache CXF STS Core ............................... SUCCESS [12.700s]
[INFO] Apache CXF STS war deployment ..................... SUCCESS [11.186s]
[INFO] Apache CXF STS basic systests ..................... SUCCESS [7.483s]
[INFO] Apache CXF STS advanced systests .................. SUCCESS [7.125s]
[INFO] Apache CXF Services ............................... SUCCESS [1.386s]
[INFO] Apache CXF STS service ............................ SUCCESS [1.440s]
[INFO] Apache CXF STS systests ........................... SUCCESS [1.919s]
[INFO] Apache CXF WSN API ................................ SUCCESS [12.801s]
[INFO] Apache CXF WSN Core ............................... SUCCESS [9.491s]
[INFO] Apache CXF WSN OSGi ............................... SUCCESS [7.067s]
[INFO] Apache CXF WSN service ............................ SUCCESS [1.526s]
[INFO] Apache CXF Karaf Parent ........................... SUCCESS [2.079s]
[INFO] Apache CXF Karaf Features ......................... SUCCESS [2.809s]
[INFO] Apache CXF Karaf Commands ......................... SUCCESS [6.761s]
[INFO] Apache CXF Bundle Parent .......................... SUCCESS [1.913s]
[INFO] Apache CXF Bundle Jar ............................. SUCCESS [4:07.144s]
[INFO] Apache CXF Minimal Bundle Jar ..................... SUCCESS [3:06.874s]
[INFO] Apache CXF JAX-RS Bundle Jar ...................... SUCCESS [1:35.366s]
[INFO] Apache CXF Compatibility Bundle Jar ............... SUCCESS [3:03.684s]
[INFO] Apache CXF Container Integration System Tests ..... SUCCESS [5.975s]
[INFO] Apache CXF Container Integration Test Webapp ...... SUCCESS [9.043s]
[INFO] Apache CXF Uncategorized System Tests ............. SUCCESS [13.348s]
[INFO] Apache CXF Transport System Tests ................. SUCCESS [8.535s]
[INFO] Apache CXF Transport System Tests JMS ............. SUCCESS [13.220s]
[INFO] Apache CXF JAX-WS System Tests .................... FAILURE [2.766s]
[INFO] Apache CXF Databinding System Tests ............... SKIPPED
[INFO] Apache CXF JAX-RS System Tests .................... SKIPPED
[INFO] Apache CXF WS-* Specifications System Tests ....... SKIPPED
[INFO] Apache CXF WS-RM Specifications System Tests ...... SKIPPED
[INFO] Apache CXF WS-Security System Tests ............... SKIPPED
[INFO] Apache CXF WS-Security Interop System Tests ....... SKIPPED
[INFO] Apache CXF JAX-RS System Advanced Security Tests .. SKIPPED
[INFO] Test for writing wsdl to repo ..................... SKIPPED
[INFO] Test for generating code from wsdl in repo ........ SKIPPED
[INFO] Apache CXF System Tests ........................... SKIPPED
[INFO] Apache CXF System Tests for Maven Plugins ......... SKIPPED
[INFO] Apache CXF Manifest Jar ........................... SKIPPED
[INFO] Apache CXF Samples ................................ SKIPPED
[INFO] Colocated Demo using Document/Literal Style ....... SKIPPED
[INFO] JavaScript Client Demo using Document/Literal Style  SKIPPED
[INFO] Generated JavaScript Sample using JAX-WS and JSR-181  SKIPPED
[INFO] Java First demo service using the JAXWSFactoryBeans  SKIPPED
[INFO] Java First demo using JMS ......................... SKIPPED
[INFO] JAX-RS Content Negotiation Demo ................... SKIPPED
[INFO] JAX-RS Basic Demo With HTTPS communications ....... SKIPPED
[INFO] JAX-RS Basic Demo ................................. SKIPPED
[INFO] CXF sample using a callback object ................ SKIPPED
[INFO] WSDL first demo using BARE Style in XML Binding (pure XML over HTTP)  SKIPPED
[INFO] JAX-WS Dispatch/Provider Demo ..................... SKIPPED
[INFO] WSDL first demo using Document/Literal Style and XMLBeans DataBinding  SKIPPED
[INFO] WSDL first demo using SOAP12 in Document/Literal Style  SKIPPED
[INFO] CXF Dynamic Client Sample ......................... SKIPPED
[INFO] JMS Transport Queue Demo using Document-Literal Style  SKIPPED
[INFO] WSDL first demo using the jms transport and jmsConfigFeature  SKIPPED
[INFO] RESTful Hello World Demo .......................... SKIPPED
[INFO] WSDL first demo using Document/Literal Style ...... SKIPPED
[INFO] CXF sample using the Aegis Binding without any webservice  SKIPPED
[INFO] Java First demo using JAX-WS APIs ................. SKIPPED
[INFO] WS-RM Demo ........................................ SKIPPED
[INFO] CXF Sample of Stream GZIP Interceptor ............. SKIPPED
[INFO] Spring HTTP Sample ................................ SKIPPED
[INFO] Spring HTTP Servlet demo with ruby support ........ SKIPPED
[INFO] Spring HTTP Servlet demo with groovy support ...... SKIPPED
[INFO] Hello world javascript demo ....................... SKIPPED
[INFO] CXF WS-Security UT Demo ........................... SKIPPED
[INFO] WS-Security UT Sign Demo .......................... SKIPPED
[INFO] CXF WS-Security Sign Encoding Demo ................ SKIPPED
[INFO] WS-Security UT Policy Demo ........................ SKIPPED
[INFO] MTOM Demo for SWA and XOP ......................... SKIPPED
[INFO] JAX-WS Asynchronous Demo using Document/Literal Style  SKIPPED
[INFO] Java First POJO Sample ............................ SKIPPED
[INFO] WS-Policy Demo .................................... SKIPPED
[INFO] Hello World Client Demo using JavaScript .......... SKIPPED
[INFO] WSDL first demo using HTTPS ....................... SKIPPED
[INFO] WS-Addressing Demo ................................ SKIPPED
[INFO] Sample using SOAP Headers ......................... SKIPPED
[INFO] SOAP/JMS Transport Specification Demo using Document-Literal Style  SKIPPED
[INFO] CXF sample using WRAPPED Style in XML Binding (pure XML over HTTP)  SKIPPED
[INFO] CXF sample using code first POJO's and the Aegis Binding  SKIPPED
[INFO] Sample of JAX-* Service Using an Aegis Client ..... SKIPPED
[INFO] JAX-WS Handler Demo ............................... SKIPPED
[INFO] WSDL first demo using RPC-Literal Style ........... SKIPPED
[INFO] JMS Transport Publish/Subscribe Demo using Document-Literal Style  SKIPPED
[INFO] JAX-RS Spring Security Demo ....................... SKIPPED
[INFO] LogBrowser ........................................ SKIPPED
[INFO] WS-Notification Demo .............................. SKIPPED
[INFO] CXF STS Demo ...................................... SKIPPED
[INFO] Bank sample using JAX-WS API's to talk via CORBA/IIOP  SKIPPED
[INFO] Bank sample using JAX-WS API's to talk via CORBA/IIOP  SKIPPED
[INFO] hello-world sample using JAX-WS API's to talk via CORBA/IIOP  SKIPPED
[INFO] OAuth 1.0a server ................................. SKIPPED
[INFO] OAuth 1.0a client ................................. SKIPPED
[INFO] JAX-RS Minimal OSGI Demo .......................... SKIPPED
[INFO] Apache CXF Distribution ........................... SKIPPED
[INFO] ------------------------------------------------------------------------
[INFO] BUILD FAILURE
[INFO] ------------------------------------------------------------------------
[INFO] Total time: 24:41.930s
[INFO] Finished at: Fri Jun 21 06:48:58 UTC 2013
[INFO] Final Memory: 100M/229M
[INFO] ------------------------------------------------------------------------
[ERROR] Failed to execute goal org.apache.maven.plugins:maven-compiler-plugin:3.1:testCompile
(default-testCompile) on project cxf-systests-jaxws: Compilation failure
[ERROR] /home/hudson/jenkins-slave/workspace/CXF-2.6-deploy/cxf-2.6.x-fixes/systests/jaxws/src/test/java/org/apache/cxf/systest/jaxws/TestServiceImpl.java:[27,5]
method does not override a method from its superclass
[ERROR] -> [Help 1]
[ERROR] 
[ERROR] To see the full stack trace of the errors, re-run Maven with the -e switch.
[ERROR] Re-run Maven using the -X switch to enable full debug logging.
[ERROR] 
[ERROR] For more information about the errors and possible solutions, please read the following
articles:
[ERROR] [Help 1] http://cwiki.apache.org/confluence/display/MAVEN/MojoFailureException
[ERROR] 
[ERROR] After correcting the problems, you can resume the build with the command
[ERROR]   mvn <goals> -rf :cxf-systests-jaxws
Build step 'Invoke top-level Maven targets' marked build as failure

Mime
View raw message