cxf-notifications mailing list archives

Site index · List index
Message view « Date » · « Thread »
Top « Date » · « Thread »
From Apache Jenkins Server <jenk...@builds.apache.org>
Subject Build failed in Jenkins: CXF-2.7-deploy #117
Date Wed, 26 Jun 2013 06:41:44 GMT
See <https://builds.apache.org/job/CXF-2.7-deploy/117/changes>

Changes:

[ema] Merged revisions 1496744 via svnmerge from 
https://svn.apache.org/repos/asf/cxf/trunk

........
  r1496744 | ema | 2013-06-26 13:52:00 +0800 (Wed, 26 Jun 2013) | 1 line
  
  [CXF-5089]:java2ws generate both ref and nillabe attributes in a schema element
........

[sergeyb] Merged revisions 1495553 via svnmerge from 
https://svn.apache.org/repos/asf/cxf/trunk

........
  r1495553 | sergeyb | 2013-06-21 20:26:11 +0100 (Fri, 21 Jun 2013) | 1 line
  
  Support for a realm parameter in OAuth2 filter
........

[sergeyb] Merged revisions 1496496 via svnmerge from 
https://svn.apache.org/repos/asf/cxf/trunk

........
  r1496496 | sergeyb | 2013-06-25 15:45:00 +0100 (Tue, 25 Jun 2013) | 1 line
  
  [CXF-5090] Starting to update to Jettison 1.3.4
........

[ningjiang] Merged revisions 1496357 via svnmerge from 
https://svn.apache.org/repos/asf/cxf/trunk

........
  r1496357 | ningjiang | 2013-06-25 14:22:06 +0800 (Tue, 25 Jun 2013) | 1 line
  
  CXF-5088 Made the service file of cxf-core.jar Web Application Server friendly
........

------------------------------------------
[...truncated 30281 lines...]
[INFO] 
[INFO] --- maven-compiler-plugin:2.5.1:testCompile (default-testCompile) @ java_first_jaxws_factory_bean
---
[INFO] No sources to compile
[INFO] 
[INFO] --- maven-surefire-plugin:2.10:test (default-test) @ java_first_jaxws_factory_bean
---
[INFO] Tests are skipped.
[INFO] 
[INFO] --- maven-jar-plugin:2.3.2:jar (default-jar) @ java_first_jaxws_factory_bean ---
[INFO] 
[INFO] --- maven-install-plugin:2.3.1:install (default-install) @ java_first_jaxws_factory_bean
---
[INFO] Installing /x1/jenkins/jenkins-slave/workspace/CXF-2.7-deploy/cxf-2.7.x-fixes/distribution/src/main/release/samples/java_first_jaxws_factory_bean/target/java_first_jaxws_factory_bean-2.7.6-SNAPSHOT.jar
to <https://builds.apache.org/job/CXF-2.7-deploy/ws/.repository/org/apache/cxf/samples/java_first_jaxws_factory_bean/2.7.6-SNAPSHOT/java_first_jaxws_factory_bean-2.7.6-SNAPSHOT.jar>
[INFO] Installing /x1/jenkins/jenkins-slave/workspace/CXF-2.7-deploy/cxf-2.7.x-fixes/distribution/src/main/release/samples/java_first_jaxws_factory_bean/pom.xml
to <https://builds.apache.org/job/CXF-2.7-deploy/ws/.repository/org/apache/cxf/samples/java_first_jaxws_factory_bean/2.7.6-SNAPSHOT/java_first_jaxws_factory_bean-2.7.6-SNAPSHOT.pom>
[INFO] 
[INFO] --- maven-deploy-plugin:2.7:deploy (default-deploy) @ java_first_jaxws_factory_bean
---
[INFO] Skipping artifact deployment
[INFO]                                                                         
[INFO] ------------------------------------------------------------------------
[INFO] Building Java First demo using JMS 2.7.6-SNAPSHOT
[INFO] ------------------------------------------------------------------------
[INFO] 
[INFO] --- maven-resources-plugin:2.5:resources (default-resources) @ java_first_jms ---
[debug] execute contextualize
[INFO] Using 'UTF-8' encoding to copy filtered resources.
[INFO] skip non existing resourceDirectory /x1/jenkins/jenkins-slave/workspace/CXF-2.7-deploy/cxf-2.7.x-fixes/distribution/src/main/release/samples/java_first_jms/src/main/resources
[INFO] 
[INFO] --- maven-compiler-plugin:2.5.1:compile (default-compile) @ java_first_jms ---
[INFO] Nothing to compile - all classes are up to date
[INFO] 
[INFO] --- maven-resources-plugin:2.5:testResources (default-testResources) @ java_first_jms
---
[debug] execute contextualize
[INFO] Using 'UTF-8' encoding to copy filtered resources.
[INFO] Copying 1 resource
[INFO] 
[INFO] --- maven-compiler-plugin:2.5.1:testCompile (default-testCompile) @ java_first_jms
---
[INFO] No sources to compile
[INFO] 
[INFO] --- maven-surefire-plugin:2.10:test (default-test) @ java_first_jms ---
[INFO] Tests are skipped.
[INFO] 
[INFO] --- maven-jar-plugin:2.3.2:jar (default-jar) @ java_first_jms ---
[INFO] 
[INFO] --- maven-install-plugin:2.3.1:install (default-install) @ java_first_jms ---
[INFO] Installing /x1/jenkins/jenkins-slave/workspace/CXF-2.7-deploy/cxf-2.7.x-fixes/distribution/src/main/release/samples/java_first_jms/target/java_first_jms-2.7.6-SNAPSHOT.jar
to <https://builds.apache.org/job/CXF-2.7-deploy/ws/.repository/org/apache/cxf/samples/java_first_jms/2.7.6-SNAPSHOT/java_first_jms-2.7.6-SNAPSHOT.jar>
[INFO] Installing /x1/jenkins/jenkins-slave/workspace/CXF-2.7-deploy/cxf-2.7.x-fixes/distribution/src/main/release/samples/java_first_jms/pom.xml
to <https://builds.apache.org/job/CXF-2.7-deploy/ws/.repository/org/apache/cxf/samples/java_first_jms/2.7.6-SNAPSHOT/java_first_jms-2.7.6-SNAPSHOT.pom>
[INFO] 
[INFO] --- maven-deploy-plugin:2.7:deploy (default-deploy) @ java_first_jms ---
[INFO] Skipping artifact deployment
[INFO]                                                                         
[INFO] ------------------------------------------------------------------------
[INFO] Building JAX-RS Content Negotiation Demo 2.7.6-SNAPSHOT
[INFO] ------------------------------------------------------------------------
Downloading: http://repo.maven.apache.org/maven2/org/codehaus/jettison/jettison/1.3.4/jettison-1.3.4.jar
[INFO] ------------------------------------------------------------------------
[INFO] Reactor Summary:
[INFO] 
[INFO] Apache CXF ........................................ SUCCESS [13.924s]
[INFO] Apache CXF Parent ................................. SUCCESS [3.927s]
[INFO] Apache CXF API .................................... SUCCESS [40.136s]
[INFO] Apache CXF Woodstox/MSV Schema Validation ......... SUCCESS [4.949s]
[INFO] Apache CXF XML Schema Validation with Xerces ...... SUCCESS [3.563s]
[INFO] Apache CXF Common ................................. SUCCESS [1.847s]
[INFO] Apache CXF Runtime Core ........................... SUCCESS [5.679s]
[INFO] Apache CXF Command Line Tools Common .............. SUCCESS [3.682s]
[INFO] Apache CXF Runtime JAXB DataBinding ............... SUCCESS [2.891s]
[INFO] Apache CXF Runtime SOAP Binding ................... SUCCESS [4.515s]
[INFO] Apache CXF Command Line Tools Validator ........... SUCCESS [3.072s]
[INFO] Apache CXF Command Line Tools WSDLTo Core ......... SUCCESS [3.404s]
[INFO] Apache CXF Command Line Tools WSDLTo JAXWS Frontend  SUCCESS [3.573s]
[INFO] Apache CXF Runtime JavaScript Client Generator Projects  SUCCESS [0.670s]
[INFO] Apache CXF Runtime JavaScript Client Generator .... SUCCESS [2.220s]
[INFO] Apache CXF Command Line Tools WSDL to JavaScript Front End  SUCCESS [2.597s]
[INFO] Apache CXF Command Line Tools WSDLTo JAXB Databinding  SUCCESS [2.381s]
[INFO] Apache CXF Maven Plugins .......................... SUCCESS [1.998s]
[INFO] Apache CXF WSDL Validator Maven2 Plugin ........... SUCCESS [5.727s]
[INFO] Apache CXF Code Generation Maven2 Plugins ......... SUCCESS [15.730s]
[INFO] Apache CXF Test Utilities ......................... SUCCESS [34.274s]
[INFO] Apache CXF Runtime Management ..................... SUCCESS [3.640s]
[INFO] Apache CXF Runtime JMS Transport .................. SUCCESS [9.564s]
[INFO] Apache CXF Runtime XML Binding .................... SUCCESS [2.101s]
[INFO] Apache CXF Runtime Local Transport ................ SUCCESS [1.928s]
[INFO] Apache CXF Runtime WS Policy ...................... SUCCESS [6.554s]
[INFO] Apache CXF Runtime HTTP Transport ................. SUCCESS [5.496s]
[INFO] Apache CXF Runtime HTTP Jetty Transport ........... SUCCESS [8.389s]
[INFO] Apache CXF Runtime Simple Frontend ................ SUCCESS [2.914s]
[INFO] Apache CXF Runtime WS Addressing .................. SUCCESS [2.172s]
[INFO] Apache CXF Runtime JAX-WS Frontend ................ SUCCESS [11.842s]
[INFO] Apache CXF Runtime XmlBeans DataBinding ........... SUCCESS [5.257s]
[INFO] Apache CXF Command Line Tools WSDLTo Test ......... SUCCESS [1.402s]
[INFO] Apache CXF Command Line Tools WSDLTo Misctools .... SUCCESS [2.161s]
[INFO] Apache CXF Command Line Tools ..................... SUCCESS [0.622s]
[INFO] Apache CXF Command Line Tools WSDLTo .............. SUCCESS [0.811s]
[INFO] Apache CXF Runtime Aegis Databinding .............. SUCCESS [4.651s]
[INFO] Apache CXF Command Line Tools JavaTo WS ........... SUCCESS [6.571s]
[INFO] Apache CXF Command Line Tools JavaTo .............. SUCCESS [0.691s]
[INFO] Apache CXF Runtime JAX-RS Frontend ................ SUCCESS [6.623s]
[INFO] Apache CXF Command Line Tools WADLTo JAXRS Frontend  SUCCESS [4.652s]
[INFO] Apache CXF Command Line Tools WADLTo .............. SUCCESS [0.466s]
[INFO] Apache CXF Runtime CORBA Binding .................. SUCCESS [3.665s]
[INFO] Apache CXF Command Line Tools CORBA ............... SUCCESS [3.976s]
[INFO] Apache CXF Runtime SDO DataBinding ................ SUCCESS [15.334s]
[INFO] Apache CXF Runtime JiBX DataBinding ............... SUCCESS [16.557s]
[INFO] Apache CXF Runtime Object Binding ................. SUCCESS [1.952s]
[INFO] Apache CXF Runtime Colocated Binding .............. SUCCESS [1.846s]
[INFO] Apache CXF Runtime ................................ SUCCESS [0.565s]
[INFO] Apache CXF Runtime Bindings ....................... SUCCESS [0.587s]
[INFO] Apache CXF Runtime Clustering ..................... SUCCESS [2.499s]
[INFO] Apache CXF Runtime JavaScript Frontend ............ SUCCESS [2.398s]
[INFO] Apache CXF Runtime HTTP Async Transport ........... SUCCESS [6.077s]
[INFO] Apache CXF Runtime UDP Transport .................. SUCCESS [1.890s]
[INFO] Apache CXF Runtime WS Reliable Messaging .......... SUCCESS [5.607s]
[INFO] Apache CXF Runtime WS MetadataExchange ............ SUCCESS [3.082s]
[INFO] Apache CXF Runtime WS Security .................... SUCCESS [11.974s]
[INFO] Apache CXF JAX-RS Extensions: Providers ........... SUCCESS [12.851s]
[INFO] Apache CXF JAX-RS Extensions: Search .............. SUCCESS [12.170s]
[INFO] Apache CXF RS XML Security ........................ SUCCESS [2.311s]
[INFO] Apache CXF RS SSO SAML ............................ SUCCESS [2.260s]
[INFO] Apache CXF Runtime RS Security OAuth Parent ....... SUCCESS [0.777s]
[INFO] Apache CXF Runtime OAuth 1.0a ..................... SUCCESS [3.632s]
[INFO] Apache CXF Runtime OAuth 2.0 ...................... SUCCESS [2.767s]
[INFO] Apache CXF Runtime OAuth 2.0 SAML ................. SUCCESS [2.030s]
[INFO] Apache CXF RS Cross-Origin Resource Sharing ....... SUCCESS [6.566s]
[INFO] Apache CXF Runtime Web Management ................. SUCCESS [24.626s]
[INFO] Apache CXF Runtime JavaScript Client Generator Tests  SUCCESS [1.418s]
[INFO] Apache CXF Runtime Security functionality ......... SUCCESS [1.895s]
[INFO] Apache CXF JCA Connection ......................... SUCCESS [5.371s]
[INFO] Apache CXF Integration ............................ SUCCESS [0.804s]
[INFO] Apache CXF Java2WS Maven2 Plugin .................. SUCCESS [2.428s]
[INFO] Apache CXF WADL2Java Code Generation Maven2 Plugin  SUCCESS [2.093s]
[INFO] Apache CXF CORBA Tools Maven2 Plugins ............. SUCCESS [2.068s]
[INFO] Apache CXF Archetype - Simple JAX-WS Java First ... SUCCESS [4.430s]
[INFO] Apache CXF Archetype - Simple JAX-RS webapp ....... SUCCESS [1.170s]
[INFO] Apache CXF Maven Archetypes ....................... SUCCESS [1.098s]
[INFO] Apache CXF STS Core ............................... SUCCESS [8.940s]
[INFO] Apache CXF STS war deployment ..................... SUCCESS [4.522s]
[INFO] Apache CXF STS basic systests ..................... SUCCESS [3.853s]
[INFO] Apache CXF STS advanced systests .................. SUCCESS [2.606s]
[INFO] Apache CXF Services ............................... SUCCESS [0.910s]
[INFO] Apache CXF STS service ............................ SUCCESS [0.622s]
[INFO] Apache CXF STS systests ........................... SUCCESS [0.441s]
[INFO] Apache CXF WSN API ................................ SUCCESS [6.608s]
[INFO] Apache CXF WSN Core ............................... SUCCESS [7.613s]
[INFO] Apache CXF WSN OSGi ............................... SUCCESS [2.219s]
[INFO] Apache CXF WSN service ............................ SUCCESS [0.618s]
[INFO] Apache CXF WS-Discovery API ....................... SUCCESS [3.088s]
[INFO] Apache CXF WS-Discovery Service ................... SUCCESS [1.042s]
[INFO] Apache CXF WS-Discovery ........................... SUCCESS [0.500s]
[INFO] Apache CXF Karaf Parent ........................... SUCCESS [0.711s]
[INFO] Apache CXF Karaf Features ......................... SUCCESS [22.915s]
[INFO] Apache CXF Karaf Commands ......................... SUCCESS [2.671s]
[INFO] Apache CXF Bundle Parent .......................... SUCCESS [0.803s]
[INFO] Apache CXF Bundle Jar ............................. SUCCESS [1:35.046s]
[INFO] Apache CXF Minimal Bundle Jar ..................... SUCCESS [56.031s]
[INFO] Apache CXF JAX-RS Bundle Jar ...................... SUCCESS [24.346s]
[INFO] Apache CXF Compatibility Bundle Jar ............... SUCCESS [49.550s]
[INFO] Apache CXF Container Integration System Tests ..... SUCCESS [1.626s]
[INFO] Apache CXF Container Integration Test Webapp ...... SUCCESS [2.790s]
[INFO] Apache CXF Container Integration Test Grizzly ..... SUCCESS [5.729s]
[INFO] Apache CXF Uncategorized System Tests ............. SUCCESS [49.343s]
[INFO] Apache CXF Transport System Tests ................. SUCCESS [5.560s]
[INFO] Apache CXF Transport System Tests JMS ............. SUCCESS [3.173s]
[INFO] Apache CXF JAX-WS System Tests .................... SUCCESS [5.688s]
[INFO] Apache CXF Databinding System Tests ............... SUCCESS [8.102s]
[INFO] Apache CXF JAX-RS System Tests .................... SUCCESS [19.795s]
[INFO] Apache CXF WS-* Specifications System Tests ....... SUCCESS [5.009s]
[INFO] Apache CXF WS-RM Specifications System Tests ...... SUCCESS [1.826s]
[INFO] Apache CXF WS-Security System Tests ............... SUCCESS [6.828s]
[INFO] Apache CXF WS-Security Interop System Tests ....... SUCCESS [5.198s]
[INFO] Apache CXF JAX-RS System Advanced Security Tests .. SUCCESS [3.059s]
[INFO] Test for writing wsdl to repo ..................... SUCCESS [19.756s]
[INFO] Test for generating code from wsdl in repo ........ SUCCESS [7.069s]
[INFO] Apache CXF System Tests ........................... SUCCESS [0.770s]
[INFO] Apache CXF System Tests for Maven Plugins ......... SUCCESS [0.779s]
[INFO] Apache CXF Manifest Jar ........................... SUCCESS [4.504s]
[INFO] Apache CXF Samples ................................ SUCCESS [0.036s]
[INFO] Colocated Demo using Document/Literal Style ....... SUCCESS [3.185s]
[INFO] JavaScript Client Demo using Document/Literal Style  SUCCESS [1.434s]
[INFO] Generated JavaScript Sample using JAX-WS and JSR-181  SUCCESS [0.058s]
[INFO] Java First demo service using the JAXWSFactoryBeans  SUCCESS [0.034s]
[INFO] Java First demo using JMS ......................... SUCCESS [0.040s]
[INFO] JAX-RS Content Negotiation Demo ................... FAILURE [0.134s]
[INFO] JAX-RS Basic Demo With HTTPS communications ....... SKIPPED
[INFO] JAX-RS Basic Demo ................................. SKIPPED
[INFO] CXF sample using a callback object ................ SKIPPED
[INFO] WSDL first demo using BARE Style in XML Binding (pure XML over HTTP)  SKIPPED
[INFO] JAX-WS Dispatch/Provider Demo ..................... SKIPPED
[INFO] WSDL first demo using Document/Literal Style and XMLBeans DataBinding  SKIPPED
[INFO] WSDL first demo using SOAP12 in Document/Literal Style  SKIPPED
[INFO] CXF Dynamic Client Sample ......................... SKIPPED
[INFO] JMS Transport Queue Demo using Document-Literal Style  SKIPPED
[INFO] WSDL first demo using the jms transport and jmsConfigFeature  SKIPPED
[INFO] RESTful Hello World Demo .......................... SKIPPED
[INFO] WSDL first demo using Document/Literal Style ...... SKIPPED
[INFO] CXF sample using the Aegis Binding without any webservice  SKIPPED
[INFO] Java First demo using JAX-WS APIs ................. SKIPPED
[INFO] WS-RM Demo ........................................ SKIPPED
[INFO] CXF Sample of Stream GZIP Interceptor ............. SKIPPED
[INFO] Spring HTTP Sample ................................ SKIPPED
[INFO] Spring HTTP Servlet demo with ruby support ........ SKIPPED
[INFO] Spring HTTP Servlet demo with groovy support ...... SKIPPED
[INFO] Hello world javascript demo ....................... SKIPPED
[INFO] CXF WS-Security UT Demo ........................... SKIPPED
[INFO] WS-Security UT Sign Demo .......................... SKIPPED
[INFO] CXF WS-Security Sign Encoding Demo ................ SKIPPED
[INFO] WS-Security UT Policy Demo ........................ SKIPPED
[INFO] MTOM Demo for SWA and XOP ......................... SKIPPED
[INFO] JAX-WS Asynchronous Demo using Document/Literal Style  SKIPPED
[INFO] Java First POJO Sample ............................ SKIPPED
[INFO] WS-Policy Demo .................................... SKIPPED
[INFO] Hello World Client Demo using JavaScript .......... SKIPPED
[INFO] WSDL first demo using HTTPS ....................... SKIPPED
[INFO] WS-Addressing Demo ................................ SKIPPED
[INFO] Sample using SOAP Headers ......................... SKIPPED
[INFO] SOAP/JMS Transport Specification Demo using Document-Literal Style  SKIPPED
[INFO] CXF sample using WRAPPED Style in XML Binding (pure XML over HTTP)  SKIPPED
[INFO] CXF sample using code first POJO's and the Aegis Binding  SKIPPED
[INFO] Sample of JAX-* Service Using an Aegis Client ..... SKIPPED
[INFO] JAX-WS Handler Demo ............................... SKIPPED
[INFO] WSDL first demo using RPC-Literal Style ........... SKIPPED
[INFO] JMS Transport Publish/Subscribe Demo using Document-Literal Style  SKIPPED
[INFO] JAX-RS Spring Security Demo ....................... SKIPPED
[INFO] LogBrowser ........................................ SKIPPED
[INFO] WS-Notification Demo .............................. SKIPPED
[INFO] CXF STS Demo ...................................... SKIPPED
[INFO] Bank sample using JAX-WS API's to talk via CORBA/IIOP  SKIPPED
[INFO] Bank sample using JAX-WS API's to talk via CORBA/IIOP  SKIPPED
[INFO] hello-world sample using JAX-WS API's to talk via CORBA/IIOP  SKIPPED
[INFO] OAuth 1.0a server ................................. SKIPPED
[INFO] OAuth 1.0a client ................................. SKIPPED
[INFO] JAX-RS Minimal OSGI Demo .......................... SKIPPED
[INFO] WS-Discovery Sample ............................... SKIPPED
[INFO] Apache CXF Distribution ........................... SKIPPED
[INFO] ------------------------------------------------------------------------
[INFO] BUILD FAILURE
[INFO] ------------------------------------------------------------------------
[INFO] Total time: 14:43.554s
[INFO] Finished at: Wed Jun 26 06:41:38 UTC 2013
[INFO] Final Memory: 164M/476M
[INFO] ------------------------------------------------------------------------
[ERROR] Failed to execute goal on project jax_rs_content_negotiation: Could not resolve dependencies
for project org.apache.cxf.samples:jax_rs_content_negotiation:jar:2.7.6-SNAPSHOT: Could not
find artifact org.codehaus.jettison:jettison:jar:1.3.4 in central (http://repo.maven.apache.org/maven2)
-> [Help 1]
[ERROR] 
[ERROR] To see the full stack trace of the errors, re-run Maven with the -e switch.
[ERROR] Re-run Maven using the -X switch to enable full debug logging.
[ERROR] 
[ERROR] For more information about the errors and possible solutions, please read the following
articles:
[ERROR] [Help 1] http://cwiki.apache.org/confluence/display/MAVEN/DependencyResolutionException
[ERROR] 
[ERROR] After correcting the problems, you can resume the build with the command
[ERROR]   mvn <goals> -rf :jax_rs_content_negotiation
Build step 'Invoke top-level Maven targets' marked build as failure

Mime
View raw message