cxf-notifications mailing list archives

Site index · List index
Message view « Date » · « Thread »
Top « Date » · « Thread »
From Apache Jenkins Server <jenk...@builds.apache.org>
Subject Build failed in Jenkins: CXF-2.7-deploy #120
Date Sat, 29 Jun 2013 07:16:55 GMT
See <https://builds.apache.org/job/CXF-2.7-deploy/120/changes>

Changes:

[sergeyb] Merged revisions 1497789 via svnmerge from 
https://svn.apache.org/repos/asf/cxf/trunk

........
  r1497789 | sergeyb | 2013-06-28 15:29:37 +0100 (Fri, 28 Jun 2013) | 1 line
  
  [CXF-5050] Adding a test which posts an empty form
........

[sergeyb] Merged revisions 1497774 via svnmerge from 
https://svn.apache.org/repos/asf/cxf/trunk

........
  r1497774 | sergeyb | 2013-06-28 14:51:10 +0100 (Fri, 28 Jun 2013) | 1 line
  
  [CXF-5101] More options to get the parsed values validated
........

[sergeyb] Merged revisions 1497090 via svnmerge from 
https://svn.apache.org/repos/asf/cxf/trunk

........
  r1497090 | sergeyb | 2013-06-26 21:50:41 +0100 (Wed, 26 Jun 2013) | 1 line
  
  [CXF-5093] Initial try to update HTTPConduit and also RS client code to better deal with
requests with no payloads
........

[sergeyb] Merged revisions 1497712 via svnmerge from 
https://svn.apache.org/repos/asf/cxf/trunk

........
  r1497712 | sergeyb | 2013-06-28 11:17:23 +0100 (Fri, 28 Jun 2013) | 1 line
  
  [CXF-5100] Support for customizing namespace mapper and XML PI property names, take2
........

------------------------------------------
[...truncated 28392 lines...]
[INFO] Copying 3 resources
[INFO] 
[INFO] --- maven-compiler-plugin:3.1:compile (default-compile) @ cxf-systests-jaxrs ---
[INFO] Changes detected - recompiling the module!
[INFO] Compiling 7 source files to <https://builds.apache.org/job/CXF-2.7-deploy/ws/cxf-2.7.x-fixes/systests/jaxrs/target/classes>
[INFO] 
[INFO] --- maven-bundle-plugin:2.3.7:manifest (bundle-manifest) @ cxf-systests-jaxrs ---
[INFO] 
[INFO] --- jibx-maven-plugin:1.2.4.5:bind (compile-binding) @ cxf-systests-jaxrs ---
[INFO] Running JiBX binding compiler (single-module mode) on 1 binding file(s)
Verification failure on class org.apache.cxf.systest.jaxrs.codegen.jibx.Book:
  VERIFIED_REJECTED
Repository.lookup() failed. FILE NOT FOUND?

Verification failure on class org.apache.cxf.systest.jaxrs.codegen.jibx.JiBX_bindingBook_access1:
  VERIFIED_REJECTED
Repository.lookup() failed. FILE NOT FOUND?

Verification failure on class org.apache.cxf.systest.jaxrs.codegen.jibx.JiBX_bindingFactory:
  VERIFIED_REJECTED
Repository.lookup() failed. FILE NOT FOUND?

[INFO] 
[INFO] --- maven-resources-plugin:2.6:testResources (default-testResources) @ cxf-systests-jaxrs
---
[INFO] Using 'UTF-8' encoding to copy filtered resources.
[INFO] Copying 104 resources
[INFO] Copying 63 resources
[INFO] skip non existing resourceDirectory <https://builds.apache.org/job/CXF-2.7-deploy/ws/cxf-2.7.x-fixes/systests/jaxrs/target/generated/src/test/resources>
[INFO] Copying 3 resources
[INFO] 
[INFO] --- maven-compiler-plugin:3.1:testCompile (default-testCompile) @ cxf-systests-jaxrs
---
[INFO] Changes detected - recompiling the module!
[INFO] Compiling 174 source files to <https://builds.apache.org/job/CXF-2.7-deploy/ws/cxf-2.7.x-fixes/systests/jaxrs/target/test-classes>
[INFO] -------------------------------------------------------------
[WARNING] COMPILATION WARNING : 
[INFO] -------------------------------------------------------------
[WARNING] Note: <https://builds.apache.org/job/CXF-2.7-deploy/ws/cxf-2.7.x-fixes/systests/jaxrs/src/test/java/org/apache/cxf/systest/jaxrs/GenericRestServiceImpl.java>
uses unchecked or unsafe operations.
[WARNING] Note: Recompile with -Xlint:unchecked for details.
[INFO] 2 warnings 
[INFO] -------------------------------------------------------------
[INFO] -------------------------------------------------------------
[ERROR] COMPILATION ERROR : 
[INFO] -------------------------------------------------------------
[ERROR] <https://builds.apache.org/job/CXF-2.7-deploy/ws/cxf-2.7.x-fixes/systests/jaxrs/src/test/java/org/apache/cxf/systest/jaxrs/JAXRSClientServerBookTest.java>:[98,24]
cannot find symbol
symbol  : method form(javax.ws.rs.core.Form)
location: class org.apache.cxf.jaxrs.client.WebClient
[INFO] 1 error
[INFO] -------------------------------------------------------------
[INFO] ------------------------------------------------------------------------
[INFO] Reactor Summary:
[INFO] 
[INFO] Apache CXF ........................................ SUCCESS [15.012s]
[INFO] Apache CXF Parent ................................. SUCCESS [5.785s]
[INFO] Apache CXF API .................................... SUCCESS [49.622s]
[INFO] Apache CXF Woodstox/MSV Schema Validation ......... SUCCESS [8.361s]
[INFO] Apache CXF XML Schema Validation with Xerces ...... SUCCESS [6.511s]
[INFO] Apache CXF Common ................................. SUCCESS [2.266s]
[INFO] Apache CXF Runtime Core ........................... SUCCESS [15.046s]
[INFO] Apache CXF Command Line Tools Common .............. SUCCESS [7.524s]
[INFO] Apache CXF Runtime JAXB DataBinding ............... SUCCESS [7.196s]
[INFO] Apache CXF Runtime SOAP Binding ................... SUCCESS [9.279s]
[INFO] Apache CXF Command Line Tools Validator ........... SUCCESS [6.218s]
[INFO] Apache CXF Command Line Tools WSDLTo Core ......... SUCCESS [5.731s]
[INFO] Apache CXF Command Line Tools WSDLTo JAXWS Frontend  SUCCESS [6.675s]
[INFO] Apache CXF Runtime JavaScript Client Generator Projects  SUCCESS [1.944s]
[INFO] Apache CXF Runtime JavaScript Client Generator .... SUCCESS [5.837s]
[INFO] Apache CXF Command Line Tools WSDL to JavaScript Front End  SUCCESS [5.613s]
[INFO] Apache CXF Command Line Tools WSDLTo JAXB Databinding  SUCCESS [5.569s]
[INFO] Apache CXF Maven Plugins .......................... SUCCESS [2.453s]
[INFO] Apache CXF WSDL Validator Maven2 Plugin ........... SUCCESS [13.555s]
[INFO] Apache CXF Code Generation Maven2 Plugins ......... SUCCESS [16.765s]
[INFO] Apache CXF Test Utilities ......................... SUCCESS [32.972s]
[INFO] Apache CXF Runtime Management ..................... SUCCESS [6.656s]
[INFO] Apache CXF Runtime JMS Transport .................. SUCCESS [13.494s]
[INFO] Apache CXF Runtime XML Binding .................... SUCCESS [5.452s]
[INFO] Apache CXF Runtime Local Transport ................ SUCCESS [4.842s]
[INFO] Apache CXF Runtime WS Policy ...................... SUCCESS [9.238s]
[INFO] Apache CXF Runtime HTTP Transport ................. SUCCESS [11.610s]
[INFO] Apache CXF Runtime HTTP Jetty Transport ........... SUCCESS [11.497s]
[INFO] Apache CXF Runtime Simple Frontend ................ SUCCESS [5.846s]
[INFO] Apache CXF Runtime WS Addressing .................. SUCCESS [6.129s]
[INFO] Apache CXF Runtime JAX-WS Frontend ................ SUCCESS [15.305s]
[INFO] Apache CXF Runtime XmlBeans DataBinding ........... SUCCESS [9.193s]
[INFO] Apache CXF Command Line Tools WSDLTo Test ......... SUCCESS [4.406s]
[INFO] Apache CXF Command Line Tools WSDLTo Misctools .... SUCCESS [6.322s]
[INFO] Apache CXF Command Line Tools ..................... SUCCESS [1.692s]
[INFO] Apache CXF Command Line Tools WSDLTo .............. SUCCESS [2.271s]
[INFO] Apache CXF Runtime Aegis Databinding .............. SUCCESS [9.226s]
[INFO] Apache CXF Command Line Tools JavaTo WS ........... SUCCESS [7.582s]
[INFO] Apache CXF Command Line Tools JavaTo .............. SUCCESS [2.210s]
[INFO] Apache CXF Runtime JAX-RS Frontend ................ SUCCESS [11.920s]
[INFO] Apache CXF Command Line Tools WADLTo JAXRS Frontend  SUCCESS [10.355s]
[INFO] Apache CXF Command Line Tools WADLTo .............. SUCCESS [4.008s]
[INFO] Apache CXF Runtime CORBA Binding .................. SUCCESS [8.360s]
[INFO] Apache CXF Command Line Tools CORBA ............... SUCCESS [9.272s]
[INFO] Apache CXF Runtime SDO DataBinding ................ SUCCESS [13.675s]
[INFO] Apache CXF Runtime JiBX DataBinding ............... SUCCESS [18.729s]
[INFO] Apache CXF Runtime Object Binding ................. SUCCESS [5.446s]
[INFO] Apache CXF Runtime Colocated Binding .............. SUCCESS [5.507s]
[INFO] Apache CXF Runtime ................................ SUCCESS [2.446s]
[INFO] Apache CXF Runtime Bindings ....................... SUCCESS [2.110s]
[INFO] Apache CXF Runtime Clustering ..................... SUCCESS [5.312s]
[INFO] Apache CXF Runtime JavaScript Frontend ............ SUCCESS [5.527s]
[INFO] Apache CXF Runtime HTTP Async Transport ........... SUCCESS [10.414s]
[INFO] Apache CXF Runtime UDP Transport .................. SUCCESS [5.001s]
[INFO] Apache CXF Runtime WS Reliable Messaging .......... SUCCESS [11.407s]
[INFO] Apache CXF Runtime WS MetadataExchange ............ SUCCESS [4.885s]
[INFO] Apache CXF Runtime WS Security .................... SUCCESS [16.306s]
[INFO] Apache CXF JAX-RS Extensions: Providers ........... SUCCESS [15.119s]
[INFO] Apache CXF JAX-RS Extensions: Search .............. SUCCESS [17.292s]
[INFO] Apache CXF RS XML Security ........................ SUCCESS [6.738s]
[INFO] Apache CXF RS SSO SAML ............................ SUCCESS [5.985s]
[INFO] Apache CXF Runtime RS Security OAuth Parent ....... SUCCESS [2.362s]
[INFO] Apache CXF Runtime OAuth 1.0a ..................... SUCCESS [7.522s]
[INFO] Apache CXF Runtime OAuth 2.0 ...................... SUCCESS [6.853s]
[INFO] Apache CXF Runtime OAuth 2.0 SAML ................. SUCCESS [5.972s]
[INFO] Apache CXF RS Cross-Origin Resource Sharing ....... SUCCESS [5.915s]
[INFO] Apache CXF Runtime Web Management ................. SUCCESS [25.870s]
[INFO] Apache CXF Runtime JavaScript Client Generator Tests  SUCCESS [7.615s]
[INFO] Apache CXF Runtime Security functionality ......... SUCCESS [6.906s]
[INFO] Apache CXF JCA Connection ......................... SUCCESS [9.371s]
[INFO] Apache CXF Integration ............................ SUCCESS [2.857s]
[INFO] Apache CXF Java2WS Maven2 Plugin .................. SUCCESS [7.862s]
[INFO] Apache CXF WADL2Java Code Generation Maven2 Plugin  SUCCESS [7.613s]
[INFO] Apache CXF CORBA Tools Maven2 Plugins ............. SUCCESS [10.451s]
[INFO] Apache CXF Archetype - Simple JAX-WS Java First ... SUCCESS [9.035s]
[INFO] Apache CXF Archetype - Simple JAX-RS webapp ....... SUCCESS [3.781s]
[INFO] Apache CXF Maven Archetypes ....................... SUCCESS [2.144s]
[INFO] Apache CXF STS Core ............................... SUCCESS [14.019s]
[INFO] Apache CXF STS war deployment ..................... SUCCESS [10.127s]
[INFO] Apache CXF STS basic systests ..................... SUCCESS [5.840s]
[INFO] Apache CXF STS advanced systests .................. SUCCESS [5.679s]
[INFO] Apache CXF Services ............................... SUCCESS [3.153s]
[INFO] Apache CXF STS service ............................ SUCCESS [1.754s]
[INFO] Apache CXF STS systests ........................... SUCCESS [2.284s]
[INFO] Apache CXF WSN API ................................ SUCCESS [9.661s]
[INFO] Apache CXF WSN Core ............................... SUCCESS [9.355s]
[INFO] Apache CXF WSN OSGi ............................... SUCCESS [5.437s]
[INFO] Apache CXF WSN service ............................ SUCCESS [2.585s]
[INFO] Apache CXF WS-Discovery API ....................... SUCCESS [6.481s]
[INFO] Apache CXF WS-Discovery Service ................... SUCCESS [5.577s]
[INFO] Apache CXF WS-Discovery ........................... SUCCESS [11.171s]
[INFO] Apache CXF Karaf Parent ........................... SUCCESS [2.142s]
[INFO] Apache CXF Karaf Features ......................... SUCCESS [20.818s]
[INFO] Apache CXF Karaf Commands ......................... SUCCESS [5.352s]
[INFO] Apache CXF Bundle Parent .......................... SUCCESS [3.255s]
[INFO] Apache CXF Bundle Jar ............................. SUCCESS [2:07.616s]
[INFO] Apache CXF Minimal Bundle Jar ..................... SUCCESS [1:28.192s]
[INFO] Apache CXF JAX-RS Bundle Jar ...................... SUCCESS [43.430s]
[INFO] Apache CXF Compatibility Bundle Jar ............... SUCCESS [1:17.644s]
[INFO] Apache CXF Container Integration System Tests ..... SUCCESS [2.938s]
[INFO] Apache CXF Container Integration Test Webapp ...... SUCCESS [9.059s]
[INFO] Apache CXF Container Integration Test Grizzly ..... SUCCESS [7.793s]
[INFO] Apache CXF Uncategorized System Tests ............. SUCCESS [51.666s]
[INFO] Apache CXF Transport System Tests ................. SUCCESS [9.523s]
[INFO] Apache CXF Transport System Tests JMS ............. SUCCESS [6.810s]
[INFO] Apache CXF JAX-WS System Tests .................... SUCCESS [6.145s]
[INFO] Apache CXF Databinding System Tests ............... SUCCESS [6.916s]
[INFO] Apache CXF JAX-RS System Tests .................... FAILURE [24.117s]
[INFO] Apache CXF WS-* Specifications System Tests ....... SKIPPED
[INFO] Apache CXF WS-RM Specifications System Tests ...... SKIPPED
[INFO] Apache CXF WS-Security System Tests ............... SKIPPED
[INFO] Apache CXF WS-Security Interop System Tests ....... SKIPPED
[INFO] Apache CXF JAX-RS System Advanced Security Tests .. SKIPPED
[INFO] Test for writing wsdl to repo ..................... SKIPPED
[INFO] Test for generating code from wsdl in repo ........ SKIPPED
[INFO] Apache CXF System Tests ........................... SKIPPED
[INFO] Apache CXF System Tests for Maven Plugins ......... SKIPPED
[INFO] Apache CXF Manifest Jar ........................... SKIPPED
[INFO] Apache CXF Samples ................................ SKIPPED
[INFO] Colocated Demo using Document/Literal Style ....... SKIPPED
[INFO] JavaScript Client Demo using Document/Literal Style  SKIPPED
[INFO] Generated JavaScript Sample using JAX-WS and JSR-181  SKIPPED
[INFO] Java First demo service using the JAXWSFactoryBeans  SKIPPED
[INFO] Java First demo using JMS ......................... SKIPPED
[INFO] JAX-RS Content Negotiation Demo ................... SKIPPED
[INFO] JAX-RS Basic Demo With HTTPS communications ....... SKIPPED
[INFO] JAX-RS Basic Demo ................................. SKIPPED
[INFO] CXF sample using a callback object ................ SKIPPED
[INFO] WSDL first demo using BARE Style in XML Binding (pure XML over HTTP)  SKIPPED
[INFO] JAX-WS Dispatch/Provider Demo ..................... SKIPPED
[INFO] WSDL first demo using Document/Literal Style and XMLBeans DataBinding  SKIPPED
[INFO] WSDL first demo using SOAP12 in Document/Literal Style  SKIPPED
[INFO] CXF Dynamic Client Sample ......................... SKIPPED
[INFO] JMS Transport Queue Demo using Document-Literal Style  SKIPPED
[INFO] WSDL first demo using the jms transport and jmsConfigFeature  SKIPPED
[INFO] RESTful Hello World Demo .......................... SKIPPED
[INFO] WSDL first demo using Document/Literal Style ...... SKIPPED
[INFO] CXF sample using the Aegis Binding without any webservice  SKIPPED
[INFO] Java First demo using JAX-WS APIs ................. SKIPPED
[INFO] WS-RM Demo ........................................ SKIPPED
[INFO] CXF Sample of Stream GZIP Interceptor ............. SKIPPED
[INFO] Spring HTTP Sample ................................ SKIPPED
[INFO] Spring HTTP Servlet demo with ruby support ........ SKIPPED
[INFO] Spring HTTP Servlet demo with groovy support ...... SKIPPED
[INFO] Hello world javascript demo ....................... SKIPPED
[INFO] CXF WS-Security UT Demo ........................... SKIPPED
[INFO] WS-Security UT Sign Demo .......................... SKIPPED
[INFO] CXF WS-Security Sign Encoding Demo ................ SKIPPED
[INFO] WS-Security UT Policy Demo ........................ SKIPPED
[INFO] MTOM Demo for SWA and XOP ......................... SKIPPED
[INFO] JAX-WS Asynchronous Demo using Document/Literal Style  SKIPPED
[INFO] Java First POJO Sample ............................ SKIPPED
[INFO] WS-Policy Demo .................................... SKIPPED
[INFO] Hello World Client Demo using JavaScript .......... SKIPPED
[INFO] WSDL first demo using HTTPS ....................... SKIPPED
[INFO] WS-Addressing Demo ................................ SKIPPED
[INFO] Sample using SOAP Headers ......................... SKIPPED
[INFO] SOAP/JMS Transport Specification Demo using Document-Literal Style  SKIPPED
[INFO] CXF sample using WRAPPED Style in XML Binding (pure XML over HTTP)  SKIPPED
[INFO] CXF sample using code first POJO's and the Aegis Binding  SKIPPED
[INFO] Sample of JAX-* Service Using an Aegis Client ..... SKIPPED
[INFO] JAX-WS Handler Demo ............................... SKIPPED
[INFO] WSDL first demo using RPC-Literal Style ........... SKIPPED
[INFO] JMS Transport Publish/Subscribe Demo using Document-Literal Style  SKIPPED
[INFO] JAX-RS Spring Security Demo ....................... SKIPPED
[INFO] LogBrowser ........................................ SKIPPED
[INFO] WS-Notification Demo .............................. SKIPPED
[INFO] CXF STS Demo ...................................... SKIPPED
[INFO] Bank sample using JAX-WS API's to talk via CORBA/IIOP  SKIPPED
[INFO] Bank sample using JAX-WS API's to talk via CORBA/IIOP  SKIPPED
[INFO] hello-world sample using JAX-WS API's to talk via CORBA/IIOP  SKIPPED
[INFO] OAuth 1.0a server ................................. SKIPPED
[INFO] OAuth 1.0a client ................................. SKIPPED
[INFO] JAX-RS Minimal OSGI Demo .......................... SKIPPED
[INFO] WS-Discovery Sample ............................... SKIPPED
[INFO] Apache CXF Distribution ........................... SKIPPED
[INFO] ------------------------------------------------------------------------
[INFO] BUILD FAILURE
[INFO] ------------------------------------------------------------------------
[INFO] Total time: 21:14.143s
[INFO] Finished at: Sat Jun 29 07:16:50 UTC 2013
[INFO] Final Memory: 127M/508M
[INFO] ------------------------------------------------------------------------
[ERROR] Failed to execute goal org.apache.maven.plugins:maven-compiler-plugin:3.1:testCompile
(default-testCompile) on project cxf-systests-jaxrs: Compilation failure
[ERROR] <https://builds.apache.org/job/CXF-2.7-deploy/ws/cxf-2.7.x-fixes/systests/jaxrs/src/test/java/org/apache/cxf/systest/jaxrs/JAXRSClientServerBookTest.java>:[98,24]
cannot find symbol
[ERROR] symbol  : method form(javax.ws.rs.core.Form)
[ERROR] location: class org.apache.cxf.jaxrs.client.WebClient
[ERROR] -> [Help 1]
[ERROR] 
[ERROR] To see the full stack trace of the errors, re-run Maven with the -e switch.
[ERROR] Re-run Maven using the -X switch to enable full debug logging.
[ERROR] 
[ERROR] For more information about the errors and possible solutions, please read the following
articles:
[ERROR] [Help 1] http://cwiki.apache.org/confluence/display/MAVEN/MojoFailureException
[ERROR] 
[ERROR] After correcting the problems, you can resume the build with the command
[ERROR]   mvn <goals> -rf :cxf-systests-jaxrs
Build step 'Invoke top-level Maven targets' marked build as failure

Mime
View raw message