cxf-notifications mailing list archives

Site index · List index
Message view « Date » · « Thread »
Top « Date » · « Thread »
From Apache Jenkins Server <jenk...@builds.apache.org>
Subject Build failed in Jenkins: CXF-2.6-deploy #233
Date Sat, 15 Jun 2013 07:02:57 GMT
See <https://builds.apache.org/job/CXF-2.6-deploy/233/changes>

Changes:

[coheigea] Recording revisions 1493112,1493117,1493119,1493120,1493121 via  git from
https://svn.apache.org/repos/asf/cxf/branches/2.7.x-fixes

[coheigea] Merged revisions 1493119 via  git cherry-pick from
https://svn.apache.org/repos/asf/cxf/branches/2.7.x-fixes

........
  r1493119 | coheigea | 2013-06-14 16:31:18 +0100 (Fri, 14 Jun 2013) | 10 lines

  Merged revisions 1493108 via  git cherry-pick from
  https://svn.apache.org/repos/asf/cxf/trunk

  ........
    r1493108 | coheigea | 2013-06-14 16:12:19 +0100 (Fri, 14 Jun 2013) | 2 lines

    [CXF-5056] - EndorsingSupportingTokens with both transport security and message layer
security applied

  ........

........

[coheigea] Fixing build


Conflicts:
	rt/ws/security/src/main/java/org/apache/cxf/ws/security/SecurityConstants.java

[coheigea] Merged revisions 1493112 via  git cherry-pick from
https://svn.apache.org/repos/asf/cxf/branches/2.7.x-fixes

........
  r1493112 | coheigea | 2013-06-14 16:23:17 +0100 (Fri, 14 Jun 2013) | 10 lines

  Merged revisions 1492679 via  git cherry-pick from
  https://svn.apache.org/repos/asf/cxf/trunk

  ........
    r1492679 | coheigea | 2013-06-13 15:00:23 +0100 (Thu, 13 Jun 2013) | 2 lines

    Upgrading BouncyCastle version

  ........

........

------------------------------------------
[...truncated 16975 lines...]
Uploading: https://repository.apache.org/content/repositories/snapshots/org/apache/cxf/systests/cxf-systests-transport-jms/2.6.9-SNAPSHOT/cxf-systests-transport-jms-2.6.9-20130615.070249-20-sources.jar
Uploaded: https://repository.apache.org/content/repositories/snapshots/org/apache/cxf/systests/cxf-systests-transport-jms/2.6.9-SNAPSHOT/cxf-systests-transport-jms-2.6.9-20130615.070249-20-sources.jar
(15 KB at 41.2 KB/sec)
Uploading: https://repository.apache.org/content/repositories/snapshots/org/apache/cxf/systests/cxf-systests-transport-jms/2.6.9-SNAPSHOT/maven-metadata.xml
Uploaded: https://repository.apache.org/content/repositories/snapshots/org/apache/cxf/systests/cxf-systests-transport-jms/2.6.9-SNAPSHOT/maven-metadata.xml
(2 KB at 4.6 KB/sec)
Uploading: https://repository.apache.org/content/repositories/snapshots/org/apache/cxf/systests/cxf-systests-transport-jms/2.6.9-SNAPSHOT/cxf-systests-transport-jms-2.6.9-20130615.070249-20-javadoc.jar
Uploaded: https://repository.apache.org/content/repositories/snapshots/org/apache/cxf/systests/cxf-systests-transport-jms/2.6.9-SNAPSHOT/cxf-systests-transport-jms-2.6.9-20130615.070249-20-javadoc.jar
(55 KB at 133.6 KB/sec)
Uploading: https://repository.apache.org/content/repositories/snapshots/org/apache/cxf/systests/cxf-systests-transport-jms/2.6.9-SNAPSHOT/maven-metadata.xml
Uploaded: https://repository.apache.org/content/repositories/snapshots/org/apache/cxf/systests/cxf-systests-transport-jms/2.6.9-SNAPSHOT/maven-metadata.xml
(2 KB at 4.3 KB/sec)
Uploading: https://repository.apache.org/content/repositories/snapshots/org/apache/cxf/systests/cxf-systests-transport-jms/2.6.9-SNAPSHOT/cxf-systests-transport-jms-2.6.9-20130615.070249-20-tests.jar
Uploaded: https://repository.apache.org/content/repositories/snapshots/org/apache/cxf/systests/cxf-systests-transport-jms/2.6.9-SNAPSHOT/cxf-systests-transport-jms-2.6.9-20130615.070249-20-tests.jar
(155 KB at 322.9 KB/sec)
Uploading: https://repository.apache.org/content/repositories/snapshots/org/apache/cxf/systests/cxf-systests-transport-jms/2.6.9-SNAPSHOT/maven-metadata.xml
Uploaded: https://repository.apache.org/content/repositories/snapshots/org/apache/cxf/systests/cxf-systests-transport-jms/2.6.9-SNAPSHOT/maven-metadata.xml
(2 KB at 4.4 KB/sec)
[INFO]                                                                         
[INFO] ------------------------------------------------------------------------
[INFO] Building Apache CXF JAX-WS System Tests 2.6.9-SNAPSHOT
[INFO] ------------------------------------------------------------------------
[INFO] 
[INFO] --- maven-bundle-plugin:2.3.7:cleanVersions (versions) @ cxf-systests-jaxws ---
[INFO] 
[INFO] --- cxf-xml2fastinfoset-plugin:2.5.0:xml2fastinfoset (xml2fastinfoset) @ cxf-systests-jaxws
---
[INFO] 
[INFO] --- maven-remote-resources-plugin:1.3:process (default) @ cxf-systests-jaxws ---
[INFO] 
[INFO] --- maven-resources-plugin:2.6:resources (default-resources) @ cxf-systests-jaxws ---
[INFO] Using 'UTF-8' encoding to copy filtered resources.
[INFO] skip non existing resourceDirectory <https://builds.apache.org/job/CXF-2.6-deploy/ws/cxf-2.6.x-fixes/systests/jaxws/src/main/java>
[INFO] skip non existing resourceDirectory <https://builds.apache.org/job/CXF-2.6-deploy/ws/cxf-2.6.x-fixes/systests/jaxws/src/main/resources>
[INFO] skip non existing resourceDirectory <https://builds.apache.org/job/CXF-2.6-deploy/ws/cxf-2.6.x-fixes/systests/jaxws/src/main/resources-filtered>
[INFO] skip non existing resourceDirectory <https://builds.apache.org/job/CXF-2.6-deploy/ws/cxf-2.6.x-fixes/systests/jaxws/target/generated/src/main/resources>
[INFO] Copying 3 resources
[INFO] 
[INFO] --- maven-compiler-plugin:3.1:compile (default-compile) @ cxf-systests-jaxws ---
[INFO] No sources to compile
[INFO] 
[INFO] --- maven-bundle-plugin:2.3.7:manifest (bundle-manifest) @ cxf-systests-jaxws ---
[WARNING] Manifest org.apache.cxf.systests:cxf-systests-jaxws:jar:2.6.9-SNAPSHOT : Superfluous
export-package instructions: [org.apache.cxf.*]
[INFO] 
[INFO] --- cxf-codegen-plugin:2.6.9-SNAPSHOT:wsdl2java (generate-test-sources) @ cxf-systests-jaxws
---
[INFO] 
[INFO] --- maven-resources-plugin:2.6:testResources (default-testResources) @ cxf-systests-jaxws
---
[INFO] Using 'UTF-8' encoding to copy filtered resources.
[INFO] Copying 46 resources
[INFO] Copying 12 resources
[INFO] skip non existing resourceDirectory <https://builds.apache.org/job/CXF-2.6-deploy/ws/cxf-2.6.x-fixes/systests/jaxws/target/generated/src/test/resources>
[INFO] Copying 3 resources
[INFO] 
[INFO] --- maven-compiler-plugin:3.1:testCompile (default-testCompile) @ cxf-systests-jaxws
---
[INFO] Changes detected - recompiling the module!
[INFO] Compiling 162 source files to <https://builds.apache.org/job/CXF-2.6-deploy/ws/cxf-2.6.x-fixes/systests/jaxws/target/test-classes>
[INFO] -------------------------------------------------------------
[ERROR] COMPILATION ERROR : 
[INFO] -------------------------------------------------------------
[ERROR] <https://builds.apache.org/job/CXF-2.6-deploy/ws/cxf-2.6.x-fixes/systests/jaxws/src/test/java/org/apache/cxf/systest/jaxws/cxf5064/HeaderObj.java>:[33,40]
cannot find symbol
symbol  : method isEmpty()
location: class java.lang.String
[INFO] 1 error
[INFO] -------------------------------------------------------------
[INFO] ------------------------------------------------------------------------
[INFO] Reactor Summary:
[INFO] 
[INFO] Apache CXF ........................................ SUCCESS [7.802s]
[INFO] Apache CXF Parent ................................. SUCCESS [4.041s]
[INFO] Apache CXF API .................................... SUCCESS [46.321s]
[INFO] Apache CXF Woodstox/MSV Schema Validation ......... SUCCESS [9.226s]
[INFO] Apache CXF XML Schema Validation with Xerces ...... SUCCESS [6.009s]
[INFO] Apache CXF Common ................................. SUCCESS [2.223s]
[INFO] Apache CXF Runtime Core ........................... SUCCESS [15.012s]
[INFO] Apache CXF Command Line Tools Common .............. SUCCESS [10.844s]
[INFO] Apache CXF Runtime JAXB DataBinding ............... SUCCESS [8.799s]
[INFO] Apache CXF Runtime SOAP Binding ................... SUCCESS [12.590s]
[INFO] Apache CXF Command Line Tools Validator ........... SUCCESS [10.902s]
[INFO] Apache CXF Command Line Tools WSDLTo Core ......... SUCCESS [7.998s]
[INFO] Apache CXF Command Line Tools WSDLTo JAXWS Frontend  SUCCESS [10.145s]
[INFO] Apache CXF Runtime JavaScript Client Generator Projects  SUCCESS [1.909s]
[INFO] Apache CXF Runtime JavaScript Client Generator .... SUCCESS [7.592s]
[INFO] Apache CXF Command Line Tools WSDL to JavaScript Front End  SUCCESS [6.839s]
[INFO] Apache CXF Command Line Tools WSDLTo JAXB Databinding  SUCCESS [7.020s]
[INFO] Apache CXF Maven Plugins .......................... SUCCESS [1.925s]
[INFO] Apache CXF WSDL Validator Maven2 Plugin ........... SUCCESS [7.509s]
[INFO] Apache CXF Code Generation Maven2 Plugins ......... SUCCESS [10.100s]
[INFO] Apache CXF Test Utilities ......................... SUCCESS [44.125s]
[INFO] Apache CXF Runtime Management ..................... SUCCESS [9.043s]
[INFO] Apache CXF Runtime JMS Transport .................. SUCCESS [13.644s]
[INFO] Apache CXF Runtime XML Binding .................... SUCCESS [8.113s]
[INFO] Apache CXF Runtime Local Transport ................ SUCCESS [6.741s]
[INFO] Apache CXF Runtime WS Policy ...................... SUCCESS [13.959s]
[INFO] Apache CXF Runtime HTTP Transport ................. SUCCESS [14.649s]
[INFO] Apache CXF Runtime HTTP Jetty Transport ........... SUCCESS [11.294s]
[INFO] Apache CXF Runtime Simple Frontend ................ SUCCESS [9.041s]
[INFO] Apache CXF Runtime WS Addressing .................. SUCCESS [13.057s]
[INFO] Apache CXF Runtime JAX-WS Frontend ................ SUCCESS [17.644s]
[INFO] Apache CXF Runtime XmlBeans DataBinding ........... SUCCESS [10.835s]
[INFO] Apache CXF Command Line Tools WSDLTo Test ......... SUCCESS [5.074s]
[INFO] Apache CXF Command Line Tools WSDLTo Misctools .... SUCCESS [7.561s]
[INFO] Apache CXF Command Line Tools ..................... SUCCESS [2.928s]
[INFO] Apache CXF Command Line Tools WSDLTo .............. SUCCESS [2.349s]
[INFO] Apache CXF Runtime Aegis Databinding .............. SUCCESS [15.517s]
[INFO] Apache CXF Command Line Tools JavaTo WS ........... SUCCESS [20.366s]
[INFO] Apache CXF Command Line Tools JavaTo .............. SUCCESS [2.043s]
[INFO] Apache CXF Runtime JAX-RS Frontend ................ SUCCESS [19.919s]
[INFO] Apache CXF Command Line Tools WADLTo JAXRS Frontend  SUCCESS [7.923s]
[INFO] Apache CXF Command Line Tools WADLTo .............. SUCCESS [2.251s]
[INFO] Apache CXF Runtime CORBA Binding .................. SUCCESS [16.690s]
[INFO] Apache CXF Command Line Tools CORBA ............... SUCCESS [13.028s]
[INFO] Apache CXF Runtime SDO DataBinding ................ SUCCESS [8.502s]
[INFO] Apache CXF Runtime JiBX DataBinding ............... SUCCESS [8.834s]
[INFO] Apache CXF Runtime Object Binding ................. SUCCESS [13.599s]
[INFO] Apache CXF Runtime Colocated Binding .............. SUCCESS [7.486s]
[INFO] Apache CXF Runtime ................................ SUCCESS [2.104s]
[INFO] Apache CXF Runtime Bindings ....................... SUCCESS [2.453s]
[INFO] Apache CXF Runtime Clustering ..................... SUCCESS [9.037s]
[INFO] Apache CXF Runtime JavaScript Frontend ............ SUCCESS [7.753s]
[INFO] Apache CXF Runtime WS Reliable Messaging .......... SUCCESS [18.808s]
[INFO] Apache CXF Runtime WS MetadataExchange ............ SUCCESS [7.643s]
[INFO] Apache CXF Runtime WS Security .................... SUCCESS [28.847s]
[INFO] Apache CXF JAX-RS Extensions: Providers ........... SUCCESS [10.970s]
[INFO] Apache CXF JAX-RS Extensions: Search .............. SUCCESS [10.308s]
[INFO] Apache CXF RS XML Security ........................ SUCCESS [9.473s]
[INFO] Apache CXF RS SSO SAML ............................ SUCCESS [8.281s]
[INFO] Apache CXF Runtime RS Security OAuth Parent ....... SUCCESS [1.876s]
[INFO] Apache CXF Runtime OAuth 1.0a ..................... SUCCESS [8.685s]
[INFO] Apache CXF Runtime OAuth 2.0 ...................... SUCCESS [10.334s]
[INFO] Apache CXF RS Cross-Origin Resource Sharing ....... SUCCESS [7.799s]
[INFO] Apache CXF Runtime Web Management ................. SUCCESS [16.866s]
[INFO] Apache CXF Runtime JavaScript Client Generator Tests  SUCCESS [4.400s]
[INFO] Apache CXF JCA Connection ......................... SUCCESS [11.455s]
[INFO] Apache CXF Integration ............................ SUCCESS [1.847s]
[INFO] Apache CXF Java2WS Maven2 Plugin .................. SUCCESS [8.329s]
[INFO] Apache CXF WADL2Java Code Generation Maven2 Plugin  SUCCESS [7.874s]
[INFO] Apache CXF CORBA Tools Maven2 Plugins ............. SUCCESS [7.974s]
[INFO] Apache CXF Archetype - Simple JAX-WS Java First ... SUCCESS [7.797s]
[INFO] Apache CXF Archetype - Simple JAX-RS webapp ....... SUCCESS [4.078s]
[INFO] Apache CXF Maven Archetypes ....................... SUCCESS [2.224s]
[INFO] Apache CXF STS Core ............................... SUCCESS [14.391s]
[INFO] Apache CXF STS war deployment ..................... SUCCESS [14.939s]
[INFO] Apache CXF STS basic systests ..................... SUCCESS [8.780s]
[INFO] Apache CXF STS advanced systests .................. SUCCESS [8.131s]
[INFO] Apache CXF Services ............................... SUCCESS [2.749s]
[INFO] Apache CXF STS service ............................ SUCCESS [1.887s]
[INFO] Apache CXF STS systests ........................... SUCCESS [4.020s]
[INFO] Apache CXF WSN API ................................ SUCCESS [15.632s]
[INFO] Apache CXF WSN Core ............................... SUCCESS [9.936s]
[INFO] Apache CXF WSN OSGi ............................... SUCCESS [7.251s]
[INFO] Apache CXF WSN service ............................ SUCCESS [1.825s]
[INFO] Apache CXF Karaf Parent ........................... SUCCESS [2.145s]
[INFO] Apache CXF Karaf Features ......................... SUCCESS [2.909s]
[INFO] Apache CXF Karaf Commands ......................... SUCCESS [6.921s]
[INFO] Apache CXF Bundle Parent .......................... SUCCESS [2.626s]
[INFO] Apache CXF Bundle Jar ............................. SUCCESS [4:34.600s]
[INFO] Apache CXF Minimal Bundle Jar ..................... SUCCESS [3:21.300s]
[INFO] Apache CXF JAX-RS Bundle Jar ...................... SUCCESS [1:41.415s]
[INFO] Apache CXF Compatibility Bundle Jar ............... SUCCESS [3:18.614s]
[INFO] Apache CXF Container Integration System Tests ..... SUCCESS [4.046s]
[INFO] Apache CXF Container Integration Test Webapp ...... SUCCESS [9.120s]
[INFO] Apache CXF Uncategorized System Tests ............. SUCCESS [10.757s]
[INFO] Apache CXF Transport System Tests ................. SUCCESS [7.894s]
[INFO] Apache CXF Transport System Tests JMS ............. SUCCESS [9.050s]
[INFO] Apache CXF JAX-WS System Tests .................... FAILURE [2.982s]
[INFO] Apache CXF Databinding System Tests ............... SKIPPED
[INFO] Apache CXF JAX-RS System Tests .................... SKIPPED
[INFO] Apache CXF WS-* Specifications System Tests ....... SKIPPED
[INFO] Apache CXF WS-RM Specifications System Tests ...... SKIPPED
[INFO] Apache CXF WS-Security System Tests ............... SKIPPED
[INFO] Apache CXF WS-Security Interop System Tests ....... SKIPPED
[INFO] Apache CXF JAX-RS System Advanced Security Tests .. SKIPPED
[INFO] Test for writing wsdl to repo ..................... SKIPPED
[INFO] Test for generating code from wsdl in repo ........ SKIPPED
[INFO] Apache CXF System Tests ........................... SKIPPED
[INFO] Apache CXF System Tests for Maven Plugins ......... SKIPPED
[INFO] Apache CXF Manifest Jar ........................... SKIPPED
[INFO] Apache CXF Samples ................................ SKIPPED
[INFO] Colocated Demo using Document/Literal Style ....... SKIPPED
[INFO] JavaScript Client Demo using Document/Literal Style  SKIPPED
[INFO] Generated JavaScript Sample using JAX-WS and JSR-181  SKIPPED
[INFO] Java First demo service using the JAXWSFactoryBeans  SKIPPED
[INFO] Java First demo using JMS ......................... SKIPPED
[INFO] JAX-RS Content Negotiation Demo ................... SKIPPED
[INFO] JAX-RS Basic Demo With HTTPS communications ....... SKIPPED
[INFO] JAX-RS Basic Demo ................................. SKIPPED
[INFO] CXF sample using a callback object ................ SKIPPED
[INFO] WSDL first demo using BARE Style in XML Binding (pure XML over HTTP)  SKIPPED
[INFO] JAX-WS Dispatch/Provider Demo ..................... SKIPPED
[INFO] WSDL first demo using Document/Literal Style and XMLBeans DataBinding  SKIPPED
[INFO] WSDL first demo using SOAP12 in Document/Literal Style  SKIPPED
[INFO] CXF Dynamic Client Sample ......................... SKIPPED
[INFO] JMS Transport Queue Demo using Document-Literal Style  SKIPPED
[INFO] WSDL first demo using the jms transport and jmsConfigFeature  SKIPPED
[INFO] RESTful Hello World Demo .......................... SKIPPED
[INFO] WSDL first demo using Document/Literal Style ...... SKIPPED
[INFO] CXF sample using the Aegis Binding without any webservice  SKIPPED
[INFO] Java First demo using JAX-WS APIs ................. SKIPPED
[INFO] WS-RM Demo ........................................ SKIPPED
[INFO] CXF Sample of Stream GZIP Interceptor ............. SKIPPED
[INFO] Spring HTTP Sample ................................ SKIPPED
[INFO] Spring HTTP Servlet demo with ruby support ........ SKIPPED
[INFO] Spring HTTP Servlet demo with groovy support ...... SKIPPED
[INFO] Hello world javascript demo ....................... SKIPPED
[INFO] CXF WS-Security UT Demo ........................... SKIPPED
[INFO] WS-Security UT Sign Demo .......................... SKIPPED
[INFO] CXF WS-Security Sign Encoding Demo ................ SKIPPED
[INFO] WS-Security UT Policy Demo ........................ SKIPPED
[INFO] MTOM Demo for SWA and XOP ......................... SKIPPED
[INFO] JAX-WS Asynchronous Demo using Document/Literal Style  SKIPPED
[INFO] Java First POJO Sample ............................ SKIPPED
[INFO] WS-Policy Demo .................................... SKIPPED
[INFO] Hello World Client Demo using JavaScript .......... SKIPPED
[INFO] WSDL first demo using HTTPS ....................... SKIPPED
[INFO] WS-Addressing Demo ................................ SKIPPED
[INFO] Sample using SOAP Headers ......................... SKIPPED
[INFO] SOAP/JMS Transport Specification Demo using Document-Literal Style  SKIPPED
[INFO] CXF sample using WRAPPED Style in XML Binding (pure XML over HTTP)  SKIPPED
[INFO] CXF sample using code first POJO's and the Aegis Binding  SKIPPED
[INFO] Sample of JAX-* Service Using an Aegis Client ..... SKIPPED
[INFO] JAX-WS Handler Demo ............................... SKIPPED
[INFO] WSDL first demo using RPC-Literal Style ........... SKIPPED
[INFO] JMS Transport Publish/Subscribe Demo using Document-Literal Style  SKIPPED
[INFO] JAX-RS Spring Security Demo ....................... SKIPPED
[INFO] LogBrowser ........................................ SKIPPED
[INFO] WS-Notification Demo .............................. SKIPPED
[INFO] CXF STS Demo ...................................... SKIPPED
[INFO] Bank sample using JAX-WS API's to talk via CORBA/IIOP  SKIPPED
[INFO] Bank sample using JAX-WS API's to talk via CORBA/IIOP  SKIPPED
[INFO] hello-world sample using JAX-WS API's to talk via CORBA/IIOP  SKIPPED
[INFO] OAuth 1.0a server ................................. SKIPPED
[INFO] OAuth 1.0a client ................................. SKIPPED
[INFO] JAX-RS Minimal OSGI Demo .......................... SKIPPED
[INFO] Apache CXF Distribution ........................... SKIPPED
[INFO] ------------------------------------------------------------------------
[INFO] BUILD FAILURE
[INFO] ------------------------------------------------------------------------
[INFO] Total time: 27:47.903s
[INFO] Finished at: Sat Jun 15 07:02:55 UTC 2013
[INFO] Final Memory: 99M/242M
[INFO] ------------------------------------------------------------------------
[ERROR] Failed to execute goal org.apache.maven.plugins:maven-compiler-plugin:3.1:testCompile
(default-testCompile) on project cxf-systests-jaxws: Compilation failure
[ERROR] <https://builds.apache.org/job/CXF-2.6-deploy/ws/cxf-2.6.x-fixes/systests/jaxws/src/test/java/org/apache/cxf/systest/jaxws/cxf5064/HeaderObj.java>:[33,40]
cannot find symbol
[ERROR] symbol  : method isEmpty()
[ERROR] location: class java.lang.String
[ERROR] -> [Help 1]
[ERROR] 
[ERROR] To see the full stack trace of the errors, re-run Maven with the -e switch.
[ERROR] Re-run Maven using the -X switch to enable full debug logging.
[ERROR] 
[ERROR] For more information about the errors and possible solutions, please read the following
articles:
[ERROR] [Help 1] http://cwiki.apache.org/confluence/display/MAVEN/MojoFailureException
[ERROR] 
[ERROR] After correcting the problems, you can resume the build with the command
[ERROR]   mvn <goals> -rf :cxf-systests-jaxws
Build step 'Invoke top-level Maven targets' marked build as failure

Mime
View raw message