cxf-notifications mailing list archives

Site index · List index
Message view « Date » · « Thread »
Top « Date » · « Thread »
From Apache Jenkins Server <jenk...@builds.apache.org>
Subject Build failed in Jenkins: CXF-2.5-deploy #229
Date Fri, 04 Jan 2013 06:22:42 GMT
See <https://builds.apache.org/job/CXF-2.5-deploy/229/changes>

Changes:

[dkulp] Blocking revisions 1424539,1424540,1424541,1425019,1426199,1426204,1426286,1426476,1428407,1428546,1428547,1428549
via  git from
https://svn.apache.org/repos/asf/cxf/branches/2.6.x-fixes

[dkulp] Recording revisions 1428405,1428406,1428545 via  git from
https://svn.apache.org/repos/asf/cxf/branches/2.6.x-fixes

[dkulp] Merged revisions 1428545 via  git cherry-pick from
https://svn.apache.org/repos/asf/cxf/branches/2.6.x-fixes

........
  r1428545 | dkulp | 2013-01-03 13:52:59 -0500 (Thu, 03 Jan 2013) | 10 lines

  Merged revisions 1428524 via  git cherry-pick from
  https://svn.apache.org/repos/asf/cxf/trunk

  ........
    r1428524 | dkulp | 2013-01-03 13:14:12 -0500 (Thu, 03 Jan 2013) | 2 lines

    [CXF-4727] Add an npe guard

  ........

........

[dkulp] Merged revisions 1428406 via  git cherry-pick from
https://svn.apache.org/repos/asf/cxf/branches/2.6.x-fixes

........
  r1428406 | dkulp | 2013-01-03 10:38:52 -0500 (Thu, 03 Jan 2013) | 10 lines

  Merged revisions 1428398 via  git cherry-pick from
  https://svn.apache.org/repos/asf/cxf/trunk

  ........
    r1428398 | dkulp | 2013-01-03 10:23:09 -0500 (Thu, 03 Jan 2013) | 2 lines

    Bunch of optimizations for the Aegis XMLTypeCreator to delay creating the XPathUtils and
to cache which documents could NOT be found instead of trying to repeatedly find it.

  ........

........

[dkulp] Merged revisions 1428405 via  git cherry-pick from
https://svn.apache.org/repos/asf/cxf/branches/2.6.x-fixes

........
  r1428405 | dkulp | 2013-01-03 10:38:48 -0500 (Thu, 03 Jan 2013) | 10 lines

  Merged revisions 1426594 via  git cherry-pick from
  https://svn.apache.org/repos/asf/cxf/trunk

  ........
    r1426594 | ashakirin | 2012-12-28 12:52:03 -0500 (Fri, 28 Dec 2012) | 2 lines

    Fix for CXF-4289 (disable copying soap headers to fault through property)

  ........

........

[coheigea] Recording revisions 1428347,1428348 via  git from
https://svn.apache.org/repos/asf/cxf/branches/2.6.x-fixes

[coheigea] Merged revisions 1428347 via  git cherry-pick from
https://svn.apache.org/repos/asf/cxf/branches/2.6.x-fixes

........
  r1428347 | coheigea | 2013-01-03 13:56:32 +0000 (Thu, 03 Jan 2013) | 10 lines

  Merged revisions 1428342 via  git cherry-pick from
  https://svn.apache.org/repos/asf/cxf/trunk

  ........
    r1428342 | coheigea | 2013-01-03 13:39:50 +0000 (Thu, 03 Jan 2013) | 2 lines

    Some sample cleanup

  ........

........

[coheigea] Recording revisions 1428300,1428301 via  git from
https://svn.apache.org/repos/asf/cxf/branches/2.6.x-fixes

[coheigea] Merged revisions 1428300 via  git cherry-pick from
https://svn.apache.org/repos/asf/cxf/branches/2.6.x-fixes

........
  r1428300 | coheigea | 2013-01-03 11:39:22 +0000 (Thu, 03 Jan 2013) | 10 lines

  Merged revisions 1428285 via  git cherry-pick from
  https://svn.apache.org/repos/asf/cxf/trunk

  ........
    r1428285 | coheigea | 2013-01-03 11:20:30 +0000 (Thu, 03 Jan 2013) | 2 lines

    [CXF-4728] - STS KeyIdentifier AttachedReference shouldn't use a URI fragment

  ........

........

------------------------------------------
[...truncated 488 lines...]
[INFO] [javadoc:jar {execution: attach-javadocs}]
[INFO] Not executing Javadoc as the project is not a Java classpath-capable package
[INFO] [install:install {execution: default-install}]
[INFO] Installing <https://builds.apache.org/job/CXF-2.5-deploy/ws/cxf-2.5.x-fixes/pom.xml>
to <https://builds.apache.org/job/CXF-2.5-deploy/ws/.repository/org/apache/cxf/cxf/2.5.8-SNAPSHOT/cxf-2.5.8-SNAPSHOT.pom>
[INFO] Installing <https://builds.apache.org/job/CXF-2.5-deploy/ws/cxf-2.5.x-fixes/target/cxf-2.5.8-SNAPSHOT-site.xml>
to <https://builds.apache.org/job/CXF-2.5-deploy/ws/.repository/org/apache/cxf/cxf/2.5.8-SNAPSHOT/cxf-2.5.8-SNAPSHOT-site.xml>
[INFO] [deploy:deploy {execution: default-deploy}]
[INFO] Retrieving previous build number from apache.snapshots.https
[WARNING] *** CHECKSUM FAILED - Checksum failed on download: local = 'd0c8ca93280ee4dc3abe26081b4c3e44270f1f07';
remote = 'f365a4773151832080967206bb2f61e068ae16a3' - RETRYING
[WARNING] *** CHECKSUM FAILED - Checksum failed on download: local = 'd0c8ca93280ee4dc3abe26081b4c3e44270f1f07';
remote = 'f365a4773151832080967206bb2f61e068ae16a3' - IGNORING
Uploading: https://repository.apache.org/content/repositories/snapshots/org/apache/cxf/cxf/2.5.8-SNAPSHOT/cxf-2.5.8-20130104.062219-14.pom
35K uploaded  (cxf-2.5.8-20130104.062219-14.pom)
[INFO] Retrieving previous metadata from apache.snapshots.https
[INFO] Uploading repository metadata for: 'artifact org.apache.cxf:cxf'
[INFO] Retrieving previous metadata from apache.snapshots.https
[WARNING] *** CHECKSUM FAILED - Checksum failed on download: local = 'd0c8ca93280ee4dc3abe26081b4c3e44270f1f07';
remote = 'f365a4773151832080967206bb2f61e068ae16a3' - RETRYING
[WARNING] *** CHECKSUM FAILED - Checksum failed on download: local = 'd0c8ca93280ee4dc3abe26081b4c3e44270f1f07';
remote = 'f365a4773151832080967206bb2f61e068ae16a3' - IGNORING
[INFO] Uploading repository metadata for: 'snapshot org.apache.cxf:cxf:2.5.8-SNAPSHOT'
[INFO] Retrieving previous build number from apache.snapshots.https
Uploading: https://repository.apache.org/content/repositories/snapshots/org/apache/cxf/cxf/2.5.8-SNAPSHOT/cxf-2.5.8-20130104.062219-14-site.xml
1K uploaded  (cxf-2.5.8-20130104.062219-14-site.xml)
[INFO] ------------------------------------------------------------------------
[INFO] Building Apache CXF Parent
[INFO]    task-segment: [deploy]
[INFO] ------------------------------------------------------------------------
[INFO] [cxf-xml2fastinfoset:xml2fastinfoset {execution: xml2fastinfoset}]
[WARNING] The parameter expression: 'project.build.resources' used in mojo: 'process' has
been deprecated. Use 'project.resources' instead.
[INFO] [remote-resources:process {execution: default}]
[INFO] [site:attach-descriptor {execution: default-attach-descriptor}]
[INFO] [source:jar-no-fork {execution: attach-sources}]
[INFO] [javadoc:jar {execution: attach-javadocs}]
[INFO] Not executing Javadoc as the project is not a Java classpath-capable package
[INFO] [install:install {execution: default-install}]
[INFO] Installing <https://builds.apache.org/job/CXF-2.5-deploy/ws/cxf-2.5.x-fixes/parent/pom.xml>
to <https://builds.apache.org/job/CXF-2.5-deploy/ws/.repository/org/apache/cxf/cxf-parent/2.5.8-SNAPSHOT/cxf-parent-2.5.8-SNAPSHOT.pom>
[INFO] [deploy:deploy {execution: default-deploy}]
[INFO] Retrieving previous build number from apache.snapshots.https
[WARNING] *** CHECKSUM FAILED - Checksum failed on download: local = '200755d78d0d5a3bf175459389ef98ff543f10b2';
remote = '54fa872bf6a3c9f80cdd5ddf842ad592b84310b1' - RETRYING
[WARNING] *** CHECKSUM FAILED - Checksum failed on download: local = '200755d78d0d5a3bf175459389ef98ff543f10b2';
remote = '54fa872bf6a3c9f80cdd5ddf842ad592b84310b1' - IGNORING
Uploading: https://repository.apache.org/content/repositories/snapshots/org/apache/cxf/cxf-parent/2.5.8-SNAPSHOT/cxf-parent-2.5.8-20130104.062219-14.pom
73K uploaded  (cxf-parent-2.5.8-20130104.062219-14.pom)
[INFO] Retrieving previous metadata from apache.snapshots.https
[WARNING] *** CHECKSUM FAILED - Checksum failed on download: local = '200755d78d0d5a3bf175459389ef98ff543f10b2';
remote = '54fa872bf6a3c9f80cdd5ddf842ad592b84310b1' - RETRYING
[WARNING] *** CHECKSUM FAILED - Checksum failed on download: local = '200755d78d0d5a3bf175459389ef98ff543f10b2';
remote = '54fa872bf6a3c9f80cdd5ddf842ad592b84310b1' - IGNORING
[INFO] Uploading repository metadata for: 'snapshot org.apache.cxf:cxf-parent:2.5.8-SNAPSHOT'
[INFO] Retrieving previous metadata from apache.snapshots.https
[INFO] Uploading repository metadata for: 'artifact org.apache.cxf:cxf-parent'
[INFO] ------------------------------------------------------------------------
[INFO] Building Apache CXF Common Utilities
[INFO]    task-segment: [deploy]
[INFO] ------------------------------------------------------------------------
[INFO] [cxf-xml2fastinfoset:xml2fastinfoset {execution: xml2fastinfoset}]
[WARNING] The parameter expression: 'project.build.resources' used in mojo: 'process' has
been deprecated. Use 'project.resources' instead.
[INFO] [remote-resources:process {execution: default}]
[debug] execute contextualize
[INFO] [resources:resources {execution: default-resources}]
[INFO] Using 'UTF-8' encoding to copy filtered resources.
[INFO] Copying 8 resources
[INFO] Copying 2 resources
[INFO] Copying 1 resource
[INFO] skip non existing resourceDirectory <https://builds.apache.org/job/CXF-2.5-deploy/ws/cxf-2.5.x-fixes/common/common/target/generated/src/main/resources>
[INFO] Copying 3 resources
[INFO] [compiler:compile {execution: default-compile}]
[INFO] Nothing to compile - all classes are up to date
[debug] execute contextualize
[INFO] [resources:testResources {execution: default-testResources}]
[INFO] Using 'UTF-8' encoding to copy filtered resources.
[INFO] Copying 56 resources
[INFO] Copying 7 resources
[INFO] skip non existing resourceDirectory <https://builds.apache.org/job/CXF-2.5-deploy/ws/cxf-2.5.x-fixes/common/common/target/generated/src/test/resources>
[INFO] Copying 3 resources
[INFO] [compiler:testCompile {execution: default-testCompile}]
[INFO] Nothing to compile - all classes are up to date
[INFO] [surefire:test {execution: default-test}]
[INFO] Tests are skipped.
[INFO] [jar:jar {execution: default-jar}]
[INFO] Building jar: <https://builds.apache.org/job/CXF-2.5-deploy/ws/cxf-2.5.x-fixes/common/common/target/cxf-common-utilities-2.5.8-SNAPSHOT.jar>
[INFO] [source:jar-no-fork {execution: attach-sources}]
[INFO] org already added, skipping
[INFO] org/apache already added, skipping
[INFO] org/apache/cxf already added, skipping
[INFO] org/apache/cxf/common already added, skipping
[INFO] org/apache/cxf/common/commands already added, skipping
[INFO] org/apache/cxf/common/util already added, skipping
[INFO] org/apache/cxf/common/injection already added, skipping
[INFO] org/apache/cxf/common/annotation already added, skipping
[INFO] org/apache/cxf/common/security already added, skipping
[INFO] org/apache/cxf/common/classloader already added, skipping
[INFO] org/apache/cxf/common/logging already added, skipping
[INFO] org/apache/cxf/common/i18n already added, skipping
[INFO] org/apache/cxf/common/xmlschema already added, skipping
[INFO] org/apache/cxf/configuration already added, skipping
[INFO] org/apache/cxf/configuration/spring already added, skipping
[INFO] org/apache/cxf/staxutils already added, skipping
[INFO] org/apache/cxf/staxutils/transform already added, skipping
[INFO] org/apache/cxf/management already added, skipping
[INFO] org/apache/cxf/management/annotation already added, skipping
[INFO] org/apache/cxf/jaxb already added, skipping
[INFO] org/apache/cxf/resource already added, skipping
[INFO] org/apache/cxf/version already added, skipping
[INFO] org/apache/cxf/helpers already added, skipping
[INFO] org/apache/cxf/common/commands/Message.properties already added, skipping
[INFO] org/apache/cxf/common/util/Messages.properties already added, skipping
[INFO] org/apache/cxf/common/injection/Messages.properties already added, skipping
[INFO] org/apache/cxf/common/annotation/Messages.properties already added, skipping
[INFO] org/apache/cxf/common/xmlschema/Messages.properties already added, skipping
[INFO] org/apache/cxf/jaxb/CommonUtilityMessages.properties already added, skipping
[INFO] org/apache/cxf/resource/Messages.properties already added, skipping
[INFO] org/apache/cxf/helpers/Messages.properties already added, skipping
[INFO] META-INF already added, skipping
[INFO] org already added, skipping
[INFO] org/apache already added, skipping
[INFO] org/apache/cxf already added, skipping
[INFO] org/apache/cxf/version already added, skipping
[INFO] META-INF already added, skipping
[INFO] META-INF/LICENSE already added, skipping
[INFO] META-INF/NOTICE already added, skipping
[INFO] META-INF/DEPENDENCIES already added, skipping
[INFO] Building jar: <https://builds.apache.org/job/CXF-2.5-deploy/ws/cxf-2.5.x-fixes/common/common/target/cxf-common-utilities-2.5.8-SNAPSHOT-sources.jar>
[INFO] org already added, skipping
[INFO] org/apache already added, skipping
[INFO] org/apache/cxf already added, skipping
[INFO] org/apache/cxf/common already added, skipping
[INFO] org/apache/cxf/common/commands already added, skipping
[INFO] org/apache/cxf/common/util already added, skipping
[INFO] org/apache/cxf/common/injection already added, skipping
[INFO] org/apache/cxf/common/annotation already added, skipping
[INFO] org/apache/cxf/common/security already added, skipping
[INFO] org/apache/cxf/common/classloader already added, skipping
[INFO] org/apache/cxf/common/logging already added, skipping
[INFO] org/apache/cxf/common/i18n already added, skipping
[INFO] org/apache/cxf/common/xmlschema already added, skipping
[INFO] org/apache/cxf/configuration already added, skipping
[INFO] org/apache/cxf/configuration/spring already added, skipping
[INFO] org/apache/cxf/staxutils already added, skipping
[INFO] org/apache/cxf/staxutils/transform already added, skipping
[INFO] org/apache/cxf/management already added, skipping
[INFO] org/apache/cxf/management/annotation already added, skipping
[INFO] org/apache/cxf/jaxb already added, skipping
[INFO] org/apache/cxf/resource already added, skipping
[INFO] org/apache/cxf/version already added, skipping
[INFO] org/apache/cxf/helpers already added, skipping
[INFO] org/apache/cxf/common/commands/Message.properties already added, skipping
[INFO] org/apache/cxf/common/util/Messages.properties already added, skipping
[INFO] org/apache/cxf/common/injection/Messages.properties already added, skipping
[INFO] org/apache/cxf/common/annotation/Messages.properties already added, skipping
[INFO] org/apache/cxf/common/xmlschema/Messages.properties already added, skipping
[INFO] org/apache/cxf/jaxb/CommonUtilityMessages.properties already added, skipping
[INFO] org/apache/cxf/resource/Messages.properties already added, skipping
[INFO] org/apache/cxf/helpers/Messages.properties already added, skipping
[INFO] META-INF already added, skipping
[INFO] org already added, skipping
[INFO] org/apache already added, skipping
[INFO] org/apache/cxf already added, skipping
[INFO] org/apache/cxf/version already added, skipping
[INFO] META-INF already added, skipping
[INFO] META-INF/LICENSE already added, skipping
[INFO] META-INF/NOTICE already added, skipping
[INFO] META-INF/DEPENDENCIES already added, skipping
[INFO] [javadoc:jar {execution: attach-javadocs}]
[INFO] 
45 warnings
[WARNING] Javadoc Warnings
[WARNING] <https://builds.apache.org/job/CXF-2.5-deploy/ws/cxf-2.5.x-fixes/common/common/src/main/java/org/apache/cxf/common/util/ReflectionUtil.java>:280:
warning - @return tag has no arguments.
[WARNING] <https://builds.apache.org/job/CXF-2.5-deploy/ws/cxf-2.5.x-fixes/common/common/src/main/java/org/apache/cxf/common/util/ReflectionUtil.java>:189:
warning - @return tag has no arguments.
[WARNING] <https://builds.apache.org/job/CXF-2.5-deploy/ws/cxf-2.5.x-fixes/common/common/src/main/java/org/apache/cxf/common/util/SystemPropertyAction.java>:74:
warning - @return tag has no arguments.
[WARNING] <https://builds.apache.org/job/CXF-2.5-deploy/ws/cxf-2.5.x-fixes/common/common/src/main/java/org/apache/cxf/common/util/UrlUtils.java>:68:
warning - @return tag has no arguments.
[WARNING] <https://builds.apache.org/job/CXF-2.5-deploy/ws/cxf-2.5.x-fixes/common/common/src/main/java/org/apache/cxf/common/util/UrlUtils.java>:49:
warning - @return tag has no arguments.
[WARNING] <https://builds.apache.org/job/CXF-2.5-deploy/ws/cxf-2.5.x-fixes/common/common/src/main/java/org/apache/cxf/common/classloader/FireWallClassLoader.java>:72:
warning - Tag @link: reference not found: JDKFireWallClassLoaderFactory
[WARNING] <https://builds.apache.org/job/CXF-2.5-deploy/ws/cxf-2.5.x-fixes/common/common/src/main/java/org/apache/cxf/common/logging/LogUtils.java>:172:
warning - @param argument "name" is not a parameter name.
[WARNING] <https://builds.apache.org/job/CXF-2.5-deploy/ws/cxf-2.5.x-fixes/common/common/src/main/java/org/apache/cxf/common/logging/LogUtils.java>:184:
warning - @param argument "name" is not a parameter name.
[WARNING] <https://builds.apache.org/job/CXF-2.5-deploy/ws/cxf-2.5.x-fixes/common/common/src/main/java/org/apache/cxf/common/logging/LogUtils.java>:207:
warning - @param argument "name" is not a parameter name.
[WARNING] <https://builds.apache.org/job/CXF-2.5-deploy/ws/cxf-2.5.x-fixes/common/common/src/main/java/org/apache/cxf/common/logging/LogUtils.java>:219:
warning - @param argument "name" is not a parameter name.
[WARNING] <https://builds.apache.org/job/CXF-2.5-deploy/ws/cxf-2.5.x-fixes/common/common/src/main/java/org/apache/cxf/common/logging/Slf4jLogger.java>:50:
warning - Tag @link: reference not found: org.slf4j.bridge.SLF4JBridgeHandler
[WARNING] <https://builds.apache.org/job/CXF-2.5-deploy/ws/cxf-2.5.x-fixes/common/common/src/main/java/org/apache/cxf/common/xmlschema/XmlSchemaUtils.java>:140:
warning - @return tag has no arguments.
[WARNING] <https://builds.apache.org/job/CXF-2.5-deploy/ws/cxf-2.5.x-fixes/common/common/src/main/java/org/apache/cxf/common/xmlschema/XmlSchemaUtils.java>:229:
warning - @return tag has no arguments.
[WARNING] <https://builds.apache.org/job/CXF-2.5-deploy/ws/cxf-2.5.x-fixes/common/common/src/main/java/org/apache/cxf/common/xmlschema/XmlSchemaUtils.java>:363:
warning - @return tag has no arguments.
[WARNING] <https://builds.apache.org/job/CXF-2.5-deploy/ws/cxf-2.5.x-fixes/common/common/src/main/java/org/apache/cxf/common/xmlschema/XmlSchemaUtils.java>:380:
warning - @return tag has no arguments.
[WARNING] <https://builds.apache.org/job/CXF-2.5-deploy/ws/cxf-2.5.x-fixes/common/common/src/main/java/org/apache/cxf/common/xmlschema/XmlSchemaUtils.java>:430:
warning - @return tag has no arguments.
[WARNING] <https://builds.apache.org/job/CXF-2.5-deploy/ws/cxf-2.5.x-fixes/common/common/src/main/java/org/apache/cxf/common/xmlschema/XmlSchemaUtils.java>:453:
warning - @return tag has no arguments.
[WARNING] <https://builds.apache.org/job/CXF-2.5-deploy/ws/cxf-2.5.x-fixes/common/common/src/main/java/org/apache/cxf/common/xmlschema/XmlSchemaUtils.java>:158:
warning - @return tag has no arguments.
[WARNING] <https://builds.apache.org/job/CXF-2.5-deploy/ws/cxf-2.5.x-fixes/common/common/src/main/java/org/apache/cxf/common/xmlschema/XmlSchemaUtils.java>:570:
warning - @param argument "elementSchema" is not a parameter name.
[WARNING] <https://builds.apache.org/job/CXF-2.5-deploy/ws/cxf-2.5.x-fixes/common/common/src/main/java/org/apache/cxf/staxutils/AbstractDOMStreamReader.java>:39:
warning - Tag @see: reference not found: ElementAdapter }
[WARNING] <https://builds.apache.org/job/CXF-2.5-deploy/ws/cxf-2.5.x-fixes/common/common/src/main/java/org/apache/cxf/staxutils/AbstractDOMStreamReader.java>:107:
warning - @param argument "element" is not a parameter name.
[WARNING] <https://builds.apache.org/job/CXF-2.5-deploy/ws/cxf-2.5.x-fixes/common/common/src/main/java/org/apache/cxf/staxutils/FragmentStreamReader.java>:134:
warning - @param argument "advanceAtEnd" is not a parameter name.
[WARNING] <https://builds.apache.org/job/CXF-2.5-deploy/ws/cxf-2.5.x-fixes/common/common/src/main/java/org/apache/cxf/staxutils/StaxUtils.java>:233:
warning - @return tag has no arguments.
[WARNING] <https://builds.apache.org/job/CXF-2.5-deploy/ws/cxf-2.5.x-fixes/common/common/src/main/java/org/apache/cxf/staxutils/StaxUtils.java>:1272:
warning - @return tag has no arguments.
[WARNING] <https://builds.apache.org/job/CXF-2.5-deploy/ws/cxf-2.5.x-fixes/common/common/src/main/java/org/apache/cxf/staxutils/StaxUtils.java>:1253:
warning - @return tag has no arguments.
[WARNING] <https://builds.apache.org/job/CXF-2.5-deploy/ws/cxf-2.5.x-fixes/common/common/src/main/java/org/apache/cxf/staxutils/StaxUtils.java>:1367:
warning - @return tag has no arguments.
[WARNING] <https://builds.apache.org/job/CXF-2.5-deploy/ws/cxf-2.5.x-fixes/common/common/src/main/java/org/apache/cxf/staxutils/StaxUtils.java>:1253:
warning - @param argument "ctx" is not a parameter name.
[WARNING] <https://builds.apache.org/job/CXF-2.5-deploy/ws/cxf-2.5.x-fixes/common/common/src/main/java/org/apache/cxf/staxutils/StaxUtils.java>:1417:
warning - @param argument "nsUri" is not a parameter name.
[WARNING] <https://builds.apache.org/job/CXF-2.5-deploy/ws/cxf-2.5.x-fixes/common/common/src/main/java/org/apache/cxf/staxutils/W3CDOMStreamReader.java>:87:
warning - @return tag has no arguments.
[WARNING] <https://builds.apache.org/job/CXF-2.5-deploy/ws/cxf-2.5.x-fixes/common/common/src/main/java/org/apache/cxf/jaxb/JAXBUtils.java>:209:
warning - @param argument "namespaceURI" is not a parameter name.
[WARNING] <https://builds.apache.org/job/CXF-2.5-deploy/ws/cxf-2.5.x-fixes/common/common/src/main/java/org/apache/cxf/resource/ResourceResolver.java>:49:
warning - @param argument "resourceName" is not a parameter name.
[WARNING] <https://builds.apache.org/job/CXF-2.5-deploy/ws/cxf-2.5.x-fixes/common/common/src/main/java/org/apache/cxf/helpers/DOMUtils.java>:97:
warning - @return tag has no arguments.
[WARNING] <https://builds.apache.org/job/CXF-2.5-deploy/ws/cxf-2.5.x-fixes/common/common/src/main/java/org/apache/cxf/helpers/DOMUtils.java>:381:
warning - @return tag has no arguments.
[WARNING] <https://builds.apache.org/job/CXF-2.5-deploy/ws/cxf-2.5.x-fixes/common/common/src/main/java/org/apache/cxf/helpers/DOMUtils.java>:339:
warning - @return tag has no arguments.
[WARNING] <https://builds.apache.org/job/CXF-2.5-deploy/ws/cxf-2.5.x-fixes/common/common/src/main/java/org/apache/cxf/helpers/DOMUtils.java>:304:
warning - @return tag has no arguments.
[WARNING] <https://builds.apache.org/job/CXF-2.5-deploy/ws/cxf-2.5.x-fixes/common/common/src/main/java/org/apache/cxf/helpers/DOMUtils.java>:318:
warning - @return tag has no arguments.
[WARNING] <https://builds.apache.org/job/CXF-2.5-deploy/ws/cxf-2.5.x-fixes/common/common/src/main/java/org/apache/cxf/helpers/IOUtils.java>:227:
warning - @return tag has no arguments.
[WARNING] <https://builds.apache.org/job/CXF-2.5-deploy/ws/cxf-2.5.x-fixes/common/common/src/main/java/org/apache/cxf/helpers/IOUtils.java>:65:
warning - @return tag has no arguments.
[WARNING] <https://builds.apache.org/job/CXF-2.5-deploy/ws/cxf-2.5.x-fixes/common/common/src/main/java/org/apache/cxf/helpers/IOUtils.java>:97:
warning - @return tag has no arguments.
[WARNING] <https://builds.apache.org/job/CXF-2.5-deploy/ws/cxf-2.5.x-fixes/common/common/src/main/java/org/apache/cxf/helpers/IOUtils.java>:48:
warning - @return tag has no arguments.
[WARNING] <https://builds.apache.org/job/CXF-2.5-deploy/ws/cxf-2.5.x-fixes/common/common/src/main/java/org/apache/cxf/helpers/IOUtils.java>:78:
warning - @return tag has no arguments.
[WARNING] <https://builds.apache.org/job/CXF-2.5-deploy/ws/cxf-2.5.x-fixes/common/common/src/main/java/org/apache/cxf/helpers/NSStack.java>:61:
warning - @param argument "URI" is not a parameter name.
[WARNING] <https://builds.apache.org/job/CXF-2.5-deploy/ws/cxf-2.5.x-fixes/common/common/src/main/java/org/apache/cxf/helpers/NSStack.java>:76:
warning - @param argument "URI" is not a parameter name.
[WARNING] <https://builds.apache.org/job/CXF-2.5-deploy/ws/cxf-2.5.x-fixes/common/common/src/main/java/org/apache/cxf/helpers/NSStack.java>:95:
warning - @param argument "URI" is not a parameter name.
[WARNING] <https://builds.apache.org/job/CXF-2.5-deploy/ws/cxf-2.5.x-fixes/common/common/src/main/java/org/apache/cxf/helpers/ServiceUtils.java>:132:
warning - @return tag has no arguments.
[INFO] Building jar: <https://builds.apache.org/job/CXF-2.5-deploy/ws/cxf-2.5.x-fixes/common/common/target/cxf-common-utilities-2.5.8-SNAPSHOT-javadoc.jar>
[INFO] [install:install {execution: default-install}]
[INFO] Installing <https://builds.apache.org/job/CXF-2.5-deploy/ws/cxf-2.5.x-fixes/common/common/target/cxf-common-utilities-2.5.8-SNAPSHOT.jar>
to <https://builds.apache.org/job/CXF-2.5-deploy/ws/.repository/org/apache/cxf/cxf-common-utilities/2.5.8-SNAPSHOT/cxf-common-utilities-2.5.8-SNAPSHOT.jar>
[INFO] Installing <https://builds.apache.org/job/CXF-2.5-deploy/ws/cxf-2.5.x-fixes/common/common/target/cxf-common-utilities-2.5.8-SNAPSHOT-sources.jar>
to <https://builds.apache.org/job/CXF-2.5-deploy/ws/.repository/org/apache/cxf/cxf-common-utilities/2.5.8-SNAPSHOT/cxf-common-utilities-2.5.8-SNAPSHOT-sources.jar>
[INFO] Installing <https://builds.apache.org/job/CXF-2.5-deploy/ws/cxf-2.5.x-fixes/common/common/target/cxf-common-utilities-2.5.8-SNAPSHOT-javadoc.jar>
to <https://builds.apache.org/job/CXF-2.5-deploy/ws/.repository/org/apache/cxf/cxf-common-utilities/2.5.8-SNAPSHOT/cxf-common-utilities-2.5.8-SNAPSHOT-javadoc.jar>
[INFO] [deploy:deploy {execution: default-deploy}]
[INFO] Retrieving previous build number from apache.snapshots.https
[WARNING] *** CHECKSUM FAILED - Checksum failed on download: local = '1d02e56a0f1459a48ce408abbe6e7e79ca7a2bc5';
remote = '1975c7d3f8e37d22f0afdcd78772c6227b3c7a7f' - RETRYING
[WARNING] *** CHECKSUM FAILED - Checksum failed on download: local = '1d02e56a0f1459a48ce408abbe6e7e79ca7a2bc5';
remote = '1975c7d3f8e37d22f0afdcd78772c6227b3c7a7f' - IGNORING
Uploading: https://repository.apache.org/content/repositories/snapshots/org/apache/cxf/cxf-common-utilities/2.5.8-SNAPSHOT/cxf-common-utilities-2.5.8-20130104.062219-14.jar
352K uploaded  (cxf-common-utilities-2.5.8-20130104.062219-14.jar)
[INFO] Uploading project information for cxf-common-utilities 2.5.8-20130104.062219-14
[INFO] Retrieving previous metadata from apache.snapshots.https
[WARNING] *** CHECKSUM FAILED - Checksum failed on download: local = '1d02e56a0f1459a48ce408abbe6e7e79ca7a2bc5';
remote = '1975c7d3f8e37d22f0afdcd78772c6227b3c7a7f' - RETRYING
[WARNING] *** CHECKSUM FAILED - Checksum failed on download: local = '1d02e56a0f1459a48ce408abbe6e7e79ca7a2bc5';
remote = '1975c7d3f8e37d22f0afdcd78772c6227b3c7a7f' - IGNORING
[INFO] Uploading repository metadata for: 'snapshot org.apache.cxf:cxf-common-utilities:2.5.8-SNAPSHOT'
[INFO] Retrieving previous metadata from apache.snapshots.https
[INFO] Uploading repository metadata for: 'artifact org.apache.cxf:cxf-common-utilities'
[INFO] Retrieving previous build number from apache.snapshots.https
Uploading: https://repository.apache.org/content/repositories/snapshots/org/apache/cxf/cxf-common-utilities/2.5.8-SNAPSHOT/cxf-common-utilities-2.5.8-20130104.062219-14-sources.jar
262K uploaded  (cxf-common-utilities-2.5.8-20130104.062219-14-sources.jar)
[INFO] Retrieving previous build number from apache.snapshots.https
Uploading: https://repository.apache.org/content/repositories/snapshots/org/apache/cxf/cxf-common-utilities/2.5.8-SNAPSHOT/cxf-common-utilities-2.5.8-20130104.062219-14-javadoc.jar
900K uploaded  (cxf-common-utilities-2.5.8-20130104.062219-14-javadoc.jar)
[INFO] ------------------------------------------------------------------------
[INFO] Building Apache CXF API
[INFO]    task-segment: [deploy]
[INFO] ------------------------------------------------------------------------
[INFO] [buildnumber:create-timestamp {execution: create-noncanonicalrev}]
[INFO] ------------------------------------------------------------------------
[ERROR] BUILD ERROR
[INFO] ------------------------------------------------------------------------
[INFO] Error configuring: org.codehaus.mojo:buildnumber-maven-plugin. Reason: ERROR: Cannot
override read-only parameter: urlScm in goal: buildnumber:create
[INFO] ------------------------------------------------------------------------
[INFO] For more information, run Maven with the -e switch
[INFO] ------------------------------------------------------------------------
[INFO] Total time: 35 seconds
[INFO] Finished at: Fri Jan 04 06:22:40 UTC 2013
[INFO] Final Memory: 91M/155M
[INFO] ------------------------------------------------------------------------
Build step 'Invoke top-level Maven targets' marked build as failure
[locks-and-latches] Releasing all the locks
[locks-and-latches] All the locks released

Mime
View raw message