cxf-notifications mailing list archives

Site index · List index
Message view « Date » · « Thread »
Top « Date » · « Thread »
From Apache Jenkins Server <jenk...@builds.apache.org>
Subject Build failed in Jenkins: CXF-DOSGi-deploy #343
Date Thu, 17 Jan 2013 06:48:10 GMT
See <https://builds.apache.org/job/CXF-DOSGi-deploy/343/changes>

Changes:

[cschneider] Fix for NPE when running in Equinox

[cschneider] DOSGI-145 Small refactor to avoid creating a custom CXFServlet

------------------------------------------
Started by an SCM change
Building remotely on solaris1 in workspace <https://builds.apache.org/job/CXF-DOSGi-deploy/ws/>
Updating http://svn.apache.org/repos/asf/cxf/dosgi/trunk
U         dsw/cxf-topology-manager/src/main/java/org/apache/cxf/dosgi/topologymanager/importer/EndpointListenerManager.java
U         dsw/cxf-dsw/src/main/java/org/apache/cxf/dosgi/dsw/handlers/HttpServiceManager.java
At revision 1434564
Parsing POMs
Modules changed, recalculating dependency graph
[trunk] $ /home/hudson/tools/java/latest1.6/bin/java -da -dsa -XX:MaxPermSize=192m -Xmx512M
-cp /export/home/hudson/hudson-slave/maven-agent.jar:/export/home/hudson/hudson-slave/classworlds.jar
hudson.maven.agent.Main /home/hudson/tools/maven/apache-maven-2.2.1 /zonestorage/hudson_solaris/home/hudson/hudson-slave/slave.jar
/export/home/hudson/hudson-slave/maven-interceptor.jar 47051 /export/home/hudson/hudson-slave/maven2.1-interceptor.jar
channel started
<===[JENKINS REMOTING CAPACITY]===>   log4j:WARN No appenders could be found for logger
(org.apache.commons.beanutils.converters.BooleanConverter).
log4j:WARN Please initialize the log4j system properly.
Executing Maven:  -B -f <https://builds.apache.org/job/CXF-DOSGi-deploy/ws/trunk/pom.xml>
-Dmaven.repo.local=<https://builds.apache.org/job/CXF-DOSGi-deploy/ws/.repository> -U
-B -e clean deploy -Pdeploy,everything,nochecks -Dmaven.test.skip.exec=true+ Error stacktraces
are turned on.

[INFO] Scanning for projects...
[INFO] ------------------------------------------------------------------------
[ERROR] BUILD FAILURE
[INFO] ------------------------------------------------------------------------
[INFO] Unable to build project '<https://builds.apache.org/job/CXF-DOSGi-deploy/ws/trunk/pom.xml;>
it requires Maven version 3.0
[INFO] ------------------------------------------------------------------------
[INFO] Trace
org.apache.maven.BuildFailureException: Unable to build project '<https://builds.apache.org/job/CXF-DOSGi-deploy/ws/trunk/pom.xml;>
it requires Maven version 3.0
	at org.apache.maven.DefaultMaven.collectProjects(DefaultMaven.java:499)
	at org.apache.maven.DefaultMaven.getProjects(DefaultMaven.java:391)
	at org.apache.maven.DefaultMaven.doExecute(DefaultMaven.java:272)
	at org.apache.maven.DefaultMaven.execute(DefaultMaven.java:138)
	at org.apache.maven.cli.MavenCli.main(MavenCli.java:362)
	at sun.reflect.NativeMethodAccessorImpl.invoke0(Native Method)
	at sun.reflect.NativeMethodAccessorImpl.invoke(NativeMethodAccessorImpl.java:39)
	at sun.reflect.DelegatingMethodAccessorImpl.invoke(DelegatingMethodAccessorImpl.java:25)
	at java.lang.reflect.Method.invoke(Method.java:597)
	at org.codehaus.classworlds.Launcher.launchEnhanced(Launcher.java:315)
	at org.codehaus.classworlds.Launcher.launch(Launcher.java:255)
	at hudson.maven.agent.Main.launch(Main.java:185)
	at hudson.maven.MavenBuilder.call(MavenBuilder.java:153)
	at hudson.maven.Maven2Builder.call(Maven2Builder.java:79)
	at hudson.maven.Maven2Builder.call(Maven2Builder.java:55)
	at hudson.remoting.UserRequest.perform(UserRequest.java:118)
	at hudson.remoting.UserRequest.perform(UserRequest.java:48)
	at hudson.remoting.Request$2.run(Request.java:326)
	at hudson.remoting.InterceptingExecutorService$1.call(InterceptingExecutorService.java:72)
	at java.util.concurrent.FutureTask$Sync.innerRun(FutureTask.java:303)
	at java.util.concurrent.FutureTask.run(FutureTask.java:138)
	at java.util.concurrent.ThreadPoolExecutor$Worker.runTask(ThreadPoolExecutor.java:886)
	at java.util.concurrent.ThreadPoolExecutor$Worker.run(ThreadPoolExecutor.java:908)
	at java.lang.Thread.run(Thread.java:662)
[INFO] ------------------------------------------------------------------------
[INFO] Total time: < 1 second
[INFO] Finished at: Thu Jan 17 06:49:15 GMT+00:00 2013
[INFO] Final Memory: 2M/63M
[INFO] ------------------------------------------------------------------------
channel stopped

Mime
View raw message