cxf-notifications mailing list archives

Site index · List index
Message view « Date » · « Thread »
Top « Date » · « Thread »
From Apache Jenkins Server <jenk...@builds.apache.org>
Subject Build failed in Jenkins: CXF-2.5-deploy #197
Date Fri, 09 Nov 2012 07:35:08 GMT
See <https://builds.apache.org/job/CXF-2.5-deploy/197/changes>

Changes:

[dkulp] Blocking revisions 1405646,1405853,1405869,1406116,1406123,1406127,1407121,1407124,1407125
via  git from
https://svn.apache.org/repos/asf/cxf/branches/2.6.x-fixes

[dkulp] Recording revisions 1404874,1407122,1407123 via  git from
https://svn.apache.org/repos/asf/cxf/branches/2.6.x-fixes

[dkulp] Merged revisions 1407123 via  git cherry-pick from
https://svn.apache.org/repos/asf/cxf/branches/2.6.x-fixes

........
  r1407123 | dkulp | 2012-11-08 10:21:24 -0500 (Thu, 08 Nov 2012) | 11 lines

  Merged revisions 1406847 via  git cherry-pick from
  https://svn.apache.org/repos/asf/cxf/trunk

  ........
    r1406847 | dkulp | 2012-11-07 17:26:51 -0500 (Wed, 07 Nov 2012) | 3 lines

    [CXF-4618] CLose input stream after done copying
    Patch from Steve Hodecker applied

  ........

........

[dkulp] Merged revisions 1407122 via  git cherry-pick from
https://svn.apache.org/repos/asf/cxf/branches/2.6.x-fixes

........
  r1407122 | dkulp | 2012-11-08 10:21:20 -0500 (Thu, 08 Nov 2012) | 10 lines

  Merged revisions 1406710 via  git cherry-pick from
  https://svn.apache.org/repos/asf/cxf/trunk

  ........
    r1406710 | asoldano | 2012-11-07 11:34:55 -0500 (Wed, 07 Nov 2012) | 2 lines

    Fix regression cause by commit 1404620 causing Log4J logger not being used

  ........

........

[ffang] Merged revisions 1406962 via svnmerge from 
https://svn.apache.org/repos/asf/cxf/branches/2.6.x-fixes

................
  r1406962 | ffang | 2012-11-08 16:58:19 +0800 (四, 08 11 2012) | 9 lines
  
  Merged revisions 1406958 via svnmerge from 
  https://svn.apache.org/repos/asf/cxf/trunk
  
  ........
    r1406958 | ffang | 2012-11-08 16:48:30 +0800 (四, 08 11 2012) | 1 line
    
    [CXF-4620]Exception at compilation when a 'space' character is present in maven local
repository path
  ........
................

------------------------------------------
[...truncated 22231 lines...]
[INFO] javax.xml.bind:jaxb-api:2.2.5:jar already exists in <https://builds.apache.org/job/CXF-2.5-deploy/ws/cxf-2.5.x-fixes/distribution/target/libs/endorsed>
[INFO] org.apache.geronimo.specs:geronimo-jaxws_2.2_spec:1.1:jar already exists in <https://builds.apache.org/job/CXF-2.5-deploy/ws/cxf-2.5.x-fixes/distribution/target/libs/endorsed>
[WARNING] DEPRECATED [tasks]: Use target instead
[INFO] [antrun:run {execution: process-sources-xsl}]
[WARNING] Parameter tasks is deprecated, use target instead
[INFO] Executing tasks

main:
[INFO] Executed tasks
[WARNING] The parameter expression: 'project.build.resources' used in mojo: 'process' has
been deprecated. Use 'project.resources' instead.
[INFO] [remote-resources:process {execution: default}]
[INFO] [site:attach-descriptor {execution: default-attach-descriptor}]
[INFO] [source:jar-no-fork {execution: attach-sources}]
[INFO] [javadoc:jar {execution: attach-javadocs}]
[INFO] Not executing Javadoc as the project is not a Java classpath-capable package
[INFO] [dependency:unpack {execution: unpack-javadoc}]
[INFO] Configured Artifact: org.apache.cxf:cxf-api:javadoc:2.5.7-SNAPSHOT:jar
[INFO] Unpacking <https://builds.apache.org/job/CXF-2.5-deploy/ws/.repository/org/apache/cxf/cxf-api/2.5.7-SNAPSHOT/cxf-api-2.5.7-SNAPSHOT-javadoc.jar>
to <https://builds.apache.org/job/CXF-2.5-deploy/ws/cxf-2.5.x-fixes/distribution/target/javadoc>
with includes "" and excludes ""
[INFO] [assembly:single {execution: distribution-package-bin}]
[INFO] Reading assembly descriptor: src/main/assembly/bin.xml
[WARNING] Cannot include project artifact: org.apache.cxf:apache-cxf:pom:2.5.7-SNAPSHOT; it
doesn't have an associated file or directory.
[WARNING] Cannot include project artifact: org.apache.cxf:apache-cxf:pom:2.5.7-SNAPSHOT; it
doesn't have an associated file or directory.
[WARNING] Cannot include project artifact: org.apache.cxf:apache-cxf:pom:2.5.7-SNAPSHOT; it
doesn't have an associated file or directory.
[INFO] Copying files to <https://builds.apache.org/job/CXF-2.5-deploy/ws/cxf-2.5.x-fixes/distribution/target/apache-cxf-2.5.7-SNAPSHOT>
[WARNING] Assembly file: <https://builds.apache.org/job/CXF-2.5-deploy/ws/cxf-2.5.x-fixes/distribution/target/apache-cxf-2.5.7-SNAPSHOT>
is not a regular file (it may be a directory). It cannot be attached to the project build
for installation or deployment.
[WARNING] Cannot include project artifact: org.apache.cxf:apache-cxf:pom:2.5.7-SNAPSHOT; it
doesn't have an associated file or directory.
[WARNING] Cannot include project artifact: org.apache.cxf:apache-cxf:pom:2.5.7-SNAPSHOT; it
doesn't have an associated file or directory.
[WARNING] Cannot include project artifact: org.apache.cxf:apache-cxf:pom:2.5.7-SNAPSHOT; it
doesn't have an associated file or directory.
[INFO] Building tar: <https://builds.apache.org/job/CXF-2.5-deploy/ws/cxf-2.5.x-fixes/distribution/target/apache-cxf-2.5.7-SNAPSHOT.tar.gz>
[WARNING] Cannot include project artifact: org.apache.cxf:apache-cxf:pom:2.5.7-SNAPSHOT; it
doesn't have an associated file or directory.
[WARNING] Cannot include project artifact: org.apache.cxf:apache-cxf:pom:2.5.7-SNAPSHOT; it
doesn't have an associated file or directory.
[WARNING] Cannot include project artifact: org.apache.cxf:apache-cxf:pom:2.5.7-SNAPSHOT; it
doesn't have an associated file or directory.
[INFO] Building zip: <https://builds.apache.org/job/CXF-2.5-deploy/ws/cxf-2.5.x-fixes/distribution/target/apache-cxf-2.5.7-SNAPSHOT.zip>
[INFO] [assembly:single {execution: distribution-package-src}]
[INFO] Reading assembly descriptor: src/main/assembly/src.xml
[INFO] Building tar: <https://builds.apache.org/job/CXF-2.5-deploy/ws/cxf-2.5.x-fixes/distribution/target/apache-cxf-2.5.7-SNAPSHOT-src.tar.gz>
[INFO] Building zip: <https://builds.apache.org/job/CXF-2.5-deploy/ws/cxf-2.5.x-fixes/distribution/target/apache-cxf-2.5.7-SNAPSHOT-src.zip>
[INFO] [install:install {execution: default-install}]
[INFO] Installing <https://builds.apache.org/job/CXF-2.5-deploy/ws/cxf-2.5.x-fixes/distribution/pom.xml>
to <https://builds.apache.org/job/CXF-2.5-deploy/ws/.repository/org/apache/cxf/apache-cxf/2.5.7-SNAPSHOT/apache-cxf-2.5.7-SNAPSHOT.pom>
[INFO] Installing <https://builds.apache.org/job/CXF-2.5-deploy/ws/cxf-2.5.x-fixes/distribution/target/apache-cxf-2.5.7-SNAPSHOT.tar.gz>
to <https://builds.apache.org/job/CXF-2.5-deploy/ws/.repository/org/apache/cxf/apache-cxf/2.5.7-SNAPSHOT/apache-cxf-2.5.7-SNAPSHOT.tar.gz>
[INFO] Installing <https://builds.apache.org/job/CXF-2.5-deploy/ws/cxf-2.5.x-fixes/distribution/target/apache-cxf-2.5.7-SNAPSHOT.zip>
to <https://builds.apache.org/job/CXF-2.5-deploy/ws/.repository/org/apache/cxf/apache-cxf/2.5.7-SNAPSHOT/apache-cxf-2.5.7-SNAPSHOT.zip>
[INFO] Installing <https://builds.apache.org/job/CXF-2.5-deploy/ws/cxf-2.5.x-fixes/distribution/target/apache-cxf-2.5.7-SNAPSHOT-src.tar.gz>
to <https://builds.apache.org/job/CXF-2.5-deploy/ws/.repository/org/apache/cxf/apache-cxf/2.5.7-SNAPSHOT/apache-cxf-2.5.7-SNAPSHOT-src.tar.gz>
[INFO] Installing <https://builds.apache.org/job/CXF-2.5-deploy/ws/cxf-2.5.x-fixes/distribution/target/apache-cxf-2.5.7-SNAPSHOT-src.zip>
to <https://builds.apache.org/job/CXF-2.5-deploy/ws/.repository/org/apache/cxf/apache-cxf/2.5.7-SNAPSHOT/apache-cxf-2.5.7-SNAPSHOT-src.zip>
[INFO] [deploy:deploy {execution: default-deploy}]
[INFO] Retrieving previous build number from apache.snapshots.https
[WARNING] *** CHECKSUM FAILED - Checksum failed on download: local = 'f8b7d5a22705b91a9aa239a731be6cf8117bd414';
remote = '4980673dc65dd8145417e9f08127ca695bab1c05' - RETRYING
[WARNING] *** CHECKSUM FAILED - Checksum failed on download: local = 'f8b7d5a22705b91a9aa239a731be6cf8117bd414';
remote = '4980673dc65dd8145417e9f08127ca695bab1c05' - IGNORING
Uploading: https://repository.apache.org/content/repositories/snapshots/org/apache/cxf/apache-cxf/2.5.7-SNAPSHOT/apache-cxf-2.5.7-20121109.070515-16.pom
21K uploaded  (apache-cxf-2.5.7-20121109.070515-16.pom)
[INFO] Retrieving previous metadata from apache.snapshots.https
[WARNING] *** CHECKSUM FAILED - Checksum failed on download: local = 'f8b7d5a22705b91a9aa239a731be6cf8117bd414';
remote = '4980673dc65dd8145417e9f08127ca695bab1c05' - RETRYING
[WARNING] *** CHECKSUM FAILED - Checksum failed on download: local = 'f8b7d5a22705b91a9aa239a731be6cf8117bd414';
remote = '4980673dc65dd8145417e9f08127ca695bab1c05' - IGNORING
[INFO] Uploading repository metadata for: 'snapshot org.apache.cxf:apache-cxf:2.5.7-SNAPSHOT'
[INFO] Retrieving previous metadata from apache.snapshots.https
[INFO] Uploading repository metadata for: 'artifact org.apache.cxf:apache-cxf'
[INFO] Retrieving previous build number from apache.snapshots.https
Uploading: https://repository.apache.org/content/repositories/snapshots/org/apache/cxf/apache-cxf/2.5.7-SNAPSHOT/apache-cxf-2.5.7-20121109.070515-16.tar.gz
34911K uploaded  (apache-cxf-2.5.7-20121109.070515-16.tar.gz)
[INFO] Retrieving previous build number from apache.snapshots.https
Uploading: https://repository.apache.org/content/repositories/snapshots/org/apache/cxf/apache-cxf/2.5.7-SNAPSHOT/apache-cxf-2.5.7-20121109.070515-16.zip
36709K uploaded  (apache-cxf-2.5.7-20121109.070515-16.zip)
[INFO] Retrieving previous build number from apache.snapshots.https
Uploading: https://repository.apache.org/content/repositories/snapshots/org/apache/cxf/apache-cxf/2.5.7-SNAPSHOT/apache-cxf-2.5.7-20121109.070515-16-src.tar.gz
6388K uploaded  (apache-cxf-2.5.7-20121109.070515-16-src.tar.gz)
[INFO] Retrieving previous build number from apache.snapshots.https
Uploading: https://repository.apache.org/content/repositories/snapshots/org/apache/cxf/apache-cxf/2.5.7-SNAPSHOT/apache-cxf-2.5.7-20121109.070515-16-src.zip
14211K uploaded  (apache-cxf-2.5.7-20121109.070515-16-src.zip)
[INFO] 
[INFO] 
[INFO] ------------------------------------------------------------------------
[INFO] Reactor Summary:
[INFO] ------------------------------------------------------------------------
[INFO] Apache CXF ............................................ SUCCESS [13.283s]
[INFO] Apache CXF Parent ..................................... SUCCESS [3.493s]
[INFO] Apache CXF Common Utilities ........................... SUCCESS [13.950s]
[INFO] Apache CXF API ........................................ SUCCESS [25.436s]
[INFO] Apache CXF Woodstox/MSV Schema Validation ............. SUCCESS [6.555s]
[INFO] Apache CXF XML Schema Validation with Xerces .......... SUCCESS [5.358s]
[INFO] Apache CXF Common ..................................... SUCCESS [1.805s]
[INFO] Apache CXF Runtime Core ............................... SUCCESS [13.685s]
[INFO] Apache CXF Command Line Tools Common .................. SUCCESS [8.916s]
[INFO] Apache CXF Command Line Tools Validator ............... SUCCESS [6.225s]
[INFO] Apache CXF Command Line Tools WSDLTo Core ............. SUCCESS [6.883s]
[INFO] Apache CXF Command Line Tools WSDLTo JAXWS Frontend ... SUCCESS [7.484s]
[INFO] Apache CXF Runtime JAXB DataBinding ................... SUCCESS [6.927s]
[INFO] Apache CXF Runtime SOAP Binding ....................... SUCCESS [8.960s]
[INFO] Apache CXF Runtime JavaScript Client Generator Projects  SUCCESS [1.751s]
[INFO] Apache CXF Runtime JavaScript Client Generator ........ SUCCESS [6.469s]
[INFO] Apache CXF Command Line Tools WSDL to JavaScript Front End  SUCCESS [5.774s]
[INFO] Apache CXF Command Line Tools WSDLTo JAXB Databinding . SUCCESS [6.207s]
[INFO] Apache CXF Runtime Transport Common Used Classes ...... SUCCESS [5.488s]
[INFO] Apache CXF Maven Plugins .............................. SUCCESS [1.890s]
[INFO] Apache CXF WSDL Validator Maven2 Plugin ............... SUCCESS [8.116s]
[INFO] Apache CXF Code Generation Maven2 Plugins ............. SUCCESS [7.962s]
[INFO] Apache CXF Test Utilities ............................. SUCCESS [40.579s]
[INFO] Apache CXF Runtime Management ......................... SUCCESS [6.975s]
[INFO] Apache CXF Runtime JMS Transport ...................... SUCCESS [9.047s]
[INFO] Apache CXF Runtime XML Binding ........................ SUCCESS [6.734s]
[INFO] Apache CXF Runtime Local Transport .................... SUCCESS [5.619s]
[INFO] Apache CXF Runtime HTTP Transport ..................... SUCCESS [10.558s]
[INFO] Apache CXF Runtime HTTP Jetty Transport ............... SUCCESS [7.982s]
[INFO] Apache CXF Runtime Simple Frontend .................... SUCCESS [7.425s]
[INFO] Apache CXF Runtime WS Addressing ...................... SUCCESS [7.466s]
[INFO] Apache CXF Runtime JAX-WS Frontend .................... SUCCESS [13.583s]
[INFO] Apache CXF Runtime XmlBeans DataBinding ............... SUCCESS [7.662s]
[INFO] Apache CXF Command Line Tools WSDLTo Test ............. SUCCESS [3.769s]
[INFO] Apache CXF Command Line Tools WSDLTo Misctools ........ SUCCESS [6.663s]
[INFO] Apache CXF Command Line Tools ......................... SUCCESS [1.844s]
[INFO] Apache CXF Command Line Tools WSDLTo .................. SUCCESS [2.030s]
[INFO] Apache CXF Runtime Aegis Databinding .................. SUCCESS [16.044s]
[INFO] Apache CXF Command Line Tools JavaTo WS ............... SUCCESS [8.148s]
[INFO] Apache CXF Command Line Tools JavaTo .................. SUCCESS [2.950s]
[INFO] Apache CXF Runtime SDO DataBinding .................... SUCCESS [7.210s]
[INFO] Apache CXF Runtime JAX-RS Frontend .................... SUCCESS [14.806s]
[INFO] Apache CXF Command Line Tools WADLTo JAXRS Frontend ... SUCCESS [5.807s]
[INFO] Apache CXF Command Line Tools WADLTo .................. SUCCESS [2.135s]
[INFO] Apache CXF Runtime CORBA Binding ...................... SUCCESS [10.694s]
[INFO] Apache CXF Command Line Tools CORBA ................... SUCCESS [10.710s]
[INFO] Apache CXF Runtime JiBX DataBinding ................... SUCCESS [7.233s]
[INFO] Apache CXF Runtime HTTP Binding ....................... SUCCESS [6.568s]
[INFO] Apache CXF Runtime Object Binding ..................... SUCCESS [6.378s]
[INFO] Apache CXF Runtime Colocated Binding .................. SUCCESS [6.142s]
[INFO] Apache CXF Runtime .................................... SUCCESS [2.092s]
[INFO] Apache CXF Runtime Bindings ........................... SUCCESS [2.516s]
[INFO] Apache CXF Runtime JavaScript Frontend ................ SUCCESS [5.703s]
[INFO] Apache CXF Runtime WS Policy .......................... SUCCESS [10.019s]
[INFO] Apache CXF Runtime WS Reliable Messaging .............. SUCCESS [11.808s]
[INFO] Apache CXF Runtime WS MetadataExchange ................ SUCCESS [8.008s]
[INFO] Apache CXF Runtime WS Security ........................ SUCCESS [19.356s]
[INFO] Apache CXF RS XML Security ............................ SUCCESS [7.547s]
[INFO] Apache CXF Runtime RS Security OAuth Parent ........... SUCCESS [2.053s]
[INFO] Apache CXF Runtime OAuth 1.0a ......................... SUCCESS [6.851s]
[INFO] Apache CXF RS Cross-Origin Resource Sharing ........... SUCCESS [5.491s]
[INFO] Apache CXF Runtime Web Management ..................... SUCCESS [15.565s]
[INFO] Apache CXF Runtime JavaScript Client Generator Tests .. SUCCESS [3.864s]
[INFO] Apache CXF JCA Connection ............................. SUCCESS [8.285s]
[INFO] Apache CXF Integration ................................ SUCCESS [1.800s]
[INFO] Apache CXF Java2WS Maven2 Plugin ...................... SUCCESS [5.911s]
[INFO] Apache CXF WADL2Java Code Generation Maven2 Plugin .... SUCCESS [6.450s]
[INFO] Apache CXF CORBA Tools Maven2 Plugins ................. SUCCESS [5.888s]
[INFO] Apache CXF Archetype - Simple JAX-WS Java First ....... SUCCESS [4.070s]
[INFO] Apache CXF Archetype - Simple JAX-RS webapp ........... SUCCESS [3.174s]
[INFO] Apache CXF Maven Archetypes ........................... SUCCESS [1.727s]
[INFO] Apache CXF STS Core ................................... SUCCESS [10.348s]
[INFO] Apache CXF STS war deployment ......................... SUCCESS [10.994s]
[INFO] Apache CXF STS basic systests ......................... SUCCESS [7.099s]
[INFO] Apache CXF STS advanced systests ...................... SUCCESS [6.458s]
[INFO] Apache CXF Services ................................... SUCCESS [1.780s]
[INFO] Apache CXF STS service ................................ SUCCESS [1.728s]
[INFO] Apache CXF STS systests ............................... SUCCESS [1.851s]
[INFO] Apache CXF WSN API .................................... SUCCESS [11.503s]
[INFO] Apache CXF WSN Core ................................... SUCCESS [9.075s]
[INFO] Apache CXF WSN OSGi ................................... SUCCESS [8.602s]
[INFO] Apache CXF WSN service ................................ SUCCESS [1.755s]
[INFO] Apache CXF Karaf Parent ............................... SUCCESS [1.825s]
[INFO] Apache CXF Karaf Features ............................. SUCCESS [2.750s]
[INFO] Apache CXF Karaf Commands ............................. SUCCESS [5.980s]
[INFO] Apache CXF Bundle Parent .............................. SUCCESS [2.512s]
[INFO] Apache CXF Bundle Jar ................................. SUCCESS [4:54.131s]
[INFO] Apache CXF Minimal Bundle Jar ......................... SUCCESS [3:44.388s]
[INFO] Apache CXF JAX-RS Bundle Jar .......................... SUCCESS [1:55.469s]
[INFO] Apache CXF Container Integration System Tests ......... SUCCESS [1.787s]
[INFO] Apache CXF Container Integration Test Webapp .......... SUCCESS [7.663s]
[INFO] Apache CXF Uncategorized System Tests ................. SUCCESS [8.861s]
[INFO] Apache CXF Transport System Tests ..................... SUCCESS [8.020s]
[INFO] Apache CXF Transport System Tests JMS ................. SUCCESS [7.008s]
[INFO] Apache CXF JAX-WS System Tests ........................ SUCCESS [6.117s]
[INFO] Apache CXF Databinding System Tests ................... SUCCESS [8.323s]
[INFO] Apache CXF JAX-RS System Tests ........................ SUCCESS [15.406s]
[INFO] Apache CXF WS-* Specifications System Tests ........... SUCCESS [5.641s]
[INFO] Apache CXF WS-RM Specifications System Tests .......... SUCCESS [3.566s]
[INFO] Apache CXF WS-Security System Tests ................... SUCCESS [9.315s]
[INFO] Apache CXF WS-Security Interop System Tests ........... SUCCESS [8.027s]
[INFO] Apache CXF JAX-RS System Advanced Security Tests ...... SUCCESS [4.693s]
[INFO] Test for writing wsdl to repo ......................... SUCCESS [9.203s]
[INFO] Test for generating code from wsdl in repo ............ SUCCESS [26.088s]
[INFO] Apache CXF System Tests ............................... SUCCESS [1.851s]
[INFO] Apache CXF System Tests for Maven Plugins ............. SUCCESS [2.032s]
[INFO] Apache CXF Manifest Jar ............................... SUCCESS [4.312s]
[INFO] Apache CXF Samples .................................... SUCCESS [0.972s]
[INFO] Colocated Demo using Document/Literal Style ........... SUCCESS [1.942s]
[INFO] JavaScript Client Demo using Document/Literal Style ... SUCCESS [1.333s]
[INFO] Generated JavaScript Sample using JAX-WS and JSR-181 .. SUCCESS [0.152s]
[INFO] Java First demo service using the JAXWSFactoryBeans ... SUCCESS [0.074s]
[INFO] Java First demo using JAX-WS and JMS .................. SUCCESS [0.204s]
[INFO] JAX-RS Content Negotiation Demo ....................... SUCCESS [0.057s]
[INFO] JAX-RS Basic Demo With HTTPS communications ........... SUCCESS [0.067s]
[INFO] JAX-RS Basic Demo ..................................... SUCCESS [0.106s]
[INFO] CXF sample using a callbak object ..................... SUCCESS [3.703s]
[INFO] WSDL first demo using BARE Style in XML Binding (pure XML over HTTP)  SUCCESS [1.180s]
[INFO] JAX-WS Dispatch/Provider Demo ......................... SUCCESS [3.518s]
[INFO] WSDL first demo using Document/Literal Style and XMLBeans DataBinding  SUCCESS [1.177s]
[INFO] WSDL first demo using SOAP12 in Document/Literal Style  SUCCESS [0.906s]
[INFO] CXF Dynamic Client Sample ............................. SUCCESS [0.949s]
[INFO] JMS Transport Queue Demo using Document-Literal Style . SUCCESS [0.918s]
[INFO] WSDL first demo using the jms transport and jmsConfigFeature  SUCCESS [1.184s]
[INFO] RESTful Hello World Demo .............................. SUCCESS [0.108s]
[INFO] WSDL first demo using Document/Literal Style .......... SUCCESS [3.706s]
[INFO] CXF sample using the Aegis Binding without any webservice  SUCCESS [0.093s]
[INFO] Java First demo using JAX-WS APIs ..................... SUCCESS [1.554s]
[INFO] WS-RM Demo ............................................ SUCCESS [1.062s]
[INFO] CXF Sample of Stream GZIP Interceptor ................. SUCCESS [1.221s]
[INFO] Spring HTTP Sample .................................... SUCCESS [1.748s]
[INFO] Spring HTTP Servlet demo with ruby support ............ SUCCESS [3.147s]
[INFO] Spring HTTP Servlet demo with groovy support .......... SUCCESS [3.210s]
[INFO] Hello world javascript demo ........................... SUCCESS [1.067s]
[INFO] CXF WS-Security UT Demo ............................... SUCCESS [1.068s]
[INFO] WS-Security UT Sign Demo .............................. SUCCESS [1.051s]
[INFO] CXF WS-Security Sign Encoding Demo .................... SUCCESS [1.189s]
[INFO] WS-Security UT Policy Demo ............................ SUCCESS [1.052s]
[INFO] MTOM Demo for SWA and XOP ............................. SUCCESS [0.954s]
[INFO] JAX-WS Asynchronous Demo using Document/Literal Style . SUCCESS [0.885s]
[INFO] Java First POJO Sample ................................ SUCCESS [0.057s]
[INFO] WS-Policy Demo ........................................ SUCCESS [1.133s]
[INFO] Hello World Client Demo using JavaScript .............. SUCCESS [0.886s]
[INFO] WSDL first demo using HTTPS ........................... SUCCESS [0.966s]
[INFO] WS-Addressing Demo .................................... SUCCESS [0.922s]
[INFO] Sample using SOAP Headers ............................. SUCCESS [1.077s]
[INFO] SOAP/JMS Transport Specification Demo using Document-Literal Style  SUCCESS [0.938s]
[INFO] CXF sample using WRAPPED Style in XML Binding (pure XML over HTTP)  SUCCESS [0.884s]
[INFO] RESTful HTTP Binding Demo ............................. SUCCESS [0.120s]
[INFO] CXF sample using code first POJO's and the Aegis Binding  SUCCESS [0.399s]
[INFO] Sample of JAX-* Service Using an Aegis Client ......... SUCCESS [0.072s]
[INFO] JAX-WS Handler Demo ................................... SUCCESS [0.929s]
[INFO] WSDL first demo using RPC-Literal Style ............... SUCCESS [1.129s]
[INFO] JMS Transport Publish/Subscribe Demo using Document-Literal Style  SUCCESS [0.905s]
[INFO] JAX-RS Spring Security Demo ........................... SUCCESS [1.395s]
[INFO] LogBrowser ............................................ SUCCESS [0.108s]
[INFO] WS-Notification Demo .................................. SUCCESS [0.079s]
[INFO] CXF STS Demo .......................................... SUCCESS [2.642s]
[INFO] Bank sample using JAX-WS API's to talk via CORBA/IIOP . SUCCESS [0.904s]
[INFO] Bank sample using JAX-WS API's to talk via CORBA/IIOP . SUCCESS [1.292s]
[INFO] hello-world sample using JAX-WS API's to talk via CORBA/IIOP  SUCCESS [0.946s]
[INFO] OAuth 1.0a server ..................................... SUCCESS [2.021s]
[INFO] OAuth 1.0a client ..................................... SUCCESS [0.620s]
[INFO] JAX-RS Minimal OSGI Demo .............................. SUCCESS [6.222s]
[INFO] Apache CXF Distribution ............................... SUCCESS [5:19.330s]
[INFO] ------------------------------------------------------------------------
[INFO] ------------------------------------------------------------------------
[INFO] BUILD SUCCESSFUL
[INFO] ------------------------------------------------------------------------
[INFO] Total time: 30 minutes 2 seconds
[INFO] Finished at: Fri Nov 09 07:35:02 UTC 2012
[INFO] Final Memory: 388M/956M
[INFO] ------------------------------------------------------------------------
[locks-and-latches] Releasing all the locks
[locks-and-latches] All the locks released
ERROR: Maven JVM terminated unexpectedly with exit code 143


Mime
View raw message