cxf-notifications mailing list archives

Site index · List index
Message view « Date » · « Thread »
Top « Date » · « Thread »
From Apache Jenkins Server <jenk...@builds.apache.org>
Subject Build failed in Jenkins: CXF-2.5-deploy #185
Date Wed, 17 Oct 2012 07:23:52 GMT
See <https://builds.apache.org/job/CXF-2.5-deploy/185/changes>

Changes:

[sergeyb] Merged revisions 1398878 via svnmerge from 
https://svn.apache.org/repos/asf/cxf/branches/2.6.x-fixes

................
  r1398878 | sergeyb | 2012-10-16 17:38:02 +0100 (Tue, 16 Oct 2012) | 9 lines
  
  Merged revisions 1398302 via svnmerge from 
  https://svn.apache.org/repos/asf/cxf/trunk
  
  ........
    r1398302 | sergeyb | 2012-10-15 15:27:07 +0100 (Mon, 15 Oct 2012) | 1 line
    
    [CXF-4563] Fixing the way empty responses are read on the client side
  ........
................

[asoldano] Merged revisions 1398689 via svnmerge from 
https://svn.apache.org/repos/asf/cxf/branches/2.6.x-fixes

................
  r1398689 | asoldano | 2012-10-16 09:55:43 +0200 (Tue, 16 Oct 2012) | 9 lines
  
  Merged revisions 1398052 via svnmerge from 
  https://svn.apache.org/repos/asf/cxf/trunk
  
  ........
    r1398052 | asoldano | 2012-10-14 12:58:27 +0200 (Sun, 14 Oct 2012) | 2 lines
    
    [CXF-4561] Allow disabling WSI-BSP compliance in UsernameTokenInterceptor
  ........
................

------------------------------------------
[...truncated 18020 lines...]
153K uploaded  (cxf-systests-transport-jms-2.5.7-20121017.070932-8-tests.jar)
[INFO] ------------------------------------------------------------------------
[INFO] Building Apache CXF JAX-WS System Tests
[INFO]    task-segment: [deploy]
[INFO] ------------------------------------------------------------------------
[INFO] [cxf-xml2fastinfoset:xml2fastinfoset {execution: xml2fastinfoset}]
[WARNING] The parameter expression: 'project.build.resources' used in mojo: 'process' has
been deprecated. Use 'project.resources' instead.
[INFO] [remote-resources:process {execution: default}]
[debug] execute contextualize
[INFO] [resources:resources {execution: default-resources}]
[INFO] Using 'UTF-8' encoding to copy filtered resources.
[INFO] skip non existing resourceDirectory /x1/jenkins/jenkins-slave/workspace/CXF-2.5-deploy/cxf-2.5.x-fixes/systests/jaxws/src/main/java
[INFO] skip non existing resourceDirectory /x1/jenkins/jenkins-slave/workspace/CXF-2.5-deploy/cxf-2.5.x-fixes/systests/jaxws/src/main/resources
[INFO] skip non existing resourceDirectory /x1/jenkins/jenkins-slave/workspace/CXF-2.5-deploy/cxf-2.5.x-fixes/systests/jaxws/src/main/resources-filtered
[INFO] skip non existing resourceDirectory /x1/jenkins/jenkins-slave/workspace/CXF-2.5-deploy/cxf-2.5.x-fixes/systests/jaxws/target/generated/src/main/resources
[INFO] Copying 3 resources
[INFO] [compiler:compile {execution: default-compile}]
[INFO] No sources to compile
[INFO] [cxf-codegen:wsdl2java {execution: generate-test-sources}]
[debug] execute contextualize
[INFO] [resources:testResources {execution: default-testResources}]
[INFO] Using 'UTF-8' encoding to copy filtered resources.
[INFO] Copying 44 resources
[INFO] Copying 8 resources
[INFO] skip non existing resourceDirectory /x1/jenkins/jenkins-slave/workspace/CXF-2.5-deploy/cxf-2.5.x-fixes/systests/jaxws/target/generated/src/test/resources
[INFO] Copying 3 resources
[INFO] [compiler:testCompile {execution: default-testCompile}]
[INFO] Nothing to compile - all classes are up to date
[INFO] [surefire:test {execution: default-test}]
[INFO] Tests are skipped.
[INFO] [jar:jar {execution: default-jar}]
[INFO] Building jar: /x1/jenkins/jenkins-slave/workspace/CXF-2.5-deploy/cxf-2.5.x-fixes/systests/jaxws/target/cxf-systests-jaxws-2.5.7-SNAPSHOT.jar
[INFO] [source:jar-no-fork {execution: attach-sources}]
[INFO] META-INF already added, skipping
[INFO] META-INF/DEPENDENCIES already added, skipping
[INFO] META-INF/NOTICE already added, skipping
[INFO] META-INF/LICENSE already added, skipping
[INFO] Building jar: /x1/jenkins/jenkins-slave/workspace/CXF-2.5-deploy/cxf-2.5.x-fixes/systests/jaxws/target/cxf-systests-jaxws-2.5.7-SNAPSHOT-sources.jar
[INFO] META-INF already added, skipping
[INFO] META-INF/DEPENDENCIES already added, skipping
[INFO] META-INF/NOTICE already added, skipping
[INFO] META-INF/LICENSE already added, skipping
[INFO] [javadoc:jar {execution: attach-javadocs}]
[INFO] [jar:test-jar {execution: attach-sources}]
[INFO] Building jar: /x1/jenkins/jenkins-slave/workspace/CXF-2.5-deploy/cxf-2.5.x-fixes/systests/jaxws/target/cxf-systests-jaxws-2.5.7-SNAPSHOT-tests.jar
[INFO] [install:install {execution: default-install}]
[INFO] Installing /x1/jenkins/jenkins-slave/workspace/CXF-2.5-deploy/cxf-2.5.x-fixes/systests/jaxws/target/cxf-systests-jaxws-2.5.7-SNAPSHOT.jar
to <https://builds.apache.org/job/CXF-2.5-deploy/ws/.repository/org/apache/cxf/systests/cxf-systests-jaxws/2.5.7-SNAPSHOT/cxf-systests-jaxws-2.5.7-SNAPSHOT.jar>
[INFO] Installing /x1/jenkins/jenkins-slave/workspace/CXF-2.5-deploy/cxf-2.5.x-fixes/systests/jaxws/target/cxf-systests-jaxws-2.5.7-SNAPSHOT-sources.jar
to <https://builds.apache.org/job/CXF-2.5-deploy/ws/.repository/org/apache/cxf/systests/cxf-systests-jaxws/2.5.7-SNAPSHOT/cxf-systests-jaxws-2.5.7-SNAPSHOT-sources.jar>
[INFO] Installing /x1/jenkins/jenkins-slave/workspace/CXF-2.5-deploy/cxf-2.5.x-fixes/systests/jaxws/target/cxf-systests-jaxws-2.5.7-SNAPSHOT-tests.jar
to <https://builds.apache.org/job/CXF-2.5-deploy/ws/.repository/org/apache/cxf/systests/cxf-systests-jaxws/2.5.7-SNAPSHOT/cxf-systests-jaxws-2.5.7-SNAPSHOT-tests.jar>
[INFO] [deploy:deploy {execution: default-deploy}]
[INFO] Retrieving previous build number from apache.snapshots.https
[WARNING] *** CHECKSUM FAILED - Checksum failed on download: local = '6045ef213f7a8adb99d05784847efbf492ccf941';
remote = 'f3d8c3cfd9d2b7b661e39091c5feee480bd6964a' - RETRYING
[WARNING] *** CHECKSUM FAILED - Checksum failed on download: local = '6045ef213f7a8adb99d05784847efbf492ccf941';
remote = 'f3d8c3cfd9d2b7b661e39091c5feee480bd6964a' - IGNORING
Uploading: https://repository.apache.org/content/repositories/snapshots/org/apache/cxf/systests/cxf-systests-jaxws/2.5.7-SNAPSHOT/cxf-systests-jaxws-2.5.7-20121017.070932-8.jar
9K uploaded  (cxf-systests-jaxws-2.5.7-20121017.070932-8.jar)
[INFO] Retrieving previous metadata from apache.snapshots.https
[WARNING] *** CHECKSUM FAILED - Checksum failed on download: local = '6045ef213f7a8adb99d05784847efbf492ccf941';
remote = 'f3d8c3cfd9d2b7b661e39091c5feee480bd6964a' - RETRYING
[WARNING] *** CHECKSUM FAILED - Checksum failed on download: local = '6045ef213f7a8adb99d05784847efbf492ccf941';
remote = 'f3d8c3cfd9d2b7b661e39091c5feee480bd6964a' - IGNORING
[INFO] Uploading repository metadata for: 'snapshot org.apache.cxf.systests:cxf-systests-jaxws:2.5.7-SNAPSHOT'
[INFO] Uploading project information for cxf-systests-jaxws 2.5.7-20121017.070932-8
[INFO] Retrieving previous metadata from apache.snapshots.https
[INFO] Uploading repository metadata for: 'artifact org.apache.cxf.systests:cxf-systests-jaxws'
[INFO] Retrieving previous build number from apache.snapshots.https
Uploading: https://repository.apache.org/content/repositories/snapshots/org/apache/cxf/systests/cxf-systests-jaxws/2.5.7-SNAPSHOT/cxf-systests-jaxws-2.5.7-20121017.070932-8-sources.jar
6K uploaded  (cxf-systests-jaxws-2.5.7-20121017.070932-8-sources.jar)
[INFO] Retrieving previous build number from apache.snapshots.https
Uploading: https://repository.apache.org/content/repositories/snapshots/org/apache/cxf/systests/cxf-systests-jaxws/2.5.7-SNAPSHOT/cxf-systests-jaxws-2.5.7-20121017.070932-8-tests.jar
398K uploaded  (cxf-systests-jaxws-2.5.7-20121017.070932-8-tests.jar)
[INFO] ------------------------------------------------------------------------
[INFO] Building Apache CXF Databinding System Tests
[INFO]    task-segment: [deploy]
[INFO] ------------------------------------------------------------------------
[INFO] [cxf-xml2fastinfoset:xml2fastinfoset {execution: xml2fastinfoset}]
[WARNING] The parameter expression: 'project.build.resources' used in mojo: 'process' has
been deprecated. Use 'project.resources' instead.
[INFO] [remote-resources:process {execution: default}]
[debug] execute contextualize
[INFO] [resources:resources {execution: default-resources}]
[INFO] Using 'UTF-8' encoding to copy filtered resources.
[INFO] skip non existing resourceDirectory /x1/jenkins/jenkins-slave/workspace/CXF-2.5-deploy/cxf-2.5.x-fixes/systests/databinding/src/main/java
[INFO] skip non existing resourceDirectory /x1/jenkins/jenkins-slave/workspace/CXF-2.5-deploy/cxf-2.5.x-fixes/systests/databinding/src/main/resources
[INFO] skip non existing resourceDirectory /x1/jenkins/jenkins-slave/workspace/CXF-2.5-deploy/cxf-2.5.x-fixes/systests/databinding/src/main/resources-filtered
[INFO] skip non existing resourceDirectory /x1/jenkins/jenkins-slave/workspace/CXF-2.5-deploy/cxf-2.5.x-fixes/systests/databinding/target/generated/src/main/resources
[INFO] Copying 3 resources
[INFO] [compiler:compile {execution: default-compile}]
[INFO] No sources to compile
[INFO] [build-helper:add-test-source {execution: add-test-source}]
[INFO] Test Source directory: /x1/jenkins/jenkins-slave/workspace/CXF-2.5-deploy/cxf-2.5.x-fixes/systests/databinding/src/test/generated
added.
[INFO] [cxf-codegen:wsdl2java {execution: generate-test-sources}]
[debug] execute contextualize
[INFO] [resources:copy-resources {execution: copy-test-resources}]
[INFO] Using 'UTF-8' encoding to copy filtered resources.
[INFO] Copying 98 resources
[debug] execute contextualize
[INFO] [resources:testResources {execution: default-testResources}]
[INFO] Using 'UTF-8' encoding to copy filtered resources.
[INFO] Copying 5 resources
[INFO] Copying 13 resources
[INFO] skip non existing resourceDirectory /x1/jenkins/jenkins-slave/workspace/CXF-2.5-deploy/cxf-2.5.x-fixes/systests/databinding/target/generated/src/test/resources
[INFO] Copying 3 resources
[INFO] [compiler:testCompile {execution: default-testCompile}]
[INFO] Nothing to compile - all classes are up to date
[WARNING] DEPRECATED [directory]: - Since binding and codegen use this for different locations,
use schemaBindingDirectory.<br/>
Defaults to "src/main/config" (or "src/test/config" for test goals).
[WARNING] DEPRECATED [includes]: - This name was confusing since it is used as a binding file
pattern
for bind and a schema file pattern for code-gen.<br/>
Use includeSchemaBindings for binding and includeSchemas for schema.<br/>
<b>Note: </b>Uses the standard filter format described in the plexus
<a href="http://plexus.codehaus.org/plexus-utils/apidocs/org/codehaus/plexus/util/DirectoryScanner.html">DirectoryScanner</a>.<br/>
<b>Defaults value is:</b> binding.xml.
[INFO] [jibx:test-bind {execution: default}]
[INFO] Running JiBX binding compiler (single-module mode) on 2 binding file(s)
[INFO] [surefire:test {execution: default-test}]
[INFO] Tests are skipped.
[INFO] [jar:jar {execution: default-jar}]
[INFO] Building jar: /x1/jenkins/jenkins-slave/workspace/CXF-2.5-deploy/cxf-2.5.x-fixes/systests/databinding/target/cxf-systests-databinding-2.5.7-SNAPSHOT.jar
[INFO] [source:jar-no-fork {execution: attach-sources}]
[INFO] META-INF already added, skipping
[INFO] META-INF/DEPENDENCIES already added, skipping
[INFO] META-INF/NOTICE already added, skipping
[INFO] META-INF/LICENSE already added, skipping
[INFO] Building jar: /x1/jenkins/jenkins-slave/workspace/CXF-2.5-deploy/cxf-2.5.x-fixes/systests/databinding/target/cxf-systests-databinding-2.5.7-SNAPSHOT-sources.jar
[INFO] META-INF already added, skipping
[INFO] META-INF/DEPENDENCIES already added, skipping
[INFO] META-INF/NOTICE already added, skipping
[INFO] META-INF/LICENSE already added, skipping
[INFO] [javadoc:jar {execution: attach-javadocs}]
[INFO] [jar:test-jar {execution: attach-sources}]
[INFO] Building jar: /x1/jenkins/jenkins-slave/workspace/CXF-2.5-deploy/cxf-2.5.x-fixes/systests/databinding/target/cxf-systests-databinding-2.5.7-SNAPSHOT-tests.jar
[INFO] [install:install {execution: default-install}]
[INFO] Installing /x1/jenkins/jenkins-slave/workspace/CXF-2.5-deploy/cxf-2.5.x-fixes/systests/databinding/target/cxf-systests-databinding-2.5.7-SNAPSHOT.jar
to <https://builds.apache.org/job/CXF-2.5-deploy/ws/.repository/org/apache/cxf/systests/cxf-systests-databinding/2.5.7-SNAPSHOT/cxf-systests-databinding-2.5.7-SNAPSHOT.jar>
[INFO] Installing /x1/jenkins/jenkins-slave/workspace/CXF-2.5-deploy/cxf-2.5.x-fixes/systests/databinding/target/cxf-systests-databinding-2.5.7-SNAPSHOT-sources.jar
to <https://builds.apache.org/job/CXF-2.5-deploy/ws/.repository/org/apache/cxf/systests/cxf-systests-databinding/2.5.7-SNAPSHOT/cxf-systests-databinding-2.5.7-SNAPSHOT-sources.jar>
[INFO] Installing /x1/jenkins/jenkins-slave/workspace/CXF-2.5-deploy/cxf-2.5.x-fixes/systests/databinding/target/cxf-systests-databinding-2.5.7-SNAPSHOT-tests.jar
to <https://builds.apache.org/job/CXF-2.5-deploy/ws/.repository/org/apache/cxf/systests/cxf-systests-databinding/2.5.7-SNAPSHOT/cxf-systests-databinding-2.5.7-SNAPSHOT-tests.jar>
[INFO] [deploy:deploy {execution: default-deploy}]
[INFO] Retrieving previous build number from apache.snapshots.https
[WARNING] *** CHECKSUM FAILED - Checksum failed on download: local = 'a237699ae5bd720eb2a130c1d018ecfe8ba1df2e';
remote = 'b005268d3ac3339b2c8678ffc94a37734496a218' - RETRYING
[WARNING] *** CHECKSUM FAILED - Checksum failed on download: local = 'a237699ae5bd720eb2a130c1d018ecfe8ba1df2e';
remote = 'b005268d3ac3339b2c8678ffc94a37734496a218' - IGNORING
Uploading: https://repository.apache.org/content/repositories/snapshots/org/apache/cxf/systests/cxf-systests-databinding/2.5.7-SNAPSHOT/cxf-systests-databinding-2.5.7-20121017.070932-8.jar
10K uploaded  (cxf-systests-databinding-2.5.7-20121017.070932-8.jar)
[INFO] Retrieving previous metadata from apache.snapshots.https
[WARNING] *** CHECKSUM FAILED - Checksum failed on download: local = 'a237699ae5bd720eb2a130c1d018ecfe8ba1df2e';
remote = 'b005268d3ac3339b2c8678ffc94a37734496a218' - RETRYING
[WARNING] *** CHECKSUM FAILED - Checksum failed on download: local = 'a237699ae5bd720eb2a130c1d018ecfe8ba1df2e';
remote = 'b005268d3ac3339b2c8678ffc94a37734496a218' - IGNORING
[INFO] Uploading repository metadata for: 'snapshot org.apache.cxf.systests:cxf-systests-databinding:2.5.7-SNAPSHOT'
[INFO] Retrieving previous metadata from apache.snapshots.https
[INFO] Uploading repository metadata for: 'artifact org.apache.cxf.systests:cxf-systests-databinding'
[INFO] Uploading project information for cxf-systests-databinding 2.5.7-20121017.070932-8
[INFO] Retrieving previous build number from apache.snapshots.https
Uploading: https://repository.apache.org/content/repositories/snapshots/org/apache/cxf/systests/cxf-systests-databinding/2.5.7-SNAPSHOT/cxf-systests-databinding-2.5.7-20121017.070932-8-sources.jar
7K uploaded  (cxf-systests-databinding-2.5.7-20121017.070932-8-sources.jar)
[INFO] Retrieving previous build number from apache.snapshots.https
Uploading: https://repository.apache.org/content/repositories/snapshots/org/apache/cxf/systests/cxf-systests-databinding/2.5.7-SNAPSHOT/cxf-systests-databinding-2.5.7-20121017.070932-8-tests.jar
337K uploaded  (cxf-systests-databinding-2.5.7-20121017.070932-8-tests.jar)
[INFO] ------------------------------------------------------------------------
[INFO] Building Apache CXF JAX-RS System Tests
[INFO]    task-segment: [deploy]
[INFO] ------------------------------------------------------------------------
[INFO] [cxf-xml2fastinfoset:xml2fastinfoset {execution: xml2fastinfoset}]
[INFO] [jibx:schema-codegen {execution: generate-java-code-from-schema}]
[INFO] Generating Java sources in target/generated/src/main/java from schemas available in
src/test/resources/jibx...
Loaded and validated 1 specified schema(s)
Generated 1 top-level classes in package org.apache.cxf.systest.jaxrs.codegen.jibx
Total classes in model: 1
[INFO] [cxf-wadl2java:wadl2java {execution: generate-sources}]
[WARNING] The parameter expression: 'project.build.resources' used in mojo: 'process' has
been deprecated. Use 'project.resources' instead.
[INFO] [remote-resources:process {execution: default}]
[debug] execute contextualize
[INFO] [resources:resources {execution: default-resources}]
[INFO] Using 'UTF-8' encoding to copy filtered resources.
[INFO] skip non existing resourceDirectory /x1/jenkins/jenkins-slave/workspace/CXF-2.5-deploy/cxf-2.5.x-fixes/systests/jaxrs/src/main/java
[INFO] skip non existing resourceDirectory /x1/jenkins/jenkins-slave/workspace/CXF-2.5-deploy/cxf-2.5.x-fixes/systests/jaxrs/src/main/resources
[INFO] skip non existing resourceDirectory /x1/jenkins/jenkins-slave/workspace/CXF-2.5-deploy/cxf-2.5.x-fixes/systests/jaxrs/src/main/resources-filtered
[INFO] skip non existing resourceDirectory /x1/jenkins/jenkins-slave/workspace/CXF-2.5-deploy/cxf-2.5.x-fixes/systests/jaxrs/target/generated/src/main/resources
[INFO] Copying 3 resources
[INFO] [compiler:compile {execution: default-compile}]
[INFO] Compiling 1 source file to /x1/jenkins/jenkins-slave/workspace/CXF-2.5-deploy/cxf-2.5.x-fixes/systests/jaxrs/target/classes
[INFO] [jibx:bind {execution: compile-binding}]
[INFO] Running JiBX binding compiler (single-module mode) on 1 binding file(s)
Verification failure on class org.apache.cxf.systest.jaxrs.codegen.jibx.Book:
  VERIFIED_REJECTED
Repository.lookup() failed. FILE NOT FOUND?

Verification failure on class org.apache.cxf.systest.jaxrs.codegen.jibx.JiBX_bindingBook_access1:
  VERIFIED_REJECTED
Repository.lookup() failed. FILE NOT FOUND?

Verification failure on class org.apache.cxf.systest.jaxrs.codegen.jibx.JiBX_bindingFactory:
  VERIFIED_REJECTED
Repository.lookup() failed. FILE NOT FOUND?

[debug] execute contextualize
[INFO] [resources:testResources {execution: default-testResources}]
[INFO] Using 'UTF-8' encoding to copy filtered resources.
[INFO] Copying 99 resources
[INFO] Copying 57 resources
[INFO] skip non existing resourceDirectory /x1/jenkins/jenkins-slave/workspace/CXF-2.5-deploy/cxf-2.5.x-fixes/systests/jaxrs/target/generated/src/test/resources
[INFO] Copying 3 resources
[INFO] [compiler:testCompile {execution: default-testCompile}]
[INFO] Compiling 159 source files to /x1/jenkins/jenkins-slave/workspace/CXF-2.5-deploy/cxf-2.5.x-fixes/systests/jaxrs/target/test-classes
[INFO] -------------------------------------------------------------
[ERROR] COMPILATION ERROR : 
[INFO] -------------------------------------------------------------
[ERROR] /x1/jenkins/jenkins-slave/workspace/CXF-2.5-deploy/cxf-2.5.x-fixes/systests/jaxrs/src/test/java/org/apache/cxf/systest/jaxrs/JAXRSClientServerBookTest.java:[1031,21]
cannot find symbol
symbol  : class ClientException
location: class org.apache.cxf.systest.jaxrs.JAXRSClientServerBookTest
[ERROR] /x1/jenkins/jenkins-slave/workspace/CXF-2.5-deploy/cxf-2.5.x-fixes/systests/jaxrs/src/test/java/org/apache/cxf/systest/jaxrs/JAXRSClientServerBookTest.java:[1036,21]
cannot find symbol
symbol  : class ClientException
location: class org.apache.cxf.systest.jaxrs.JAXRSClientServerBookTest
[ERROR] /x1/jenkins/jenkins-slave/workspace/CXF-2.5-deploy/cxf-2.5.x-fixes/systests/jaxrs/src/test/java/org/apache/cxf/systest/jaxrs/JAXRSClientServerBookTest.java:[1048,21]
cannot find symbol
symbol  : class ClientException
location: class org.apache.cxf.systest.jaxrs.JAXRSClientServerBookTest
[ERROR] /x1/jenkins/jenkins-slave/workspace/CXF-2.5-deploy/cxf-2.5.x-fixes/systests/jaxrs/src/test/java/org/apache/cxf/systest/jaxrs/JAXRSClientServerBookTest.java:[1052,13]
cannot find symbol
symbol  : method getEmptyBook()
location: class org.apache.cxf.systest.jaxrs.BookStore
[ERROR] /x1/jenkins/jenkins-slave/workspace/CXF-2.5-deploy/cxf-2.5.x-fixes/systests/jaxrs/src/test/java/org/apache/cxf/systest/jaxrs/JAXRSClientServerBookTest.java:[1059,24]
cannot find symbol
symbol  : method getEmptyBookNullable()
location: class org.apache.cxf.systest.jaxrs.BookStore
[INFO] 5 errors 
[INFO] -------------------------------------------------------------
[INFO] ------------------------------------------------------------------------
[ERROR] BUILD FAILURE
[INFO] ------------------------------------------------------------------------
[INFO] Compilation failure

/x1/jenkins/jenkins-slave/workspace/CXF-2.5-deploy/cxf-2.5.x-fixes/systests/jaxrs/src/test/java/org/apache/cxf/systest/jaxrs/JAXRSClientServerBookTest.java:[1031,21]
cannot find symbol
symbol  : class ClientException
location: class org.apache.cxf.systest.jaxrs.JAXRSClientServerBookTest
/x1/jenkins/jenkins-slave/workspace/CXF-2.5-deploy/cxf-2.5.x-fixes/systests/jaxrs/src/test/java/org/apache/cxf/systest/jaxrs/JAXRSClientServerBookTest.java:[1036,21]
cannot find symbol
symbol  : class ClientException
location: class org.apache.cxf.systest.jaxrs.JAXRSClientServerBookTest
/x1/jenkins/jenkins-slave/workspace/CXF-2.5-deploy/cxf-2.5.x-fixes/systests/jaxrs/src/test/java/org/apache/cxf/systest/jaxrs/JAXRSClientServerBookTest.java:[1048,21]
cannot find symbol
symbol  : class ClientException
location: class org.apache.cxf.systest.jaxrs.JAXRSClientServerBookTest
/x1/jenkins/jenkins-slave/workspace/CXF-2.5-deploy/cxf-2.5.x-fixes/systests/jaxrs/src/test/java/org/apache/cxf/systest/jaxrs/JAXRSClientServerBookTest.java:[1052,13]
cannot find symbol
symbol  : method getEmptyBook()
location: class org.apache.cxf.systest.jaxrs.BookStore
/x1/jenkins/jenkins-slave/workspace/CXF-2.5-deploy/cxf-2.5.x-fixes/systests/jaxrs/src/test/java/org/apache/cxf/systest/jaxrs/JAXRSClientServerBookTest.java:[1059,24]
cannot find symbol
symbol  : method getEmptyBookNullable()
location: class org.apache.cxf.systest.jaxrs.BookStore

[INFO] ------------------------------------------------------------------------
[INFO] For more information, run Maven with the -e switch
[INFO] ------------------------------------------------------------------------
[INFO] Total time: 14 minutes 30 seconds
[INFO] Finished at: Wed Oct 17 07:23:45 GMT 2012
[INFO] Final Memory: 320M/442M
[INFO] ------------------------------------------------------------------------
Build step 'Invoke top-level Maven targets' marked build as failure
[locks-and-latches] Releasing all the locks
[locks-and-latches] All the locks released

Mime
View raw message