cxf-notifications mailing list archives

Site index · List index
Message view « Date » · « Thread »
Top « Date » · « Thread »
From Apache Jenkins Server <jenk...@builds.apache.org>
Subject Build failed in Jenkins: CXF-2.6-deploy #80
Date Tue, 02 Oct 2012 06:48:16 GMT
See <https://builds.apache.org/job/CXF-2.6-deploy/80/changes>

Changes:

[dkulp] Recording revisions 1392527 via  git from
https://svn.apache.org/repos/asf/cxf/trunk

[dkulp] Merged revisions 1392527 via  git cherry-pick from
https://svn.apache.org/repos/asf/cxf/trunk

........
  r1392527 | dkulp | 2012-10-01 15:16:18 -0400 (Mon, 01 Oct 2012) | 3 lines

  [CXF-3813] Ability to validate just incoming or outgoing requests
  Slightly modified patch from Jason Pell applied

........

[sergeyb] Setting commons-codec version to 1.6 on the 2.6.x branch

[sergeyb] Merged revisions 1392027,1392082,1392092 via svnmerge from 
https://svn.apache.org/repos/asf/cxf/trunk

........
  r1392027 | bimargulies | 2012-09-30 15:08:02 +0100 (Sun, 30 Sep 2012) | 3 lines
  
  CXF-4528: change the logging severity in WebApplicationExceptionMapper when 
  the app has a FaultListener that actually asked for logging.
........
  r1392082 | sergeyb | 2012-09-30 18:32:32 +0100 (Sun, 30 Sep 2012) | 1 line
  
  [CXF-4528] More updates to the mapper, if fault listener has handled the exception - do
not log, otherwise do log either at warning (default) or fine level
........
  r1392092 | sergeyb | 2012-09-30 19:29:43 +0100 (Sun, 30 Sep 2012) | 1 line
  
  [CXF-4528] Making simpler to customize the error message and optionally including it with
Responses
........

------------------------------------------
[...truncated 18803 lines...]
Uploaded: https://repository.apache.org/content/repositories/snapshots/org/apache/cxf/systests/cxf-systests-ci-webapp/2.6.3-SNAPSHOT/maven-metadata.xml
(2 KB at 3.7 KB/sec)
Uploading: https://repository.apache.org/content/repositories/snapshots/org/apache/cxf/systests/cxf-systests-ci-webapp/maven-metadata.xml
Uploaded: https://repository.apache.org/content/repositories/snapshots/org/apache/cxf/systests/cxf-systests-ci-webapp/maven-metadata.xml
(486 B at 2.2 KB/sec)
Uploading: https://repository.apache.org/content/repositories/snapshots/org/apache/cxf/systests/cxf-systests-ci-webapp/2.6.3-SNAPSHOT/cxf-systests-ci-webapp-2.6.3-20121002.064803-27-sources.jar
Uploaded: https://repository.apache.org/content/repositories/snapshots/org/apache/cxf/systests/cxf-systests-ci-webapp/2.6.3-SNAPSHOT/cxf-systests-ci-webapp-2.6.3-20121002.064803-27-sources.jar
(8 KB at 31.6 KB/sec)
Uploading: https://repository.apache.org/content/repositories/snapshots/org/apache/cxf/systests/cxf-systests-ci-webapp/2.6.3-SNAPSHOT/maven-metadata.xml
Uploaded: https://repository.apache.org/content/repositories/snapshots/org/apache/cxf/systests/cxf-systests-ci-webapp/2.6.3-SNAPSHOT/maven-metadata.xml
(2 KB at 8.8 KB/sec)
Uploading: https://repository.apache.org/content/repositories/snapshots/org/apache/cxf/systests/cxf-systests-ci-webapp/2.6.3-SNAPSHOT/cxf-systests-ci-webapp-2.6.3-20121002.064803-27-javadoc.jar
Uploaded: https://repository.apache.org/content/repositories/snapshots/org/apache/cxf/systests/cxf-systests-ci-webapp/2.6.3-SNAPSHOT/cxf-systests-ci-webapp-2.6.3-20121002.064803-27-javadoc.jar
(29 KB at 146.5 KB/sec)
Uploading: https://repository.apache.org/content/repositories/snapshots/org/apache/cxf/systests/cxf-systests-ci-webapp/2.6.3-SNAPSHOT/maven-metadata.xml
Uploaded: https://repository.apache.org/content/repositories/snapshots/org/apache/cxf/systests/cxf-systests-ci-webapp/2.6.3-SNAPSHOT/maven-metadata.xml
(2 KB at 8.7 KB/sec)
[INFO]                                                                         
[INFO] ------------------------------------------------------------------------
[INFO] Building Apache CXF Uncategorized System Tests 2.6.3-SNAPSHOT
[INFO] ------------------------------------------------------------------------
[INFO] 
[INFO] --- maven-bundle-plugin:2.3.7:cleanVersions (versions) @ cxf-systests-uncategorized
---
[INFO] 
[INFO] --- cxf-xml2fastinfoset-plugin:2.4.1:xml2fastinfoset (xml2fastinfoset) @ cxf-systests-uncategorized
---
[INFO] 
[INFO] --- maven-remote-resources-plugin:1.3:process (default) @ cxf-systests-uncategorized
---
[INFO] 
[INFO] --- maven-resources-plugin:2.5:resources (default-resources) @ cxf-systests-uncategorized
---
[debug] execute contextualize
[INFO] Using 'UTF-8' encoding to copy filtered resources.
[INFO] skip non existing resourceDirectory <https://builds.apache.org/job/CXF-2.6-deploy/ws/cxf-2.6.x-fixes/systests/uncategorized/src/main/java>
[INFO] skip non existing resourceDirectory <https://builds.apache.org/job/CXF-2.6-deploy/ws/cxf-2.6.x-fixes/systests/uncategorized/src/main/resources>
[INFO] skip non existing resourceDirectory <https://builds.apache.org/job/CXF-2.6-deploy/ws/cxf-2.6.x-fixes/systests/uncategorized/src/main/resources-filtered>
[INFO] skip non existing resourceDirectory <https://builds.apache.org/job/CXF-2.6-deploy/ws/cxf-2.6.x-fixes/systests/uncategorized/target/generated/src/main/resources>
[INFO] Copying 3 resources
[INFO] 
[INFO] --- maven-compiler-plugin:2.5.1:compile (default-compile) @ cxf-systests-uncategorized
---
[INFO] No sources to compile
[INFO] 
[INFO] --- maven-bundle-plugin:2.3.7:manifest (bundle-manifest) @ cxf-systests-uncategorized
---
[WARNING] Manifest org.apache.cxf.systests:cxf-systests-uncategorized:jar:2.6.3-SNAPSHOT :
Superfluous export-package instructions: [org.apache.cxf.*]
[INFO] 
[INFO] --- cxf-codegen-plugin:2.6.3-SNAPSHOT:wsdl2java (generate-test-sources) @ cxf-systests-uncategorized
---
[INFO] 
[INFO] --- cxf-corbatools-maven-plugin:2.6.3-SNAPSHOT:wsdl2idl (generate-test-sources) @ cxf-systests-uncategorized
---
[INFO] 
[INFO] --- maven-resources-plugin:2.5:testResources (default-testResources) @ cxf-systests-uncategorized
---
[debug] execute contextualize
[INFO] Using 'UTF-8' encoding to copy filtered resources.
[INFO] Copying 34 resources
[INFO] Copying 19 resources
[INFO] Copying 2 resources
[INFO] Copying 3 resources
[INFO] 
[INFO] --- maven-compiler-plugin:2.5.1:testCompile (default-testCompile) @ cxf-systests-uncategorized
---
[INFO] Compiling 2 source files to <https://builds.apache.org/job/CXF-2.6-deploy/ws/cxf-2.6.x-fixes/systests/uncategorized/target/test-classes>
[INFO] -------------------------------------------------------------
[ERROR] COMPILATION ERROR : 
[INFO] -------------------------------------------------------------
[ERROR] <https://builds.apache.org/job/CXF-2.6-deploy/ws/cxf-2.6.x-fixes/systests/uncategorized/src/test/java/org/apache/cxf/systest/schema_validation/SchemaValidationImpl.java>:[69,5]
method does not override a method from its superclass
[INFO] 1 error
[INFO] -------------------------------------------------------------
[INFO] ------------------------------------------------------------------------
[INFO] Reactor Summary:
[INFO] 
[INFO] Apache CXF ........................................ SUCCESS [6.633s]
[INFO] Apache CXF Parent ................................. SUCCESS [2.190s]
[INFO] Apache CXF API .................................... SUCCESS [34.915s]
[INFO] Apache CXF Woodstox/MSV Schema Validation ......... SUCCESS [4.686s]
[INFO] Apache CXF XML Schema Validation with Xerces ...... SUCCESS [4.097s]
[INFO] Apache CXF Common ................................. SUCCESS [0.911s]
[INFO] Apache CXF Runtime Core ........................... SUCCESS [10.653s]
[INFO] Apache CXF Command Line Tools Common .............. SUCCESS [10.459s]
[INFO] Apache CXF Runtime JAXB DataBinding ............... SUCCESS [5.656s]
[INFO] Apache CXF Runtime SOAP Binding ................... SUCCESS [8.385s]
[INFO] Apache CXF Command Line Tools Validator ........... SUCCESS [5.189s]
[INFO] Apache CXF Command Line Tools WSDLTo Core ......... SUCCESS [5.708s]
[INFO] Apache CXF Command Line Tools WSDLTo JAXWS Frontend  SUCCESS [10.330s]
[INFO] Apache CXF Runtime JavaScript Client Generator Projects  SUCCESS [0.985s]
[INFO] Apache CXF Runtime JavaScript Client Generator .... SUCCESS [7.511s]
[INFO] Apache CXF Command Line Tools WSDL to JavaScript Front End  SUCCESS [4.410s]
[INFO] Apache CXF Command Line Tools WSDLTo JAXB Databinding  SUCCESS [4.914s]
[INFO] Apache CXF Maven Plugins .......................... SUCCESS [0.937s]
[INFO] Apache CXF WSDL Validator Maven2 Plugin ........... SUCCESS [6.270s]
[INFO] Apache CXF Code Generation Maven2 Plugins ......... SUCCESS [7.208s]
[INFO] Apache CXF Test Utilities ......................... SUCCESS [36.771s]
[INFO] Apache CXF Runtime Management ..................... SUCCESS [5.930s]
[INFO] Apache CXF Runtime JMS Transport .................. SUCCESS [8.356s]
[INFO] Apache CXF Runtime XML Binding .................... SUCCESS [6.262s]
[INFO] Apache CXF Runtime Local Transport ................ SUCCESS [6.642s]
[INFO] Apache CXF Runtime WS Policy ...................... SUCCESS [10.934s]
[INFO] Apache CXF Runtime HTTP Transport ................. SUCCESS [10.475s]
[INFO] Apache CXF Runtime HTTP Jetty Transport ........... SUCCESS [8.585s]
[INFO] Apache CXF Runtime Simple Frontend ................ SUCCESS [8.471s]
[INFO] Apache CXF Runtime WS Addressing .................. SUCCESS [6.850s]
[INFO] Apache CXF Runtime JAX-WS Frontend ................ SUCCESS [19.264s]
[INFO] Apache CXF Runtime XmlBeans DataBinding ........... SUCCESS [9.295s]
[INFO] Apache CXF Command Line Tools WSDLTo Test ......... SUCCESS [3.817s]
[INFO] Apache CXF Command Line Tools WSDLTo Misctools .... SUCCESS [6.033s]
[INFO] Apache CXF Command Line Tools ..................... SUCCESS [0.923s]
[INFO] Apache CXF Command Line Tools WSDLTo .............. SUCCESS [0.928s]
[INFO] Apache CXF Runtime Aegis Databinding .............. SUCCESS [14.715s]
[INFO] Apache CXF Command Line Tools JavaTo WS ........... SUCCESS [10.980s]
[INFO] Apache CXF Command Line Tools JavaTo .............. SUCCESS [1.231s]
[INFO] Apache CXF Runtime JAX-RS Frontend ................ SUCCESS [20.282s]
[INFO] Apache CXF Command Line Tools WADLTo JAXRS Frontend  SUCCESS [5.492s]
[INFO] Apache CXF Command Line Tools WADLTo .............. SUCCESS [0.922s]
[INFO] Apache CXF Runtime CORBA Binding .................. SUCCESS [10.653s]
[INFO] Apache CXF Command Line Tools CORBA ............... SUCCESS [12.511s]
[INFO] Apache CXF Runtime SDO DataBinding ................ SUCCESS [7.418s]
[INFO] Apache CXF Runtime JiBX DataBinding ............... SUCCESS [8.161s]
[INFO] Apache CXF Runtime Object Binding ................. SUCCESS [5.865s]
[INFO] Apache CXF Runtime Colocated Binding .............. SUCCESS [5.489s]
[INFO] Apache CXF Runtime ................................ SUCCESS [1.227s]
[INFO] Apache CXF Runtime Bindings ....................... SUCCESS [1.842s]
[INFO] Apache CXF Runtime Clustering ..................... SUCCESS [5.802s]
[INFO] Apache CXF Runtime JavaScript Frontend ............ SUCCESS [5.195s]
[INFO] Apache CXF Runtime WS Reliable Messaging .......... SUCCESS [14.159s]
[INFO] Apache CXF Runtime WS MetadataExchange ............ SUCCESS [6.846s]
[INFO] Apache CXF Runtime WS Security .................... SUCCESS [22.516s]
[INFO] Apache CXF JAX-RS Extensions: Providers ........... SUCCESS [8.698s]
[INFO] Apache CXF JAX-RS Extensions: Search .............. SUCCESS [7.603s]
[INFO] Apache CXF RS XML Security ........................ SUCCESS [12.378s]
[INFO] Apache CXF RS SSO SAML ............................ SUCCESS [6.977s]
[INFO] Apache CXF Runtime RS Security OAuth Parent ....... SUCCESS [1.136s]
[INFO] Apache CXF Runtime OAuth 1.0a ..................... SUCCESS [6.964s]
[INFO] Apache CXF Runtime OAuth 2.0 ...................... SUCCESS [7.930s]
[INFO] Apache CXF RS Cross-Origin Resource Sharing ....... SUCCESS [4.472s]
[INFO] Apache CXF Runtime Web Management ................. SUCCESS [56.712s]
[INFO] Apache CXF Runtime JavaScript Client Generator Tests  SUCCESS [2.893s]
[INFO] Apache CXF JCA Connection ......................... SUCCESS [8.290s]
[INFO] Apache CXF Integration ............................ SUCCESS [2.511s]
[INFO] Apache CXF Java2WS Maven2 Plugin .................. SUCCESS [5.403s]
[INFO] Apache CXF WADL2Java Code Generation Maven2 Plugin  SUCCESS [6.382s]
[INFO] Apache CXF CORBA Tools Maven2 Plugins ............. SUCCESS [5.601s]
[INFO] Apache CXF Archetype - Simple JAX-WS Java First ... SUCCESS [4.473s]
[INFO] Apache CXF Archetype - Simple JAX-RS webapp ....... SUCCESS [3.233s]
[INFO] Apache CXF Maven Archetypes ....................... SUCCESS [1.304s]
[INFO] Apache CXF STS Core ............................... SUCCESS [15.348s]
[INFO] Apache CXF STS war deployment ..................... SUCCESS [16.548s]
[INFO] Apache CXF STS basic systests ..................... SUCCESS [9.159s]
[INFO] Apache CXF STS advanced systests .................. SUCCESS [9.194s]
[INFO] Apache CXF Services ............................... SUCCESS [1.350s]
[INFO] Apache CXF STS service ............................ SUCCESS [1.173s]
[INFO] Apache CXF STS systests ........................... SUCCESS [1.019s]
[INFO] Apache CXF WSN API ................................ SUCCESS [26.326s]
[INFO] Apache CXF WSN Core ............................... SUCCESS [19.233s]
[INFO] Apache CXF WSN OSGi ............................... SUCCESS [8.374s]
[INFO] Apache CXF WSN service ............................ SUCCESS [6.579s]
[INFO] Apache CXF Karaf Parent ........................... SUCCESS [4.687s]
[INFO] Apache CXF Karaf Features ......................... SUCCESS [2.886s]
[INFO] Apache CXF Karaf Commands ......................... SUCCESS [7.080s]
[INFO] Apache CXF Bundle Parent .......................... SUCCESS [8.715s]
[INFO] Apache CXF Bundle Jar ............................. SUCCESS [4:37.347s]
[INFO] Apache CXF Minimal Bundle Jar ..................... SUCCESS [3:22.452s]
[INFO] Apache CXF JAX-RS Bundle Jar ...................... SUCCESS [1:39.096s]
[INFO] Apache CXF Compatibility Bundle Jar ............... SUCCESS [3:15.405s]
[INFO] Apache CXF Container Integration System Tests ..... SUCCESS [2.164s]
[INFO] Apache CXF Container Integration Test Webapp ...... SUCCESS [10.341s]
[INFO] Apache CXF Uncategorized System Tests ............. FAILURE [5.304s]
[INFO] Apache CXF Transport System Tests ................. SKIPPED
[INFO] Apache CXF Transport System Tests JMS ............. SKIPPED
[INFO] Apache CXF JAX-WS System Tests .................... SKIPPED
[INFO] Apache CXF Databinding System Tests ............... SKIPPED
[INFO] Apache CXF JAX-RS System Tests .................... SKIPPED
[INFO] Apache CXF WS-* Specifications System Tests ....... SKIPPED
[INFO] Apache CXF WS-RM Specifications System Tests ...... SKIPPED
[INFO] Apache CXF WS-Security System Tests ............... SKIPPED
[INFO] Apache CXF WS-Security Interop System Tests ....... SKIPPED
[INFO] Apache CXF JAX-RS System Advanced Security Tests .. SKIPPED
[INFO] Test for writing wsdl to repo ..................... SKIPPED
[INFO] Test for generating code from wsdl in repo ........ SKIPPED
[INFO] Apache CXF System Tests ........................... SKIPPED
[INFO] Apache CXF System Tests for Maven Plugins ......... SKIPPED
[INFO] Apache CXF Manifest Jar ........................... SKIPPED
[INFO] Apache CXF Samples ................................ SKIPPED
[INFO] Colocated Demo using Document/Literal Style ....... SKIPPED
[INFO] JavaScript Client Demo using Document/Literal Style  SKIPPED
[INFO] Generated JavaScript Sample using JAX-WS and JSR-181  SKIPPED
[INFO] Java First demo service using the JAXWSFactoryBeans  SKIPPED
[INFO] Java First demo using JAX-WS and JMS .............. SKIPPED
[INFO] JAX-RS Content Negotiation Demo ................... SKIPPED
[INFO] JAX-RS Basic Demo With HTTPS communications ....... SKIPPED
[INFO] JAX-RS Basic Demo ................................. SKIPPED
[INFO] CXF sample using a callbak object ................. SKIPPED
[INFO] WSDL first demo using BARE Style in XML Binding (pure XML over HTTP)  SKIPPED
[INFO] JAX-WS Dispatch/Provider Demo ..................... SKIPPED
[INFO] WSDL first demo using Document/Literal Style and XMLBeans DataBinding  SKIPPED
[INFO] WSDL first demo using SOAP12 in Document/Literal Style  SKIPPED
[INFO] CXF Dynamic Client Sample ......................... SKIPPED
[INFO] JMS Transport Queue Demo using Document-Literal Style  SKIPPED
[INFO] WSDL first demo using the jms transport and jmsConfigFeature  SKIPPED
[INFO] RESTful Hello World Demo .......................... SKIPPED
[INFO] WSDL first demo using Document/Literal Style ...... SKIPPED
[INFO] CXF sample using the Aegis Binding without any webservice  SKIPPED
[INFO] Java First demo using JAX-WS APIs ................. SKIPPED
[INFO] WS-RM Demo ........................................ SKIPPED
[INFO] CXF Sample of Stream GZIP Interceptor ............. SKIPPED
[INFO] Spring HTTP Sample ................................ SKIPPED
[INFO] Spring HTTP Servlet demo with ruby support ........ SKIPPED
[INFO] Spring HTTP Servlet demo with groovy support ...... SKIPPED
[INFO] Hello world javascript demo ....................... SKIPPED
[INFO] CXF WS-Security UT Demo ........................... SKIPPED
[INFO] WS-Security UT Sign Demo .......................... SKIPPED
[INFO] CXF WS-Security Sign Encoding Demo ................ SKIPPED
[INFO] WS-Security UT Policy Demo ........................ SKIPPED
[INFO] MTOM Demo for SWA and XOP ......................... SKIPPED
[INFO] JAX-WS Asynchronous Demo using Document/Literal Style  SKIPPED
[INFO] Java First POJO Sample ............................ SKIPPED
[INFO] WS-Policy Demo .................................... SKIPPED
[INFO] Hello World Client Demo using JavaScript .......... SKIPPED
[INFO] WSDL first demo using HTTPS ....................... SKIPPED
[INFO] WS-Addressing Demo ................................ SKIPPED
[INFO] Sample using SOAP Headers ......................... SKIPPED
[INFO] SOAP/JMS Transport Specification Demo using Document-Literal Style  SKIPPED
[INFO] CXF sample using WRAPPED Style in XML Binding (pure XML over HTTP)  SKIPPED
[INFO] CXF sample using code first POJO's and the Aegis Binding  SKIPPED
[INFO] Sample of JAX-* Service Using an Aegis Client ..... SKIPPED
[INFO] JAX-WS Handler Demo ............................... SKIPPED
[INFO] WSDL first demo using RPC-Literal Style ........... SKIPPED
[INFO] JMS Transport Publish/Subscribe Demo using Document-Literal Style  SKIPPED
[INFO] JAX-RS Spring Security Demo ....................... SKIPPED
[INFO] LogBrowser ........................................ SKIPPED
[INFO] WS-Notification Demo .............................. SKIPPED
[INFO] CXF STS Demo ...................................... SKIPPED
[INFO] Bank sample using JAX-WS API's to talk via CORBA/IIOP  SKIPPED
[INFO] Bank sample using JAX-WS API's to talk via CORBA/IIOP  SKIPPED
[INFO] hello-world sample using JAX-WS API's to talk via CORBA/IIOP  SKIPPED
[INFO] OAuth 1.0a server ................................. SKIPPED
[INFO] OAuth 1.0a client ................................. SKIPPED
[INFO] JAX-RS Minimal OSGI Demo .......................... SKIPPED
[INFO] Apache CXF Distribution ........................... SKIPPED
[INFO] ------------------------------------------------------------------------
[INFO] BUILD FAILURE
[INFO] ------------------------------------------------------------------------
[INFO] Total time: 25:40.537s
[INFO] Finished at: Tue Oct 02 06:48:15 UTC 2012
[INFO] Final Memory: 92M/233M
[INFO] ------------------------------------------------------------------------
[ERROR] Failed to execute goal org.apache.maven.plugins:maven-compiler-plugin:2.5.1:testCompile
(default-testCompile) on project cxf-systests-uncategorized: Compilation failure
[ERROR] <https://builds.apache.org/job/CXF-2.6-deploy/ws/cxf-2.6.x-fixes/systests/uncategorized/src/test/java/org/apache/cxf/systest/schema_validation/SchemaValidationImpl.java>:[69,5]
method does not override a method from its superclass
[ERROR] -> [Help 1]
[ERROR] 
[ERROR] To see the full stack trace of the errors, re-run Maven with the -e switch.
[ERROR] Re-run Maven using the -X switch to enable full debug logging.
[ERROR] 
[ERROR] For more information about the errors and possible solutions, please read the following
articles:
[ERROR] [Help 1] http://cwiki.apache.org/confluence/display/MAVEN/MojoFailureException
[ERROR] 
[ERROR] After correcting the problems, you can resume the build with the command
[ERROR]   mvn <goals> -rf :cxf-systests-uncategorized
Build step 'Invoke top-level Maven targets' marked build as failure
ERROR: Maven JVM terminated unexpectedly with exit code 0


Mime
View raw message