cxf-notifications mailing list archives

Site index · List index
Message view « Date » · « Thread »
Top « Date » · « Thread »
From Apache Jenkins Server <jenk...@builds.apache.org>
Subject Build failed in Jenkins: CXF-2.5-deploy » Apache CXF Common Utilities #191
Date Fri, 26 Oct 2012 07:03:17 GMT
See <https://builds.apache.org/job/CXF-2.5-deploy/org.apache.cxf$cxf-common-utilities/191/changes>

Changes:

[dkulp] Merged revisions 1402164 via  git cherry-pick from
https://svn.apache.org/repos/asf/cxf/branches/2.6.x-fixes

........
  r1402164 | dkulp | 2012-10-25 10:30:14 -0400 (Thu, 25 Oct 2012) | 10 lines

  Merged revisions 1402160 via  git cherry-pick from
  https://svn.apache.org/repos/asf/cxf/trunk

  ........
    r1402160 | dkulp | 2012-10-25 10:21:24 -0400 (Thu, 25 Oct 2012) | 2 lines

    [CXF-4602] Some improvements to the logger creation

  ........

........

------------------------------------------
[INFO] ------------------------------------------------------------------------
[INFO] Building Apache CXF Common Utilities
[INFO]    task-segment: [clean, install]
[INFO] ------------------------------------------------------------------------
[INFO] [clean:clean {execution: default-clean}]
[INFO] Deleting <https://builds.apache.org/job/CXF-2.5-deploy/org.apache.cxf$cxf-common-utilities/ws/target>
[INFO] [cxf-xml2fastinfoset:xml2fastinfoset {execution: xml2fastinfoset}]
[WARNING] The parameter expression: 'project.build.resources' used in mojo: 'process' has
been deprecated. Use 'project.resources' instead.
[INFO] [remote-resources:process {execution: default}]
[debug] execute contextualize
[INFO] [resources:resources {execution: default-resources}]
[INFO] Using 'UTF-8' encoding to copy filtered resources.
[INFO] Copying 8 resources
[INFO] Copying 2 resources
[INFO] Copying 1 resource
[INFO] skip non existing resourceDirectory <https://builds.apache.org/job/CXF-2.5-deploy/org.apache.cxf$cxf-common-utilities/ws/target/generated/src/main/resources>
[INFO] Copying 3 resources
[INFO] [compiler:compile {execution: default-compile}]
[INFO] Compiling 147 source files to <https://builds.apache.org/job/CXF-2.5-deploy/org.apache.cxf$cxf-common-utilities/ws/target/classes>
[INFO] -------------------------------------------------------------
[ERROR] COMPILATION ERROR : 
[INFO] -------------------------------------------------------------
[ERROR] <https://builds.apache.org/job/CXF-2.5-deploy/org.apache.cxf$cxf-common-utilities/ws/src/main/java/org/apache/cxf/common/logging/LogUtils.java>:[231,0]
illegal start of expression
[ERROR] <https://builds.apache.org/job/CXF-2.5-deploy/org.apache.cxf$cxf-common-utilities/ws/src/main/java/org/apache/cxf/common/logging/LogUtils.java>:[234,68]
';' expected
[ERROR] <https://builds.apache.org/job/CXF-2.5-deploy/org.apache.cxf$cxf-common-utilities/ws/src/main/java/org/apache/cxf/common/logging/LogUtils.java>:[234,73]
<identifier> expected
[ERROR] <https://builds.apache.org/job/CXF-2.5-deploy/org.apache.cxf$cxf-common-utilities/ws/src/main/java/org/apache/cxf/common/logging/LogUtils.java>:[234,82]
'{' expected
[ERROR] <https://builds.apache.org/job/CXF-2.5-deploy/org.apache.cxf$cxf-common-utilities/ws/src/main/java/org/apache/cxf/common/logging/LogUtils.java>:[234,87]
<identifier> expected
[ERROR] <https://builds.apache.org/job/CXF-2.5-deploy/org.apache.cxf$cxf-common-utilities/ws/src/main/java/org/apache/cxf/common/logging/LogUtils.java>:[234,88]
'{' expected
[ERROR] <https://builds.apache.org/job/CXF-2.5-deploy/org.apache.cxf$cxf-common-utilities/ws/src/main/java/org/apache/cxf/common/logging/LogUtils.java>:[235,16]
illegal start of type
[ERROR] <https://builds.apache.org/job/CXF-2.5-deploy/org.apache.cxf$cxf-common-utilities/ws/src/main/java/org/apache/cxf/common/logging/LogUtils.java>:[264,75]
<identifier> expected
[ERROR] <https://builds.apache.org/job/CXF-2.5-deploy/org.apache.cxf$cxf-common-utilities/ws/src/main/java/org/apache/cxf/common/logging/LogUtils.java>:[264,80]
<identifier> expected
[ERROR] <https://builds.apache.org/job/CXF-2.5-deploy/org.apache.cxf$cxf-common-utilities/ws/src/main/java/org/apache/cxf/common/logging/LogUtils.java>:[264,89]
'{' expected
[ERROR] <https://builds.apache.org/job/CXF-2.5-deploy/org.apache.cxf$cxf-common-utilities/ws/src/main/java/org/apache/cxf/common/logging/LogUtils.java>:[264,94]
<identifier> expected
[ERROR] <https://builds.apache.org/job/CXF-2.5-deploy/org.apache.cxf$cxf-common-utilities/ws/src/main/java/org/apache/cxf/common/logging/LogUtils.java>:[264,95]
'{' expected
[ERROR] <https://builds.apache.org/job/CXF-2.5-deploy/org.apache.cxf$cxf-common-utilities/ws/src/main/java/org/apache/cxf/common/logging/LogUtils.java>:[265,20]
illegal start of type
[ERROR] <https://builds.apache.org/job/CXF-2.5-deploy/org.apache.cxf$cxf-common-utilities/ws/src/main/java/org/apache/cxf/common/logging/LogUtils.java>:[286,16]
<identifier> expected
[ERROR] <https://builds.apache.org/job/CXF-2.5-deploy/org.apache.cxf$cxf-common-utilities/ws/src/main/java/org/apache/cxf/common/logging/LogUtils.java>:[286,18]
illegal start of type
[ERROR] <https://builds.apache.org/job/CXF-2.5-deploy/org.apache.cxf$cxf-common-utilities/ws/src/main/java/org/apache/cxf/common/logging/LogUtils.java>:[290,12]
<identifier> expected
[ERROR] <https://builds.apache.org/job/CXF-2.5-deploy/org.apache.cxf$cxf-common-utilities/ws/src/main/java/org/apache/cxf/common/logging/LogUtils.java>:[291,12]
illegal start of type
[ERROR] <https://builds.apache.org/job/CXF-2.5-deploy/org.apache.cxf$cxf-common-utilities/ws/src/main/java/org/apache/cxf/common/logging/LogUtils.java>:[307,8]
<identifier> expected
[ERROR] <https://builds.apache.org/job/CXF-2.5-deploy/org.apache.cxf$cxf-common-utilities/ws/src/main/java/org/apache/cxf/common/logging/LogUtils.java>:[307,10]
illegal start of type
[ERROR] <https://builds.apache.org/job/CXF-2.5-deploy/org.apache.cxf$cxf-common-utilities/ws/src/main/java/org/apache/cxf/common/logging/LogUtils.java>:[312,4]
<identifier> expected
[ERROR] <https://builds.apache.org/job/CXF-2.5-deploy/org.apache.cxf$cxf-common-utilities/ws/src/main/java/org/apache/cxf/common/logging/LogUtils.java>:[323,4]
illegal start of expression
[ERROR] <https://builds.apache.org/job/CXF-2.5-deploy/org.apache.cxf$cxf-common-utilities/ws/src/main/java/org/apache/cxf/common/logging/LogUtils.java>:[436,32]
';' expected
[ERROR] <https://builds.apache.org/job/CXF-2.5-deploy/org.apache.cxf$cxf-common-utilities/ws/src/main/java/org/apache/cxf/common/logging/LogUtils.java>:[436,37]
<identifier> expected
[ERROR] <https://builds.apache.org/job/CXF-2.5-deploy/org.apache.cxf$cxf-common-utilities/ws/src/main/java/org/apache/cxf/common/logging/LogUtils.java>:[436,47]
'{' expected
[ERROR] <https://builds.apache.org/job/CXF-2.5-deploy/org.apache.cxf$cxf-common-utilities/ws/src/main/java/org/apache/cxf/common/logging/LogUtils.java>:[437,8]
illegal start of type
[ERROR] <https://builds.apache.org/job/CXF-2.5-deploy/org.apache.cxf$cxf-common-utilities/ws/src/main/java/org/apache/cxf/common/logging/LogUtils.java>:[445,23]
<identifier> expected
[ERROR] <https://builds.apache.org/job/CXF-2.5-deploy/org.apache.cxf$cxf-common-utilities/ws/src/main/java/org/apache/cxf/common/logging/LogUtils.java>:[455,4]
illegal start of expression
[ERROR] no more tokens - could not parse error message: <https://builds.apache.org/job/CXF-2.5-deploy/org.apache.cxf$cxf-common-utilities/ws/src/main/java/org/apache/cxf/common/logging/LogUtils.java>:464:
';' expected
^

[ERROR] no more tokens - could not parse error message: <https://builds.apache.org/job/CXF-2.5-deploy/org.apache.cxf$cxf-common-utilities/ws/src/main/java/org/apache/cxf/common/logging/LogUtils.java>:466:
'}' expected
^

[INFO] 29 errors 
[INFO] -------------------------------------------------------------
[JENKINS] Archiving <https://builds.apache.org/job/CXF-2.5-deploy/org.apache.cxf$cxf-common-utilities/ws/pom.xml>
to /home/hudson/hudson/jobs/CXF-2.5-deploy/modules/org.apache.cxf$cxf-common-utilities/builds/2012-10-26_07-02-52/archive/org.apache.cxf/cxf-common-utilities/2.5.7-SNAPSHOT/cxf-common-utilities-2.5.7-SNAPSHOT.pom
[INFO] ------------------------------------------------------------------------
[ERROR] BUILD FAILURE
[INFO] ------------------------------------------------------------------------
[INFO] Compilation failure

<https://builds.apache.org/job/CXF-2.5-deploy/org.apache.cxf$cxf-common-utilities/ws/src/main/java/org/apache/cxf/common/logging/LogUtils.java>:[231,0]
illegal start of expression
<https://builds.apache.org/job/CXF-2.5-deploy/org.apache.cxf$cxf-common-utilities/ws/src/main/java/org/apache/cxf/common/logging/LogUtils.java>:[234,68]
';' expected
<https://builds.apache.org/job/CXF-2.5-deploy/org.apache.cxf$cxf-common-utilities/ws/src/main/java/org/apache/cxf/common/logging/LogUtils.java>:[234,73]
<identifier> expected
<https://builds.apache.org/job/CXF-2.5-deploy/org.apache.cxf$cxf-common-utilities/ws/src/main/java/org/apache/cxf/common/logging/LogUtils.java>:[234,82]
'{' expected
<https://builds.apache.org/job/CXF-2.5-deploy/org.apache.cxf$cxf-common-utilities/ws/src/main/java/org/apache/cxf/common/logging/LogUtils.java>:[234,87]
<identifier> expected
<https://builds.apache.org/job/CXF-2.5-deploy/org.apache.cxf$cxf-common-utilities/ws/src/main/java/org/apache/cxf/common/logging/LogUtils.java>:[234,88]
'{' expected
<https://builds.apache.org/job/CXF-2.5-deploy/org.apache.cxf$cxf-common-utilities/ws/src/main/java/org/apache/cxf/common/logging/LogUtils.java>:[235,16]
illegal start of type
<https://builds.apache.org/job/CXF-2.5-deploy/org.apache.cxf$cxf-common-utilities/ws/src/main/java/org/apache/cxf/common/logging/LogUtils.java>:[264,75]
<identifier> expected
<https://builds.apache.org/job/CXF-2.5-deploy/org.apache.cxf$cxf-common-utilities/ws/src/main/java/org/apache/cxf/common/logging/LogUtils.java>:[264,80]
<identifier> expected
<https://builds.apache.org/job/CXF-2.5-deploy/org.apache.cxf$cxf-common-utilities/ws/src/main/java/org/apache/cxf/common/logging/LogUtils.java>:[264,89]
'{' expected
<https://builds.apache.org/job/CXF-2.5-deploy/org.apache.cxf$cxf-common-utilities/ws/src/main/java/org/apache/cxf/common/logging/LogUtils.java>:[264,94]
<identifier> expected
<https://builds.apache.org/job/CXF-2.5-deploy/org.apache.cxf$cxf-common-utilities/ws/src/main/java/org/apache/cxf/common/logging/LogUtils.java>:[264,95]
'{' expected
<https://builds.apache.org/job/CXF-2.5-deploy/org.apache.cxf$cxf-common-utilities/ws/src/main/java/org/apache/cxf/common/logging/LogUtils.java>:[265,20]
illegal start of type
<https://builds.apache.org/job/CXF-2.5-deploy/org.apache.cxf$cxf-common-utilities/ws/src/main/java/org/apache/cxf/common/logging/LogUtils.java>:[286,16]
<identifier> expected
<https://builds.apache.org/job/CXF-2.5-deploy/org.apache.cxf$cxf-common-utilities/ws/src/main/java/org/apache/cxf/common/logging/LogUtils.java>:[286,18]
illegal start of type
<https://builds.apache.org/job/CXF-2.5-deploy/org.apache.cxf$cxf-common-utilities/ws/src/main/java/org/apache/cxf/common/logging/LogUtils.java>:[290,12]
<identifier> expected
<https://builds.apache.org/job/CXF-2.5-deploy/org.apache.cxf$cxf-common-utilities/ws/src/main/java/org/apache/cxf/common/logging/LogUtils.java>:[291,12]
illegal start of type
<https://builds.apache.org/job/CXF-2.5-deploy/org.apache.cxf$cxf-common-utilities/ws/src/main/java/org/apache/cxf/common/logging/LogUtils.java>:[307,8]
<identifier> expected
<https://builds.apache.org/job/CXF-2.5-deploy/org.apache.cxf$cxf-common-utilities/ws/src/main/java/org/apache/cxf/common/logging/LogUtils.java>:[307,10]
illegal start of type
<https://builds.apache.org/job/CXF-2.5-deploy/org.apache.cxf$cxf-common-utilities/ws/src/main/java/org/apache/cxf/common/logging/LogUtils.java>:[312,4]
<identifier> expected
<https://builds.apache.org/job/CXF-2.5-deploy/org.apache.cxf$cxf-common-utilities/ws/src/main/java/org/apache/cxf/common/logging/LogUtils.java>:[323,4]
illegal start of expression
<https://builds.apache.org/job/CXF-2.5-deploy/org.apache.cxf$cxf-common-utilities/ws/src/main/java/org/apache/cxf/common/logging/LogUtils.java>:[436,32]
';' expected
<https://builds.apache.org/job/CXF-2.5-deploy/org.apache.cxf$cxf-common-utilities/ws/src/main/java/org/apache/cxf/common/logging/LogUtils.java>:[436,37]
<identifier> expected
<https://builds.apache.org/job/CXF-2.5-deploy/org.apache.cxf$cxf-common-utilities/ws/src/main/java/org/apache/cxf/common/logging/LogUtils.java>:[436,47]
'{' expected
<https://builds.apache.org/job/CXF-2.5-deploy/org.apache.cxf$cxf-common-utilities/ws/src/main/java/org/apache/cxf/common/logging/LogUtils.java>:[437,8]
illegal start of type
<https://builds.apache.org/job/CXF-2.5-deploy/org.apache.cxf$cxf-common-utilities/ws/src/main/java/org/apache/cxf/common/logging/LogUtils.java>:[445,23]
<identifier> expected
<https://builds.apache.org/job/CXF-2.5-deploy/org.apache.cxf$cxf-common-utilities/ws/src/main/java/org/apache/cxf/common/logging/LogUtils.java>:[455,4]
illegal start of expression
no more tokens - could not parse error message: <https://builds.apache.org/job/CXF-2.5-deploy/org.apache.cxf$cxf-common-utilities/ws/src/main/java/org/apache/cxf/common/logging/LogUtils.java>:464:
';' expected
^

no more tokens - could not parse error message: <https://builds.apache.org/job/CXF-2.5-deploy/org.apache.cxf$cxf-common-utilities/ws/src/main/java/org/apache/cxf/common/logging/LogUtils.java>:466:
'}' expected
^


[INFO] ------------------------------------------------------------------------
[INFO] Trace
org.apache.maven.BuildFailureException: Compilation failure
	at org.apache.maven.lifecycle.DefaultLifecycleExecutor.executeGoals(DefaultLifecycleExecutor.java:715)
	at org.apache.maven.lifecycle.DefaultLifecycleExecutor.executeGoalWithLifecycle(DefaultLifecycleExecutor.java:556)
	at org.apache.maven.lifecycle.DefaultLifecycleExecutor.executeGoal(DefaultLifecycleExecutor.java:535)
	at org.apache.maven.lifecycle.DefaultLifecycleExecutor.executeGoalAndHandleFailures(DefaultLifecycleExecutor.java:387)
	at org.apache.maven.lifecycle.DefaultLifecycleExecutor.executeTaskSegments(DefaultLifecycleExecutor.java:348)
	at org.apache.maven.lifecycle.DefaultLifecycleExecutor.execute(DefaultLifecycleExecutor.java:180)
	at org.apache.maven.lifecycle.LifecycleExecutorInterceptor.execute(LifecycleExecutorInterceptor.java:65)
	at org.apache.maven.DefaultMaven.doExecute(DefaultMaven.java:328)
	at org.apache.maven.DefaultMaven.execute(DefaultMaven.java:138)
	at org.apache.maven.cli.MavenCli.main(MavenCli.java:362)
	at sun.reflect.NativeMethodAccessorImpl.invoke0(Native Method)
	at sun.reflect.NativeMethodAccessorImpl.invoke(NativeMethodAccessorImpl.java:39)
	at sun.reflect.DelegatingMethodAccessorImpl.invoke(DelegatingMethodAccessorImpl.java:25)
	at java.lang.reflect.Method.invoke(Method.java:592)
	at org.codehaus.classworlds.Launcher.launchEnhanced(Launcher.java:315)
	at org.codehaus.classworlds.Launcher.launch(Launcher.java:255)
	at hudson.maven.agent.Main.launch(Main.java:185)
	at hudson.maven.MavenBuilder.call(MavenBuilder.java:151)
	at hudson.maven.Maven2Builder.call(Maven2Builder.java:77)
	at hudson.maven.Maven2Builder.call(Maven2Builder.java:53)
	at hudson.remoting.UserRequest.perform(UserRequest.java:118)
	at hudson.remoting.UserRequest.perform(UserRequest.java:48)
	at hudson.remoting.Request$2.run(Request.java:326)
	at hudson.remoting.InterceptingExecutorService$1.call(InterceptingExecutorService.java:72)
	at java.util.concurrent.FutureTask$Sync.innerRun(FutureTask.java:269)
	at java.util.concurrent.FutureTask.run(FutureTask.java:123)
	at java.util.concurrent.ThreadPoolExecutor$Worker.runTask(ThreadPoolExecutor.java:651)
	at java.util.concurrent.ThreadPoolExecutor$Worker.run(ThreadPoolExecutor.java:676)
	at java.lang.Thread.run(Thread.java:595)
Caused by: org.apache.maven.plugin.CompilationFailureException: Compilation failure
	at org.apache.maven.plugin.AbstractCompilerMojo.execute(AbstractCompilerMojo.java:729)
	at org.apache.maven.plugin.CompilerMojo.execute(CompilerMojo.java:128)
	at org.apache.maven.plugin.DefaultPluginManager.executeMojo(DefaultPluginManager.java:490)
	at hudson.maven.agent.PluginManagerInterceptor.executeMojo(PluginManagerInterceptor.java:182)
	at org.apache.maven.lifecycle.DefaultLifecycleExecutor.executeGoals(DefaultLifecycleExecutor.java:694)
	... 28 more
[INFO] ------------------------------------------------------------------------
[INFO] Total time: 16 seconds
[INFO] Finished at: Fri Oct 26 07:03:16 GMT 2012
[INFO] Final Memory: 67M/150M
[INFO] ------------------------------------------------------------------------
Waiting for Jenkins to finish collecting data

Mime
View raw message