cxf-notifications mailing list archives

Site index · List index
Message view « Date » · « Thread »
Top « Date » · « Thread »
From Apache Jenkins Server <jenk...@builds.apache.org>
Subject Build failed in Jenkins: CXF-2.6-deploy » Apache CXF JAX-RS System Tests #91
Date Wed, 17 Oct 2012 07:39:41 GMT
See <https://builds.apache.org/job/CXF-2.6-deploy/org.apache.cxf.systests$cxf-systests-jaxrs/91/changes>

Changes:

[sergeyb] Merged revisions 1398302 via svnmerge from 
https://svn.apache.org/repos/asf/cxf/trunk

........
  r1398302 | sergeyb | 2012-10-15 15:27:07 +0100 (Mon, 15 Oct 2012) | 1 line
  
  [CXF-4563] Fixing the way empty responses are read on the client side
........

------------------------------------------
projectStarted org.apache.cxf.systests:cxf-systests-jaxrs:2.6.4-SNAPSHOT
[INFO]                                                                         
[INFO] ------------------------------------------------------------------------
[INFO] Building Apache CXF JAX-RS System Tests 2.6.4-SNAPSHOT
[INFO] ------------------------------------------------------------------------
mojoStarted org.apache.maven.plugins:maven-clean-plugin:2.5(default-clean)[INFO] Deleting
<https://builds.apache.org/job/CXF-2.6-deploy/org.apache.cxf.systests$cxf-systests-jaxrs/ws/target>

[INFO] 
[INFO] --- maven-clean-plugin:2.5:clean (default-clean) @ cxf-systests-jaxrs ---
mojoSucceeded org.apache.maven.plugins:maven-clean-plugin:2.5(default-clean)
mojoStarted org.apache.felix:maven-bundle-plugin:2.3.7(versions)
[INFO] 
[INFO] --- maven-bundle-plugin:2.3.7:cleanVersions (versions) @ cxf-systests-jaxrs ---
mojoSucceeded org.apache.felix:maven-bundle-plugin:2.3.7(versions)
mojoStarted org.apache.cxf.build-utils:cxf-xml2fastinfoset-plugin:2.4.1(xml2fastinfoset)
[INFO] 
[INFO] --- cxf-xml2fastinfoset-plugin:2.4.1:xml2fastinfoset (xml2fastinfoset) @ cxf-systests-jaxrs
---
mojoSucceeded org.apache.cxf.build-utils:cxf-xml2fastinfoset-plugin:2.4.1(xml2fastinfoset)
mojoStarted org.jibx:jibx-maven-plugin:1.2.4.5(generate-java-code-from-schema)
[INFO] 
[INFO] --- jibx-maven-plugin:1.2.4.5:schema-codegen (generate-java-code-from-schema) @ cxf-systests-jaxrs
---
[INFO] Generating Java sources in target/generated/src/main/java from schemas available in
src/test/resources/jibx...
Loaded and validated 1 specified schema(s)
Generated 1 top-level classes in package org.apache.cxf.systest.jaxrs.codegen.jibx
Total classes in model: 1
mojoSucceeded org.jibx:jibx-maven-plugin:1.2.4.5(generate-java-code-from-schema)
mojoStarted org.apache.cxf:cxf-wadl2java-plugin:2.6.4-SNAPSHOT(generate-sources)
[INFO] 
[INFO] --- cxf-wadl2java-plugin:2.6.4-SNAPSHOT:wadl2java (generate-sources) @ cxf-systests-jaxrs
---
Oct 17, 2012 7:33:23 AM org.apache.cxf.common.jaxb.JAXBUtils logGeneratedClassNames
INFO: Created classes: org.apache.cxf.systest.jaxrs.codegen.schema.Book, org.apache.cxf.systest.jaxrs.codegen.schema.Book2,
org.apache.cxf.systest.jaxrs.codegen.schema.Chapter, org.apache.cxf.systest.jaxrs.codegen.schema.ObjectFactory
mojoSucceeded org.apache.cxf:cxf-wadl2java-plugin:2.6.4-SNAPSHOT(generate-sources)
mojoStarted org.apache.maven.plugins:maven-remote-resources-plugin:1.3(default)
[INFO] 
[INFO] --- maven-remote-resources-plugin:1.3:process (default) @ cxf-systests-jaxrs ---
mojoSucceeded org.apache.maven.plugins:maven-remote-resources-plugin:1.3(default)
mojoStarted org.apache.maven.plugins:maven-resources-plugin:2.5(default-resources)[debug]
execute contextualize
[INFO] Using 'UTF-8' encoding to copy filtered resources.
[INFO] skip non existing resourceDirectory <https://builds.apache.org/job/CXF-2.6-deploy/org.apache.cxf.systests$cxf-systests-jaxrs/ws/src/main/java>
[INFO] skip non existing resourceDirectory <https://builds.apache.org/job/CXF-2.6-deploy/org.apache.cxf.systests$cxf-systests-jaxrs/ws/src/main/resources>
[INFO] skip non existing resourceDirectory <https://builds.apache.org/job/CXF-2.6-deploy/org.apache.cxf.systests$cxf-systests-jaxrs/ws/src/main/resources-filtered>
[INFO] skip non existing resourceDirectory <https://builds.apache.org/job/CXF-2.6-deploy/org.apache.cxf.systests$cxf-systests-jaxrs/ws/target/generated/src/main/resources>
[INFO] Copying 3 resources

[INFO] 
[INFO] --- maven-resources-plugin:2.5:resources (default-resources) @ cxf-systests-jaxrs ---
mojoSucceeded org.apache.maven.plugins:maven-resources-plugin:2.5(default-resources)
mojoStarted org.apache.maven.plugins:maven-compiler-plugin:2.5.1(default-compile)[INFO] Compiling
7 source files to <https://builds.apache.org/job/CXF-2.6-deploy/org.apache.cxf.systests$cxf-systests-jaxrs/ws/target/classes>

[INFO] 
[INFO] --- maven-compiler-plugin:2.5.1:compile (default-compile) @ cxf-systests-jaxrs ---
mojoSucceeded org.apache.maven.plugins:maven-compiler-plugin:2.5.1(default-compile)
mojoStarted org.apache.felix:maven-bundle-plugin:2.3.7(bundle-manifest)
[INFO] 
[INFO] --- maven-bundle-plugin:2.3.7:manifest (bundle-manifest) @ cxf-systests-jaxrs ---
mojoSucceeded org.apache.felix:maven-bundle-plugin:2.3.7(bundle-manifest)
mojoStarted org.jibx:jibx-maven-plugin:1.2.4.5(compile-binding)[INFO] Running JiBX binding
compiler (single-module mode) on 1 binding file(s)

[INFO] 
[INFO] --- jibx-maven-plugin:1.2.4.5:bind (compile-binding) @ cxf-systests-jaxrs ---
Verification failure on class org.apache.cxf.systest.jaxrs.codegen.jibx.Book:
  VERIFIED_REJECTED
Repository.lookup() failed. FILE NOT FOUND?

Verification failure on class org.apache.cxf.systest.jaxrs.codegen.jibx.JiBX_bindingBook_access:
  VERIFIED_REJECTED
Repository.lookup() failed. FILE NOT FOUND?

Verification failure on class org.apache.cxf.systest.jaxrs.codegen.jibx.JiBX_bindingFactory:
  VERIFIED_REJECTED
Repository.lookup() failed. FILE NOT FOUND?

mojoSucceeded org.jibx:jibx-maven-plugin:1.2.4.5(compile-binding)
mojoStarted org.apache.maven.plugins:maven-resources-plugin:2.5(default-testResources)[debug]
execute contextualize
[INFO] Using 'UTF-8' encoding to copy filtered resources.

[INFO] 
[INFO] --- maven-resources-plugin:2.5:testResources (default-testResources) @ cxf-systests-jaxrs
---
[INFO] Copying 101 resources
[INFO] Copying 57 resources
[INFO] skip non existing resourceDirectory <https://builds.apache.org/job/CXF-2.6-deploy/org.apache.cxf.systests$cxf-systests-jaxrs/ws/target/generated/src/test/resources>
[INFO] Copying 3 resources
mojoSucceeded org.apache.maven.plugins:maven-resources-plugin:2.5(default-testResources)
mojoStarted org.apache.maven.plugins:maven-compiler-plugin:2.5.1(default-testCompile)
[INFO] 
[INFO] --- maven-compiler-plugin:2.5.1:testCompile (default-testCompile) @ cxf-systests-jaxrs
---
[INFO] Compiling 164 source files to <https://builds.apache.org/job/CXF-2.6-deploy/org.apache.cxf.systests$cxf-systests-jaxrs/ws/target/test-classes>
[INFO] -------------------------------------------------------------
[ERROR] COMPILATION ERROR : 
[INFO] -------------------------------------------------------------
[ERROR] <https://builds.apache.org/job/CXF-2.6-deploy/org.apache.cxf.systests$cxf-systests-jaxrs/ws/src/test/java/org/apache/cxf/systest/jaxrs/JAXRSClientServerBookTest.java>:[1066,21]
cannot find symbol
symbol  : class ClientException
location: class org.apache.cxf.systest.jaxrs.JAXRSClientServerBookTest
[ERROR] <https://builds.apache.org/job/CXF-2.6-deploy/org.apache.cxf.systests$cxf-systests-jaxrs/ws/src/test/java/org/apache/cxf/systest/jaxrs/JAXRSClientServerBookTest.java>:[1071,21]
cannot find symbol
symbol  : class ClientException
location: class org.apache.cxf.systest.jaxrs.JAXRSClientServerBookTest
[ERROR] <https://builds.apache.org/job/CXF-2.6-deploy/org.apache.cxf.systests$cxf-systests-jaxrs/ws/src/test/java/org/apache/cxf/systest/jaxrs/JAXRSClientServerBookTest.java>:[1083,21]
cannot find symbol
symbol  : class ClientException
location: class org.apache.cxf.systest.jaxrs.JAXRSClientServerBookTest
[ERROR] <https://builds.apache.org/job/CXF-2.6-deploy/org.apache.cxf.systests$cxf-systests-jaxrs/ws/src/test/java/org/apache/cxf/systest/jaxrs/JAXRSClientServerBookTest.java>:[1087,13]
cannot find symbol
symbol  : method getEmptyBook()
location: class org.apache.cxf.systest.jaxrs.BookStore
[ERROR] <https://builds.apache.org/job/CXF-2.6-deploy/org.apache.cxf.systests$cxf-systests-jaxrs/ws/src/test/java/org/apache/cxf/systest/jaxrs/JAXRSClientServerBookTest.java>:[1094,24]
cannot find symbol
symbol  : method getEmptyBookNullable()
location: class org.apache.cxf.systest.jaxrs.BookStore
[INFO] 5 errors 
[INFO] -------------------------------------------------------------
mojoFailed org.apache.maven.plugins:maven-compiler-plugin:2.5.1(default-testCompile)
projectFailed org.apache.cxf.systests:cxf-systests-jaxrs:2.6.4-SNAPSHOT

Mime
View raw message