cxf-notifications mailing list archives

Site index · List index
Message view « Date » · « Thread »
Top « Date » · « Thread »
From Apache Jenkins Server <jenk...@builds.apache.org>
Subject Build failed in Jenkins: CXF-2.5-deploy #191
Date Fri, 26 Oct 2012 07:03:47 GMT
See <https://builds.apache.org/job/CXF-2.5-deploy/191/changes>

Changes:

[dkulp] Blocking revisions 1397001,1398460,1398461,1398871,1399305,1399994,1400966,1400971,1400972,1400975,1400980,1400990,1401003,1401435,1401436,1401438,1401440,1401441,1401608,1401769,1401770,1401771,1401806,1401807,1401883,1402165,1402166
via  git from
https://svn.apache.org/repos/asf/cxf/branches/2.6.x-fixes

[dkulp] Recording revisions 1399304,1401434,1401437,1401439,1401463,1401768,1401805,1402164
via  git from
https://svn.apache.org/repos/asf/cxf/branches/2.6.x-fixes

[dkulp] Merged revisions 1402164 via  git cherry-pick from
https://svn.apache.org/repos/asf/cxf/branches/2.6.x-fixes

........
  r1402164 | dkulp | 2012-10-25 10:30:14 -0400 (Thu, 25 Oct 2012) | 10 lines

  Merged revisions 1402160 via  git cherry-pick from
  https://svn.apache.org/repos/asf/cxf/trunk

  ........
    r1402160 | dkulp | 2012-10-25 10:21:24 -0400 (Thu, 25 Oct 2012) | 2 lines

    [CXF-4602] Some improvements to the logger creation

  ........

........

[dkulp] Merged revisions 1401805 via  git cherry-pick from
https://svn.apache.org/repos/asf/cxf/branches/2.6.x-fixes

........
  r1401805 | dkulp | 2012-10-24 14:17:09 -0400 (Wed, 24 Oct 2012) | 11 lines

  Merged revisions 1401791 via  git cherry-pick from
  https://svn.apache.org/repos/asf/cxf/trunk

  ........
    r1401791 | dkulp | 2012-10-24 13:32:25 -0400 (Wed, 24 Oct 2012) | 3 lines

    [CXF-4595] RequireClientCertificate is not validated
    Patch from Jason Pell applied

  ........

........

[dkulp] Merged revisions 1401768 via  git cherry-pick from
https://svn.apache.org/repos/asf/cxf/branches/2.6.x-fixes

........
  r1401768 | dkulp | 2012-10-24 12:38:31 -0400 (Wed, 24 Oct 2012) | 10 lines

  Merged revisions 1401763 via  git cherry-pick from
  https://svn.apache.org/repos/asf/cxf/trunk

  ........
    r1401763 | dkulp | 2012-10-24 12:25:02 -0400 (Wed, 24 Oct 2012) | 2 lines

    [CXF-4598] Problem with resolving imports/includes with validation turned on.

  ........

........

[dkulp] Merged revisions 1401463 via  git cherry-pick from
https://svn.apache.org/repos/asf/cxf/branches/2.6.x-fixes

........
  r1401463 | dkulp | 2012-10-23 16:54:38 -0400 (Tue, 23 Oct 2012) | 2 lines

  Apparently something in JAXB 2.2.6 is not Java 5 compatible anymore

........

[dkulp] Merged revisions 1401439 via  git cherry-pick from
https://svn.apache.org/repos/asf/cxf/branches/2.6.x-fixes

........
  r1401439 | dkulp | 2012-10-23 16:19:25 -0400 (Tue, 23 Oct 2012) | 10 lines

  Merged revisions 1401419 via  git cherry-pick from
  https://svn.apache.org/repos/asf/cxf/trunk

  ........
    r1401419 | dkulp | 2012-10-23 15:50:50 -0400 (Tue, 23 Oct 2012) | 2 lines

    [CXF-4564] Try to work around a bug in JAXB 2.2 that causes problems if the initial source
location is a jar: URL but imports/includes are then absolute URL's.  Not a complete workaround,
but at least helps SOME cases.

  ........

........

[dkulp] Merged revisions 1401437 via  git cherry-pick from
https://svn.apache.org/repos/asf/cxf/branches/2.6.x-fixes

........
  r1401437 | dkulp | 2012-10-23 16:19:17 -0400 (Tue, 23 Oct 2012) | 10 lines

  Merged revisions 1400213 via  git cherry-pick from
  https://svn.apache.org/repos/asf/cxf/trunk

  ........
    r1400213 | dkulp | 2012-10-19 14:37:10 -0400 (Fri, 19 Oct 2012) | 2 lines

    Updates to support the latest JAXB impl

  ........

........

[dkulp] Merged revisions 1401434 via  git cherry-pick from
https://svn.apache.org/repos/asf/cxf/branches/2.6.x-fixes

........
  r1401434 | dkulp | 2012-10-23 16:19:06 -0400 (Tue, 23 Oct 2012) | 10 lines

  Merged revisions 1398390 via  git cherry-pick from
  https://svn.apache.org/repos/asf/cxf/trunk

  ........
    r1398390 | dkulp | 2012-10-15 13:12:05 -0400 (Mon, 15 Oct 2012) | 2 lines

    Minor plugin version updates

  ........

........

[dkulp] Merged revisions 1399304 via  git cherry-pick from
https://svn.apache.org/repos/asf/cxf/branches/2.6.x-fixes

........
  r1399304 | dkulp | 2012-10-17 11:23:25 -0400 (Wed, 17 Oct 2012) | 10 lines

  Merged revisions 1399301 via  git cherry-pick from
  https://svn.apache.org/repos/asf/cxf/trunk

  ........
    r1399301 | dkulp | 2012-10-17 11:13:17 -0400 (Wed, 17 Oct 2012) | 2 lines

    [CXF-4570] Some minor cleanup around the content-id and saaj

  ........

........

[ay] fix svn merge error for r1402114

[ay] Merged revisions 1402092 via  svn merge from
https://svn.apache.org/repos/asf/cxf/branches/2.6.x-fixes

........
  r1402092 | ay | 2012-10-25 12:47:43 +0200 (Thu, 25 Oct 2012) | 9 lines
  
  Merged revisions 1402084 via  svn merge from
  https://svn.apache.org/repos/asf/cxf/trunk
  
  ........
    r1402084 | ay | 2012-10-25 12:29:56 +0200 (Thu, 25 Oct 2012) | 1 line
    
    [CXF-4601] invlaid WS-RM messages to a robust WS-RM endpoint may lead to NPE
  ........
  
........

------------------------------------------
[...truncated 541 lines...]
[INFO]   RESTful Hello World Demo
[INFO]   WSDL first demo using Document/Literal Style
[INFO]   CXF sample using the Aegis Binding without any webservice
[INFO]   Java First demo using JAX-WS APIs
[INFO]   WS-RM Demo
[INFO]   CXF Sample of Stream GZIP Interceptor
[INFO]   Spring HTTP Sample
[INFO]   Spring HTTP Servlet demo with ruby support
[INFO]   Spring HTTP Servlet demo with groovy support
[INFO]   Hello world javascript demo
[INFO]   CXF WS-Security UT Demo
[INFO]   WS-Security UT Sign Demo
[INFO]   CXF WS-Security Sign Encoding Demo
[INFO]   WS-Security UT Policy Demo
[INFO]   MTOM Demo for SWA and XOP
[INFO]   JAX-WS Asynchronous Demo using Document/Literal Style
[INFO]   Java First POJO Sample
[INFO]   WS-Policy Demo
[INFO]   Hello World Client Demo using JavaScript
[INFO]   WSDL first demo using HTTPS
[INFO]   WS-Addressing Demo
[INFO]   Sample using SOAP Headers
[INFO]   SOAP/JMS Transport Specification Demo using Document-Literal Style
[INFO]   CXF sample using WRAPPED Style in XML Binding (pure XML over HTTP)
[INFO]   RESTful HTTP Binding Demo
[INFO]   CXF sample using code first POJO's and the Aegis Binding
[INFO]   Sample of JAX-* Service Using an Aegis Client
[INFO]   JAX-WS Handler Demo
[INFO]   WSDL first demo using RPC-Literal Style
[INFO]   JMS Transport Publish/Subscribe Demo using Document-Literal Style
[INFO]   JAX-RS Spring Security Demo
[INFO]   LogBrowser
[INFO]   WS-Notification Demo
[INFO]   CXF STS Demo
[INFO]   Bank sample using JAX-WS API's to talk via CORBA/IIOP
[INFO]   Bank sample using JAX-WS API's to talk via CORBA/IIOP
[INFO]   hello-world sample using JAX-WS API's to talk via CORBA/IIOP
[INFO]   OAuth 1.0a server
[INFO]   OAuth 1.0a client
[INFO]   JAX-RS Minimal OSGI Demo
[INFO]   Apache CXF Distribution
[WARNING] POM for 'biz.aQute:bndlib:pom:1.50.0:runtime' is invalid.

Its dependencies (if any) will NOT be available to the current build.
[INFO] ------------------------------------------------------------------------
[INFO] Building Apache CXF
[INFO]    task-segment: [deploy]
[INFO] ------------------------------------------------------------------------
Downloading: http://repo1.maven.org/maven2/org/apache/maven/plugins/maven-site-plugin/3.2/maven-site-plugin-3.2.pom
19K downloaded  (maven-site-plugin-3.2.pom)
Downloading: http://repo1.maven.org/maven2/org/apache/maven/plugins/maven-plugins/23/maven-plugins-23.pom
8K downloaded  (maven-plugins-23.pom)
Downloading: http://repo1.maven.org/maven2/org/apache/maven/maven-parent/22/maven-parent-22.pom
29K downloaded  (maven-parent-22.pom)
Downloading: http://repo1.maven.org/maven2/org/apache/apache/11/apache-11.pom
14K downloaded  (apache-11.pom)
Downloading: http://repo1.maven.org/maven2/org/apache/maven/plugins/maven-site-plugin/3.2/maven-site-plugin-3.2.jar
118K downloaded  (maven-site-plugin-3.2.jar)
Downloading: http://repo1.maven.org/maven2/org/apache/maven/plugins/maven-javadoc-plugin/2.9/maven-javadoc-plugin-2.9.pom
15K downloaded  (maven-javadoc-plugin-2.9.pom)
Downloading: http://repo1.maven.org/maven2/org/apache/maven/plugins/maven-javadoc-plugin/2.9/maven-javadoc-plugin-2.9.jar
353K downloaded  (maven-javadoc-plugin-2.9.jar)
Downloading: http://repo1.maven.org/maven2/org/apache/maven/doxia/doxia-integration-tools/1.5/doxia-integration-tools-1.5.pom
6K downloaded  (doxia-integration-tools-1.5.pom)
Downloading: http://repo1.maven.org/maven2/org/apache/maven/doxia/doxia-tools/2/doxia-tools-2.pom
11K downloaded  (doxia-tools-2.pom)
Downloading: http://repo1.maven.org/maven2/org/apache/maven/doxia/doxia-integration-tools/1.5/doxia-integration-tools-1.5.jar
44K downloaded  (doxia-integration-tools-1.5.jar)
[INFO] [site:attach-descriptor {execution: default-attach-descriptor}]
[INFO] [source:jar-no-fork {execution: attach-sources}]
Downloading: http://repo1.maven.org/maven2/org/apache/maven/maven-toolchain/2.2.1/maven-toolchain-2.2.1.pom
3K downloaded  (maven-toolchain-2.2.1.pom)
Downloading: http://repo1.maven.org/maven2/commons-io/commons-io/2.2/commons-io-2.2.pom
10K downloaded  (commons-io-2.2.pom)
Downloading: http://repo1.maven.org/maven2/org/apache/commons/commons-parent/24/commons-parent-24.pom
46K downloaded  (commons-parent-24.pom)
Downloading: http://repo1.maven.org/maven2/org/codehaus/plexus/plexus-archiver/2.1.2/plexus-archiver-2.1.2.pom
3K downloaded  (plexus-archiver-2.1.2.pom)
Downloading: http://repo1.maven.org/maven2/org/codehaus/plexus/plexus-utils/3.0.2/plexus-utils-3.0.2.pom
2K downloaded  (plexus-utils-3.0.2.pom)
Downloading: http://repo1.maven.org/maven2/org/codehaus/plexus/plexus-io/2.0.4/plexus-io-2.0.4.pom
1K downloaded  (plexus-io-2.0.4.pom)
Downloading: http://repo1.maven.org/maven2/org/codehaus/plexus/plexus-utils/3.0.5/plexus-utils-3.0.5.pom
2K downloaded  (plexus-utils-3.0.5.pom)
Downloading: http://repo1.maven.org/maven2/org/codehaus/plexus/plexus-utils/3.0.5/plexus-utils-3.0.5.jar
Downloading: http://repo1.maven.org/maven2/commons-io/commons-io/2.2/commons-io-2.2.jar
225K downloaded  (plexus-utils-3.0.5.jar)
Downloading: http://repo1.maven.org/maven2/org/codehaus/plexus/plexus-archiver/2.1.2/plexus-archiver-2.1.2.jar
169K downloaded  (commons-io-2.2.jar)
180K downloaded  (plexus-archiver-2.1.2.jar)
Downloading: http://repo1.maven.org/maven2/org/codehaus/plexus/plexus-io/2.0.4/plexus-io-2.0.4.jar
56K downloaded  (plexus-io-2.0.4.jar)
[INFO] [javadoc:jar {execution: attach-javadocs}]
[INFO] Not executing Javadoc as the project is not a Java classpath-capable package
[INFO] [install:install {execution: default-install}]
[INFO] Installing /x1/jenkins/jenkins-slave/workspace/CXF-2.5-deploy/cxf-2.5.x-fixes/pom.xml
to <https://builds.apache.org/job/CXF-2.5-deploy/ws/.repository/org/apache/cxf/cxf/2.5.7-SNAPSHOT/cxf-2.5.7-SNAPSHOT.pom>
[INFO] Installing /x1/jenkins/jenkins-slave/workspace/CXF-2.5-deploy/cxf-2.5.x-fixes/target/cxf-2.5.7-SNAPSHOT-site.xml
to <https://builds.apache.org/job/CXF-2.5-deploy/ws/.repository/org/apache/cxf/cxf/2.5.7-SNAPSHOT/cxf-2.5.7-SNAPSHOT-site.xml>
[INFO] [deploy:deploy {execution: default-deploy}]
[INFO] Retrieving previous build number from apache.snapshots.https
[WARNING] *** CHECKSUM FAILED - Checksum failed on download: local = '0b00247baf27f77128c7191073f02431d9c877ae';
remote = '3c0b48d66db207c28aaaac595f503772757140a0' - RETRYING
[WARNING] *** CHECKSUM FAILED - Checksum failed on download: local = '0b00247baf27f77128c7191073f02431d9c877ae';
remote = '3c0b48d66db207c28aaaac595f503772757140a0' - IGNORING
Uploading: https://repository.apache.org/content/repositories/snapshots/org/apache/cxf/cxf/2.5.7-SNAPSHOT/cxf-2.5.7-20121026.070340-13.pom
35K uploaded  (cxf-2.5.7-20121026.070340-13.pom)
[INFO] Retrieving previous metadata from apache.snapshots.https
[INFO] Uploading repository metadata for: 'artifact org.apache.cxf:cxf'
[INFO] Retrieving previous metadata from apache.snapshots.https
[WARNING] *** CHECKSUM FAILED - Checksum failed on download: local = '0b00247baf27f77128c7191073f02431d9c877ae';
remote = '3c0b48d66db207c28aaaac595f503772757140a0' - RETRYING
[WARNING] *** CHECKSUM FAILED - Checksum failed on download: local = '0b00247baf27f77128c7191073f02431d9c877ae';
remote = '3c0b48d66db207c28aaaac595f503772757140a0' - IGNORING
[INFO] Uploading repository metadata for: 'snapshot org.apache.cxf:cxf:2.5.7-SNAPSHOT'
[INFO] Retrieving previous build number from apache.snapshots.https
Uploading: https://repository.apache.org/content/repositories/snapshots/org/apache/cxf/cxf/2.5.7-SNAPSHOT/cxf-2.5.7-20121026.070340-13-site.xml
1K uploaded  (cxf-2.5.7-20121026.070340-13-site.xml)
[INFO] ------------------------------------------------------------------------
[INFO] Building Apache CXF Parent
[INFO]    task-segment: [deploy]
[INFO] ------------------------------------------------------------------------
[INFO] [cxf-xml2fastinfoset:xml2fastinfoset {execution: xml2fastinfoset}]
[WARNING] The parameter expression: 'project.build.resources' used in mojo: 'process' has
been deprecated. Use 'project.resources' instead.
[INFO] [remote-resources:process {execution: default}]
[INFO] [site:attach-descriptor {execution: default-attach-descriptor}]
[INFO] [source:jar-no-fork {execution: attach-sources}]
[INFO] [javadoc:jar {execution: attach-javadocs}]
[INFO] Not executing Javadoc as the project is not a Java classpath-capable package
[INFO] [install:install {execution: default-install}]
[INFO] Installing /x1/jenkins/jenkins-slave/workspace/CXF-2.5-deploy/cxf-2.5.x-fixes/parent/pom.xml
to <https://builds.apache.org/job/CXF-2.5-deploy/ws/.repository/org/apache/cxf/cxf-parent/2.5.7-SNAPSHOT/cxf-parent-2.5.7-SNAPSHOT.pom>
[INFO] [deploy:deploy {execution: default-deploy}]
[INFO] Retrieving previous build number from apache.snapshots.https
[WARNING] *** CHECKSUM FAILED - Checksum failed on download: local = 'f2193b0f23a0f24f6bb7c1af90be60cb1a667f4e';
remote = '351b8b74c9aad66ae339d196c91c795a79fec5c7' - RETRYING
[WARNING] *** CHECKSUM FAILED - Checksum failed on download: local = 'f2193b0f23a0f24f6bb7c1af90be60cb1a667f4e';
remote = '351b8b74c9aad66ae339d196c91c795a79fec5c7' - IGNORING
Uploading: https://repository.apache.org/content/repositories/snapshots/org/apache/cxf/cxf-parent/2.5.7-SNAPSHOT/cxf-parent-2.5.7-20121026.070340-13.pom
73K uploaded  (cxf-parent-2.5.7-20121026.070340-13.pom)
[INFO] Retrieving previous metadata from apache.snapshots.https
[INFO] Uploading repository metadata for: 'artifact org.apache.cxf:cxf-parent'
[INFO] Retrieving previous metadata from apache.snapshots.https
[WARNING] *** CHECKSUM FAILED - Checksum failed on download: local = 'f2193b0f23a0f24f6bb7c1af90be60cb1a667f4e';
remote = '351b8b74c9aad66ae339d196c91c795a79fec5c7' - RETRYING
[WARNING] *** CHECKSUM FAILED - Checksum failed on download: local = 'f2193b0f23a0f24f6bb7c1af90be60cb1a667f4e';
remote = '351b8b74c9aad66ae339d196c91c795a79fec5c7' - IGNORING
[INFO] Uploading repository metadata for: 'snapshot org.apache.cxf:cxf-parent:2.5.7-SNAPSHOT'
[INFO] ------------------------------------------------------------------------
[INFO] Building Apache CXF Common Utilities
[INFO]    task-segment: [deploy]
[INFO] ------------------------------------------------------------------------
[INFO] [cxf-xml2fastinfoset:xml2fastinfoset {execution: xml2fastinfoset}]
[WARNING] The parameter expression: 'project.build.resources' used in mojo: 'process' has
been deprecated. Use 'project.resources' instead.
[INFO] [remote-resources:process {execution: default}]
Downloading: http://repo1.maven.org/maven2/com/sun/xml/bind/jaxb-impl/2.2.5.1/jaxb-impl-2.2.5.1.pom
4K downloaded  (jaxb-impl-2.2.5.1.pom)
Downloading: http://repo1.maven.org/maven2/javax/xml/bind/jaxb-api/2.2.5/jaxb-api-2.2.5.pom
7K downloaded  (jaxb-api-2.2.5.pom)
Downloading: http://repo1.maven.org/maven2/com/sun/xml/bind/jaxb-impl/2.2.5.1/jaxb-impl-2.2.5.1.jar
Downloading: http://repo1.maven.org/maven2/javax/xml/bind/jaxb-api/2.2.5/jaxb-api-2.2.5.jar
96K downloaded  (jaxb-api-2.2.5.jar)
1080K downloaded  (jaxb-impl-2.2.5.1.jar)
[debug] execute contextualize
[INFO] [resources:resources {execution: default-resources}]
[INFO] Using 'UTF-8' encoding to copy filtered resources.
[INFO] Copying 8 resources
[INFO] Copying 2 resources
[INFO] Copying 1 resource
[INFO] skip non existing resourceDirectory /x1/jenkins/jenkins-slave/workspace/CXF-2.5-deploy/cxf-2.5.x-fixes/common/common/target/generated/src/main/resources
[INFO] Copying 3 resources
[INFO] [compiler:compile {execution: default-compile}]
[INFO] Compiling 147 source files to /x1/jenkins/jenkins-slave/workspace/CXF-2.5-deploy/cxf-2.5.x-fixes/common/common/target/classes
[INFO] -------------------------------------------------------------
[ERROR] COMPILATION ERROR : 
[INFO] -------------------------------------------------------------
[ERROR] /x1/jenkins/jenkins-slave/workspace/CXF-2.5-deploy/cxf-2.5.x-fixes/common/common/src/main/java/org/apache/cxf/common/logging/LogUtils.java:[231,0]
illegal start of expression
[ERROR] /x1/jenkins/jenkins-slave/workspace/CXF-2.5-deploy/cxf-2.5.x-fixes/common/common/src/main/java/org/apache/cxf/common/logging/LogUtils.java:[234,68]
';' expected
[ERROR] /x1/jenkins/jenkins-slave/workspace/CXF-2.5-deploy/cxf-2.5.x-fixes/common/common/src/main/java/org/apache/cxf/common/logging/LogUtils.java:[234,73]
<identifier> expected
[ERROR] /x1/jenkins/jenkins-slave/workspace/CXF-2.5-deploy/cxf-2.5.x-fixes/common/common/src/main/java/org/apache/cxf/common/logging/LogUtils.java:[234,82]
'{' expected
[ERROR] /x1/jenkins/jenkins-slave/workspace/CXF-2.5-deploy/cxf-2.5.x-fixes/common/common/src/main/java/org/apache/cxf/common/logging/LogUtils.java:[234,87]
<identifier> expected
[ERROR] /x1/jenkins/jenkins-slave/workspace/CXF-2.5-deploy/cxf-2.5.x-fixes/common/common/src/main/java/org/apache/cxf/common/logging/LogUtils.java:[234,88]
'{' expected
[ERROR] /x1/jenkins/jenkins-slave/workspace/CXF-2.5-deploy/cxf-2.5.x-fixes/common/common/src/main/java/org/apache/cxf/common/logging/LogUtils.java:[235,16]
illegal start of type
[ERROR] /x1/jenkins/jenkins-slave/workspace/CXF-2.5-deploy/cxf-2.5.x-fixes/common/common/src/main/java/org/apache/cxf/common/logging/LogUtils.java:[264,75]
<identifier> expected
[ERROR] /x1/jenkins/jenkins-slave/workspace/CXF-2.5-deploy/cxf-2.5.x-fixes/common/common/src/main/java/org/apache/cxf/common/logging/LogUtils.java:[264,80]
<identifier> expected
[ERROR] /x1/jenkins/jenkins-slave/workspace/CXF-2.5-deploy/cxf-2.5.x-fixes/common/common/src/main/java/org/apache/cxf/common/logging/LogUtils.java:[264,89]
'{' expected
[ERROR] /x1/jenkins/jenkins-slave/workspace/CXF-2.5-deploy/cxf-2.5.x-fixes/common/common/src/main/java/org/apache/cxf/common/logging/LogUtils.java:[264,94]
<identifier> expected
[ERROR] /x1/jenkins/jenkins-slave/workspace/CXF-2.5-deploy/cxf-2.5.x-fixes/common/common/src/main/java/org/apache/cxf/common/logging/LogUtils.java:[264,95]
'{' expected
[ERROR] /x1/jenkins/jenkins-slave/workspace/CXF-2.5-deploy/cxf-2.5.x-fixes/common/common/src/main/java/org/apache/cxf/common/logging/LogUtils.java:[265,20]
illegal start of type
[ERROR] /x1/jenkins/jenkins-slave/workspace/CXF-2.5-deploy/cxf-2.5.x-fixes/common/common/src/main/java/org/apache/cxf/common/logging/LogUtils.java:[286,16]
<identifier> expected
[ERROR] /x1/jenkins/jenkins-slave/workspace/CXF-2.5-deploy/cxf-2.5.x-fixes/common/common/src/main/java/org/apache/cxf/common/logging/LogUtils.java:[286,18]
illegal start of type
[ERROR] /x1/jenkins/jenkins-slave/workspace/CXF-2.5-deploy/cxf-2.5.x-fixes/common/common/src/main/java/org/apache/cxf/common/logging/LogUtils.java:[290,12]
<identifier> expected
[ERROR] /x1/jenkins/jenkins-slave/workspace/CXF-2.5-deploy/cxf-2.5.x-fixes/common/common/src/main/java/org/apache/cxf/common/logging/LogUtils.java:[291,12]
illegal start of type
[ERROR] /x1/jenkins/jenkins-slave/workspace/CXF-2.5-deploy/cxf-2.5.x-fixes/common/common/src/main/java/org/apache/cxf/common/logging/LogUtils.java:[307,8]
<identifier> expected
[ERROR] /x1/jenkins/jenkins-slave/workspace/CXF-2.5-deploy/cxf-2.5.x-fixes/common/common/src/main/java/org/apache/cxf/common/logging/LogUtils.java:[307,10]
illegal start of type
[ERROR] /x1/jenkins/jenkins-slave/workspace/CXF-2.5-deploy/cxf-2.5.x-fixes/common/common/src/main/java/org/apache/cxf/common/logging/LogUtils.java:[312,4]
<identifier> expected
[ERROR] /x1/jenkins/jenkins-slave/workspace/CXF-2.5-deploy/cxf-2.5.x-fixes/common/common/src/main/java/org/apache/cxf/common/logging/LogUtils.java:[323,4]
illegal start of expression
[ERROR] /x1/jenkins/jenkins-slave/workspace/CXF-2.5-deploy/cxf-2.5.x-fixes/common/common/src/main/java/org/apache/cxf/common/logging/LogUtils.java:[436,32]
';' expected
[ERROR] /x1/jenkins/jenkins-slave/workspace/CXF-2.5-deploy/cxf-2.5.x-fixes/common/common/src/main/java/org/apache/cxf/common/logging/LogUtils.java:[436,37]
<identifier> expected
[ERROR] /x1/jenkins/jenkins-slave/workspace/CXF-2.5-deploy/cxf-2.5.x-fixes/common/common/src/main/java/org/apache/cxf/common/logging/LogUtils.java:[436,47]
'{' expected
[ERROR] /x1/jenkins/jenkins-slave/workspace/CXF-2.5-deploy/cxf-2.5.x-fixes/common/common/src/main/java/org/apache/cxf/common/logging/LogUtils.java:[437,8]
illegal start of type
[ERROR] /x1/jenkins/jenkins-slave/workspace/CXF-2.5-deploy/cxf-2.5.x-fixes/common/common/src/main/java/org/apache/cxf/common/logging/LogUtils.java:[445,23]
<identifier> expected
[ERROR] /x1/jenkins/jenkins-slave/workspace/CXF-2.5-deploy/cxf-2.5.x-fixes/common/common/src/main/java/org/apache/cxf/common/logging/LogUtils.java:[455,4]
illegal start of expression
[ERROR] no more tokens - could not parse error message: /x1/jenkins/jenkins-slave/workspace/CXF-2.5-deploy/cxf-2.5.x-fixes/common/common/src/main/java/org/apache/cxf/common/logging/LogUtils.java:464:
';' expected
^

[ERROR] no more tokens - could not parse error message: /x1/jenkins/jenkins-slave/workspace/CXF-2.5-deploy/cxf-2.5.x-fixes/common/common/src/main/java/org/apache/cxf/common/logging/LogUtils.java:466:
'}' expected
^

[INFO] 29 errors 
[INFO] -------------------------------------------------------------
[INFO] ------------------------------------------------------------------------
[ERROR] BUILD FAILURE
[INFO] ------------------------------------------------------------------------
[INFO] Compilation failure

/x1/jenkins/jenkins-slave/workspace/CXF-2.5-deploy/cxf-2.5.x-fixes/common/common/src/main/java/org/apache/cxf/common/logging/LogUtils.java:[231,0]
illegal start of expression
/x1/jenkins/jenkins-slave/workspace/CXF-2.5-deploy/cxf-2.5.x-fixes/common/common/src/main/java/org/apache/cxf/common/logging/LogUtils.java:[234,68]
';' expected
/x1/jenkins/jenkins-slave/workspace/CXF-2.5-deploy/cxf-2.5.x-fixes/common/common/src/main/java/org/apache/cxf/common/logging/LogUtils.java:[234,73]
<identifier> expected
/x1/jenkins/jenkins-slave/workspace/CXF-2.5-deploy/cxf-2.5.x-fixes/common/common/src/main/java/org/apache/cxf/common/logging/LogUtils.java:[234,82]
'{' expected
/x1/jenkins/jenkins-slave/workspace/CXF-2.5-deploy/cxf-2.5.x-fixes/common/common/src/main/java/org/apache/cxf/common/logging/LogUtils.java:[234,87]
<identifier> expected
/x1/jenkins/jenkins-slave/workspace/CXF-2.5-deploy/cxf-2.5.x-fixes/common/common/src/main/java/org/apache/cxf/common/logging/LogUtils.java:[234,88]
'{' expected
/x1/jenkins/jenkins-slave/workspace/CXF-2.5-deploy/cxf-2.5.x-fixes/common/common/src/main/java/org/apache/cxf/common/logging/LogUtils.java:[235,16]
illegal start of type
/x1/jenkins/jenkins-slave/workspace/CXF-2.5-deploy/cxf-2.5.x-fixes/common/common/src/main/java/org/apache/cxf/common/logging/LogUtils.java:[264,75]
<identifier> expected
/x1/jenkins/jenkins-slave/workspace/CXF-2.5-deploy/cxf-2.5.x-fixes/common/common/src/main/java/org/apache/cxf/common/logging/LogUtils.java:[264,80]
<identifier> expected
/x1/jenkins/jenkins-slave/workspace/CXF-2.5-deploy/cxf-2.5.x-fixes/common/common/src/main/java/org/apache/cxf/common/logging/LogUtils.java:[264,89]
'{' expected
/x1/jenkins/jenkins-slave/workspace/CXF-2.5-deploy/cxf-2.5.x-fixes/common/common/src/main/java/org/apache/cxf/common/logging/LogUtils.java:[264,94]
<identifier> expected
/x1/jenkins/jenkins-slave/workspace/CXF-2.5-deploy/cxf-2.5.x-fixes/common/common/src/main/java/org/apache/cxf/common/logging/LogUtils.java:[264,95]
'{' expected
/x1/jenkins/jenkins-slave/workspace/CXF-2.5-deploy/cxf-2.5.x-fixes/common/common/src/main/java/org/apache/cxf/common/logging/LogUtils.java:[265,20]
illegal start of type
/x1/jenkins/jenkins-slave/workspace/CXF-2.5-deploy/cxf-2.5.x-fixes/common/common/src/main/java/org/apache/cxf/common/logging/LogUtils.java:[286,16]
<identifier> expected
/x1/jenkins/jenkins-slave/workspace/CXF-2.5-deploy/cxf-2.5.x-fixes/common/common/src/main/java/org/apache/cxf/common/logging/LogUtils.java:[286,18]
illegal start of type
/x1/jenkins/jenkins-slave/workspace/CXF-2.5-deploy/cxf-2.5.x-fixes/common/common/src/main/java/org/apache/cxf/common/logging/LogUtils.java:[290,12]
<identifier> expected
/x1/jenkins/jenkins-slave/workspace/CXF-2.5-deploy/cxf-2.5.x-fixes/common/common/src/main/java/org/apache/cxf/common/logging/LogUtils.java:[291,12]
illegal start of type
/x1/jenkins/jenkins-slave/workspace/CXF-2.5-deploy/cxf-2.5.x-fixes/common/common/src/main/java/org/apache/cxf/common/logging/LogUtils.java:[307,8]
<identifier> expected
/x1/jenkins/jenkins-slave/workspace/CXF-2.5-deploy/cxf-2.5.x-fixes/common/common/src/main/java/org/apache/cxf/common/logging/LogUtils.java:[307,10]
illegal start of type
/x1/jenkins/jenkins-slave/workspace/CXF-2.5-deploy/cxf-2.5.x-fixes/common/common/src/main/java/org/apache/cxf/common/logging/LogUtils.java:[312,4]
<identifier> expected
/x1/jenkins/jenkins-slave/workspace/CXF-2.5-deploy/cxf-2.5.x-fixes/common/common/src/main/java/org/apache/cxf/common/logging/LogUtils.java:[323,4]
illegal start of expression
/x1/jenkins/jenkins-slave/workspace/CXF-2.5-deploy/cxf-2.5.x-fixes/common/common/src/main/java/org/apache/cxf/common/logging/LogUtils.java:[436,32]
';' expected
/x1/jenkins/jenkins-slave/workspace/CXF-2.5-deploy/cxf-2.5.x-fixes/common/common/src/main/java/org/apache/cxf/common/logging/LogUtils.java:[436,37]
<identifier> expected
/x1/jenkins/jenkins-slave/workspace/CXF-2.5-deploy/cxf-2.5.x-fixes/common/common/src/main/java/org/apache/cxf/common/logging/LogUtils.java:[436,47]
'{' expected
/x1/jenkins/jenkins-slave/workspace/CXF-2.5-deploy/cxf-2.5.x-fixes/common/common/src/main/java/org/apache/cxf/common/logging/LogUtils.java:[437,8]
illegal start of type
/x1/jenkins/jenkins-slave/workspace/CXF-2.5-deploy/cxf-2.5.x-fixes/common/common/src/main/java/org/apache/cxf/common/logging/LogUtils.java:[445,23]
<identifier> expected
/x1/jenkins/jenkins-slave/workspace/CXF-2.5-deploy/cxf-2.5.x-fixes/common/common/src/main/java/org/apache/cxf/common/logging/LogUtils.java:[455,4]
illegal start of expression
no more tokens - could not parse error message: /x1/jenkins/jenkins-slave/workspace/CXF-2.5-deploy/cxf-2.5.x-fixes/common/common/src/main/java/org/apache/cxf/common/logging/LogUtils.java:464:
';' expected
^

no more tokens - could not parse error message: /x1/jenkins/jenkins-slave/workspace/CXF-2.5-deploy/cxf-2.5.x-fixes/common/common/src/main/java/org/apache/cxf/common/logging/LogUtils.java:466:
'}' expected
^


[INFO] ------------------------------------------------------------------------
[INFO] For more information, run Maven with the -e switch
[INFO] ------------------------------------------------------------------------
[INFO] Total time: 25 seconds
[INFO] Finished at: Fri Oct 26 07:03:46 GMT 2012
[INFO] Final Memory: 81M/158M
[INFO] ------------------------------------------------------------------------
Build step 'Invoke top-level Maven targets' marked build as failure
[locks-and-latches] Releasing all the locks
[locks-and-latches] All the locks released

Mime
View raw message