cxf-notifications mailing list archives

Site index · List index
Message view « Date » · « Thread »
Top « Date » · « Thread »
From Apache Jenkins Server <jenk...@builds.apache.org>
Subject Build failed in Jenkins: CXF-2.4-deploy #271
Date Fri, 14 Sep 2012 08:37:40 GMT
See <https://builds.apache.org/job/CXF-2.4-deploy/271/changes>

Changes:

[ay] Blocking revisions 1384556 via  svn from
https://svn.apache.org/repos/asf/cxf/branches/2.5.x-fixes

........
  r1384556 | ay | 2012-09-13 23:49:32 +0200 (Thu, 13 Sep 2012) | 17 lines
  
  Merged revisions 1384552 via  svn merge from
  https://svn.apache.org/repos/asf/cxf/branches/2.6.x-fixes
  
  ........
    r1384552 | ay | 2012-09-13 23:33:42 +0200 (Thu, 13 Sep 2012) | 9 lines
    
    Merged revisions 1384365 via  svn merge from
    https://svn.apache.org/repos/asf/cxf/trunk
    
    ........
      r1384365 | ay | 2012-09-13 17:17:46 +0200 (Thu, 13 Sep 2012) | 1 line
      
      [CXF-4503] TransformOutInterceptor may lose namespace declarations in some elements
    ........
    
  ........
  
........

------------------------------------------
Started by an SCM change
Building remotely on ubuntu5 in workspace <https://builds.apache.org/job/CXF-2.4-deploy/ws/>
Updating http://svn.apache.org/repos/asf/cxf/branches/2.4.x-fixes
U         rt/frontend/jaxrs/src/main/java/org/apache/cxf/jaxrs/utils/HttpUtils.java
U         rt/frontend/jaxrs/src/main/java/org/apache/cxf/jaxrs/utils/FormUtils.java
U         rt/frontend/jaxws/src/main/java/org/apache/cxf/jaxws/interceptors/WrapperClassOutInterceptor.java
U         rt/frontend/jaxws/src/main/java/org/apache/cxf/jaxws/DispatchImpl.java
U         rt/frontend/jaxws/src/main/java/org/apache/cxf/jaxws/JAXWSMethodInvoker.java
U         rt/frontend/jaxws/src/main/java/org/apache/cxf/jaxws/support/JaxWsServiceFactoryBean.java
U         rt/transports/jms/src/main/java/org/apache/cxf/transport/jms/JMSDestination.java
U         rt/ws/security/src/main/java/org/apache/cxf/ws/security/wss4j/policyhandlers/AbstractBindingBuilder.java
U         rt/ws/security/src/main/java/org/apache/cxf/ws/security/wss4j/policyhandlers/SymmetricBindingHandler.java
U         rt/ws/security/src/main/java/org/apache/cxf/ws/security/wss4j/policyhandlers/AsymmetricBindingHandler.java
U         common/common/src/test/java/org/apache/cxf/common/xmlschema/ImportRepairTest.java
U         common/xerces-xsd-validation/src/main/java/org/apache/cxf/xsdvalidation/XercesSchemaValidationUtils.java
U         testutils/src/main/resources/wsdl/jms_test_mtom.wsdl
U         systests/transports/src/test/java/org/apache/cxf/systest/http/PushBack401.java
U         systests/transports/src/test/java/org/apache/cxf/systest/http_jetty/JettyDigestAuthTest.java
U         systests/transport-jms/src/test/java/org/apache/cxf/systest/jms/Server.java
U         systests/transport-jms/src/test/java/org/apache/cxf/systest/jms/JMSMTOMImpl.java
U         systests/transport-jms/src/test/java/org/apache/cxf/systest/jms/JMSClientServerTest.java
U         api/src/main/java/org/apache/cxf/wsdl/EndpointReferenceUtils.java
 U        .
At revision 1384683
[locks-and-latches] Checking to see if we really have the locks
[locks-and-latches] Have all the locks, build can start
Parsing POMs
[locks-and-latches] Releasing all the locks
[locks-and-latches] All the locks released
ERROR: Failed to parse POMs
hudson.util.IOException2: remote file operation failed: <https://builds.apache.org/job/CXF-2.4-deploy/ws/cxf-2.4.x-fixes>
at hudson.remoting.Channel@78adccc4:ubuntu5
	at hudson.FilePath.act(FilePath.java:838)
	at hudson.FilePath.act(FilePath.java:824)
	at hudson.maven.MavenModuleSetBuild$MavenModuleSetBuildExecution.parsePoms(MavenModuleSetBuild.java:910)
	at hudson.maven.MavenModuleSetBuild$MavenModuleSetBuildExecution.doRun(MavenModuleSetBuild.java:654)
	at hudson.model.AbstractBuild$AbstractBuildExecution.run(AbstractBuild.java:499)
	at hudson.model.Run.execute(Run.java:1502)
	at hudson.maven.MavenModuleSetBuild.run(MavenModuleSetBuild.java:477)
	at hudson.model.ResourceController.execute(ResourceController.java:88)
	at hudson.model.Executor.run(Executor.java:236)
Caused by: hudson.remoting.ProxyException: hudson.maven.MavenModuleSetBuild$MavenExecutionException:
org.apache.maven.project.ProjectBuildingException: Some problems were encountered while processing
the POMs:
[ERROR] 'dependencies.dependency.version' for org.bouncycastle:bcprov-jdk15:jar is missing.
@ line 63, column 21

	at hudson.maven.MavenModuleSetBuild$PomParser.invoke(MavenModuleSetBuild.java:1277)
	at hudson.maven.MavenModuleSetBuild$PomParser.invoke(MavenModuleSetBuild.java:1045)
	at hudson.FilePath$FileCallableWrapper.call(FilePath.java:2200)
	at hudson.remoting.UserRequest.perform(UserRequest.java:118)
	at hudson.remoting.UserRequest.perform(UserRequest.java:48)
	at hudson.remoting.Request$2.run(Request.java:326)
	at hudson.remoting.InterceptingExecutorService$1.call(InterceptingExecutorService.java:72)
	at java.util.concurrent.FutureTask$Sync.innerRun(FutureTask.java:334)
	at java.util.concurrent.FutureTask.run(FutureTask.java:166)
	at java.util.concurrent.ThreadPoolExecutor.runWorker(ThreadPoolExecutor.java:1110)
	at java.util.concurrent.ThreadPoolExecutor$Worker.run(ThreadPoolExecutor.java:603)
	at java.lang.Thread.run(Thread.java:679)
Caused by: hudson.remoting.ProxyException: org.apache.maven.project.ProjectBuildingException:
Some problems were encountered while processing the POMs:
[ERROR] 'dependencies.dependency.version' for org.bouncycastle:bcprov-jdk15:jar is missing.
@ line 63, column 21

	at org.apache.maven.project.DefaultProjectBuilder.build(DefaultProjectBuilder.java:363)
	at hudson.maven.MavenEmbedder.buildProjects(MavenEmbedder.java:361)
	at hudson.maven.MavenEmbedder.readProjects(MavenEmbedder.java:331)
	at hudson.maven.MavenEmbedder.readProject(MavenEmbedder.java:322)
	at hudson.maven.MavenModuleSetBuild$PomParser.readChilds(MavenModuleSetBuild.java:1331)
	at hudson.maven.MavenModuleSetBuild$PomParser.readChilds(MavenModuleSetBuild.java:1334)
	at hudson.maven.MavenModuleSetBuild$PomParser.readChilds(MavenModuleSetBuild.java:1334)
	at hudson.maven.MavenModuleSetBuild$PomParser.invoke(MavenModuleSetBuild.java:1238)
	... 11 more

Mime
View raw message