cxf-notifications mailing list archives

Site index · List index
Message view « Date » · « Thread »
Top « Date » · « Thread »
From Apache Jenkins Server <jenk...@builds.apache.org>
Subject Build failed in Jenkins: CXF-2.5-deploy #147
Date Thu, 16 Aug 2012 07:14:52 GMT
See <https://builds.apache.org/job/CXF-2.5-deploy/147/changes>

Changes:

[ffang] [CXF-4475]LoggingInInterceptor throws when pretty printing MTOM messages

------------------------------------------
[...truncated 13621 lines...]
[INFO] Parameter: artifactId, Value: basic
[INFO] project created from Archetype in dir: <https://builds.apache.org/job/CXF-2.5-deploy/ws/cxf-2.5.x-fixes/maven-plugins/archetypes/cxf-jaxrs-service/target/test-classes/projects/basic/project/basic>
[INFO] No post-archetype-generation goals to invoke.
[INFO] [install:install {execution: default-install}]
[INFO] Installing <https://builds.apache.org/job/CXF-2.5-deploy/ws/cxf-2.5.x-fixes/maven-plugins/archetypes/cxf-jaxrs-service/target/cxf-jaxrs-service-2.5.6-SNAPSHOT.jar>
to <https://builds.apache.org/job/CXF-2.5-deploy/ws/.repository/org/apache/cxf/archetype/cxf-jaxrs-service/2.5.6-SNAPSHOT/cxf-jaxrs-service-2.5.6-SNAPSHOT.jar>
[INFO] Installing <https://builds.apache.org/job/CXF-2.5-deploy/ws/cxf-2.5.x-fixes/maven-plugins/archetypes/cxf-jaxrs-service/target/cxf-jaxrs-service-2.5.6-SNAPSHOT-sources.jar>
to <https://builds.apache.org/job/CXF-2.5-deploy/ws/.repository/org/apache/cxf/archetype/cxf-jaxrs-service/2.5.6-SNAPSHOT/cxf-jaxrs-service-2.5.6-SNAPSHOT-sources.jar>
[INFO] [archetype:update-local-catalog {execution: default-update-local-catalog}]
[INFO] [deploy:deploy {execution: default-deploy}]
[INFO] Retrieving previous build number from apache.snapshots.https
[WARNING] *** CHECKSUM FAILED - Checksum failed on download: local = '22de5f2db9e1c088473aa92b3c9d8e072eee3b8a';
remote = '123299e12525bcf00a5919aa1d81aa4522b39d81' - RETRYING
[WARNING] *** CHECKSUM FAILED - Checksum failed on download: local = '22de5f2db9e1c088473aa92b3c9d8e072eee3b8a';
remote = '123299e12525bcf00a5919aa1d81aa4522b39d81' - IGNORING
Uploading: https://repository.apache.org/content/repositories/snapshots/org/apache/cxf/archetype/cxf-jaxrs-service/2.5.6-SNAPSHOT/cxf-jaxrs-service-2.5.6-20120816.070020-2.jar
9K uploaded  (cxf-jaxrs-service-2.5.6-20120816.070020-2.jar)
[INFO] Retrieving previous metadata from apache.snapshots.https
[WARNING] *** CHECKSUM FAILED - Checksum failed on download: local = '22de5f2db9e1c088473aa92b3c9d8e072eee3b8a';
remote = '123299e12525bcf00a5919aa1d81aa4522b39d81' - RETRYING
[WARNING] *** CHECKSUM FAILED - Checksum failed on download: local = '22de5f2db9e1c088473aa92b3c9d8e072eee3b8a';
remote = '123299e12525bcf00a5919aa1d81aa4522b39d81' - IGNORING
[INFO] Uploading repository metadata for: 'snapshot org.apache.cxf.archetype:cxf-jaxrs-service:2.5.6-SNAPSHOT'
[INFO] Uploading project information for cxf-jaxrs-service 2.5.6-20120816.070020-2
[INFO] Retrieving previous metadata from apache.snapshots.https
[INFO] Uploading repository metadata for: 'artifact org.apache.cxf.archetype:cxf-jaxrs-service'
[INFO] Retrieving previous build number from apache.snapshots.https
Uploading: https://repository.apache.org/content/repositories/snapshots/org/apache/cxf/archetype/cxf-jaxrs-service/2.5.6-SNAPSHOT/cxf-jaxrs-service-2.5.6-20120816.070020-2-sources.jar
11K uploaded  (cxf-jaxrs-service-2.5.6-20120816.070020-2-sources.jar)
[INFO] ------------------------------------------------------------------------
[INFO] Building Apache CXF Maven Archetypes
[INFO]    task-segment: [deploy]
[INFO] ------------------------------------------------------------------------
[INFO] [cxf-xml2fastinfoset:xml2fastinfoset {execution: xml2fastinfoset}]
[WARNING] The parameter expression: 'project.build.resources' used in mojo: 'process' has
been deprecated. Use 'project.resources' instead.
[INFO] [remote-resources:process {execution: default}]
[INFO] [site:attach-descriptor {execution: default-attach-descriptor}]
[INFO] [source:jar-no-fork {execution: attach-sources}]
[INFO] [javadoc:jar {execution: attach-javadocs}]
[INFO] Not executing Javadoc as the project is not a Java classpath-capable package
[INFO] [install:install {execution: default-install}]
[INFO] Installing <https://builds.apache.org/job/CXF-2.5-deploy/ws/cxf-2.5.x-fixes/maven-plugins/archetypes/pom.xml>
to <https://builds.apache.org/job/CXF-2.5-deploy/ws/.repository/org/apache/cxf/cxf-archetypes/2.5.6-SNAPSHOT/cxf-archetypes-2.5.6-SNAPSHOT.pom>
[INFO] [deploy:deploy {execution: default-deploy}]
[INFO] Retrieving previous build number from apache.snapshots.https
[WARNING] *** CHECKSUM FAILED - Checksum failed on download: local = '55a7c6ed6ce619026bdd1037408ffedc8db7a0d8';
remote = '4371f8398924e7886f695eb2128320fc69a0bdc0' - RETRYING
[WARNING] *** CHECKSUM FAILED - Checksum failed on download: local = '55a7c6ed6ce619026bdd1037408ffedc8db7a0d8';
remote = '4371f8398924e7886f695eb2128320fc69a0bdc0' - IGNORING
Uploading: https://repository.apache.org/content/repositories/snapshots/org/apache/cxf/cxf-archetypes/2.5.6-SNAPSHOT/cxf-archetypes-2.5.6-20120816.070020-2.pom
1K uploaded  (cxf-archetypes-2.5.6-20120816.070020-2.pom)
[INFO] Retrieving previous metadata from apache.snapshots.https
[WARNING] *** CHECKSUM FAILED - Checksum failed on download: local = '55a7c6ed6ce619026bdd1037408ffedc8db7a0d8';
remote = '4371f8398924e7886f695eb2128320fc69a0bdc0' - RETRYING
[WARNING] *** CHECKSUM FAILED - Checksum failed on download: local = '55a7c6ed6ce619026bdd1037408ffedc8db7a0d8';
remote = '4371f8398924e7886f695eb2128320fc69a0bdc0' - IGNORING
[INFO] Uploading repository metadata for: 'snapshot org.apache.cxf:cxf-archetypes:2.5.6-SNAPSHOT'
[INFO] Retrieving previous metadata from apache.snapshots.https
[INFO] Uploading repository metadata for: 'artifact org.apache.cxf:cxf-archetypes'
[INFO] ------------------------------------------------------------------------
[INFO] Building Apache CXF STS Core
[INFO]    task-segment: [deploy]
[INFO] ------------------------------------------------------------------------
[INFO] [dependency:copy {execution: create-endorsed-dir}]
[INFO] Configured Artifact: xerces:xercesImpl:?:jar
[INFO] Configured Artifact: xml-apis:xml-apis:1.3.04:jar
[INFO] xerces:xercesImpl:2.9.1:jar already exists in <https://builds.apache.org/job/CXF-2.5-deploy/ws/cxf-2.5.x-fixes/services/sts/sts-core/target/endorsed>
[INFO] xml-apis:xml-apis:1.3.04:jar already exists in <https://builds.apache.org/job/CXF-2.5-deploy/ws/cxf-2.5.x-fixes/services/sts/sts-core/target/endorsed>
[INFO] [cxf-xml2fastinfoset:xml2fastinfoset {execution: xml2fastinfoset}]
[WARNING] The parameter expression: 'project.build.resources' used in mojo: 'process' has
been deprecated. Use 'project.resources' instead.
[INFO] [remote-resources:process {execution: default}]
[debug] execute contextualize
[INFO] [resources:resources {execution: default-resources}]
[INFO] Using 'UTF-8' encoding to copy filtered resources.
[INFO] Copying 0 resource
[INFO] skip non existing resourceDirectory <https://builds.apache.org/job/CXF-2.5-deploy/ws/cxf-2.5.x-fixes/services/sts/sts-core/src/main/resources>
[INFO] skip non existing resourceDirectory <https://builds.apache.org/job/CXF-2.5-deploy/ws/cxf-2.5.x-fixes/services/sts/sts-core/src/main/resources-filtered>
[INFO] skip non existing resourceDirectory <https://builds.apache.org/job/CXF-2.5-deploy/ws/cxf-2.5.x-fixes/services/sts/sts-core/target/generated/src/main/resources>
[INFO] Copying 3 resources
[INFO] [compiler:compile {execution: default-compile}]
[INFO] Nothing to compile - all classes are up to date
[debug] execute contextualize
[INFO] [resources:testResources {execution: default-testResources}]
[INFO] Using 'UTF-8' encoding to copy filtered resources.
[INFO] Copying 0 resource
[INFO] Copying 7 resources
[INFO] skip non existing resourceDirectory <https://builds.apache.org/job/CXF-2.5-deploy/ws/cxf-2.5.x-fixes/services/sts/sts-core/target/generated/src/test/resources>
[INFO] Copying 3 resources
[INFO] [compiler:testCompile {execution: default-testCompile}]
[INFO] Nothing to compile - all classes are up to date
[INFO] [surefire:test {execution: default-test}]
[INFO] Tests are skipped.
[INFO] [bundle:bundle {execution: default-bundle}]
[WARNING] Bundle org.apache.cxf.services.sts:cxf-services-sts-core:bundle:2.5.6-SNAPSHOT :
Did not find matching referal for !org.apache.cxf.sts.*
[WARNING] Bundle org.apache.cxf.services.sts:cxf-services-sts-core:bundle:2.5.6-SNAPSHOT :
Did not find matching referal for org.apache.cxf.sts.provider.*
[INFO] [source:jar-no-fork {execution: attach-sources}]
[INFO] org already added, skipping
[INFO] org/apache already added, skipping
[INFO] org/apache/cxf already added, skipping
[INFO] org/apache/cxf/sts already added, skipping
[INFO] org/apache/cxf/sts/interceptor already added, skipping
[INFO] org/apache/cxf/sts/token already added, skipping
[INFO] org/apache/cxf/sts/token/validator already added, skipping
[INFO] org/apache/cxf/sts/token/realm already added, skipping
[INFO] org/apache/cxf/sts/token/provider already added, skipping
[INFO] org/apache/cxf/sts/token/canceller already added, skipping
[INFO] org/apache/cxf/sts/request already added, skipping
[INFO] org/apache/cxf/sts/service already added, skipping
[INFO] org/apache/cxf/sts/claims already added, skipping
[INFO] org/apache/cxf/sts/operation already added, skipping
[INFO] org/apache/cxf/sts/cache already added, skipping
[INFO] META-INF already added, skipping
[INFO] META-INF/NOTICE already added, skipping
[INFO] META-INF/DEPENDENCIES already added, skipping
[INFO] META-INF/LICENSE already added, skipping
[INFO] Building jar: <https://builds.apache.org/job/CXF-2.5-deploy/ws/cxf-2.5.x-fixes/services/sts/sts-core/target/cxf-services-sts-core-2.5.6-SNAPSHOT-sources.jar>
[INFO] org already added, skipping
[INFO] org/apache already added, skipping
[INFO] org/apache/cxf already added, skipping
[INFO] org/apache/cxf/sts already added, skipping
[INFO] org/apache/cxf/sts/interceptor already added, skipping
[INFO] org/apache/cxf/sts/token already added, skipping
[INFO] org/apache/cxf/sts/token/validator already added, skipping
[INFO] org/apache/cxf/sts/token/realm already added, skipping
[INFO] org/apache/cxf/sts/token/provider already added, skipping
[INFO] org/apache/cxf/sts/token/canceller already added, skipping
[INFO] org/apache/cxf/sts/request already added, skipping
[INFO] org/apache/cxf/sts/service already added, skipping
[INFO] org/apache/cxf/sts/claims already added, skipping
[INFO] org/apache/cxf/sts/operation already added, skipping
[INFO] org/apache/cxf/sts/cache already added, skipping
[INFO] META-INF already added, skipping
[INFO] META-INF/NOTICE already added, skipping
[INFO] META-INF/DEPENDENCIES already added, skipping
[INFO] META-INF/LICENSE already added, skipping
[INFO] [javadoc:jar {execution: attach-javadocs}]
[INFO] 
5 warnings
[WARNING] Javadoc Warnings
[WARNING] <https://builds.apache.org/job/CXF-2.5-deploy/ws/cxf-2.5.x-fixes/services/sts/sts-core/src/main/java/org/apache/cxf/sts/token/provider/DefaultConditionsProvider.java>:67:
warning - @param argument "default" is not a parameter name.
[WARNING] <https://builds.apache.org/job/CXF-2.5-deploy/ws/cxf-2.5.x-fixes/services/sts/sts-core/src/main/java/org/apache/cxf/sts/token/provider/DefaultConditionsProvider.java>:84:
warning - @param argument "maximum" is not a parameter name.
[WARNING] <https://builds.apache.org/job/CXF-2.5-deploy/ws/cxf-2.5.x-fixes/services/sts/sts-core/src/main/java/org/apache/cxf/sts/token/provider/TokenProviderResponse.java>:134:
warning - @param argument "attachtedReference" is not a parameter name.
[WARNING] <https://builds.apache.org/job/CXF-2.5-deploy/ws/cxf-2.5.x-fixes/services/sts/sts-core/src/main/java/org/apache/cxf/sts/token/provider/TokenProviderResponse.java>:150:
warning - @param argument "unAttachedReference" is not a parameter name.
[WARNING] <https://builds.apache.org/job/CXF-2.5-deploy/ws/cxf-2.5.x-fixes/services/sts/sts-core/src/main/java/org/apache/cxf/sts/StaticSTSProperties.java>:184:
warning - @param argument "signaturePropertiesFile" is not a parameter name.
[INFO] Building jar: <https://builds.apache.org/job/CXF-2.5-deploy/ws/cxf-2.5.x-fixes/services/sts/sts-core/target/cxf-services-sts-core-2.5.6-SNAPSHOT-javadoc.jar>
[INFO] [install:install {execution: default-install}]
[INFO] Installing <https://builds.apache.org/job/CXF-2.5-deploy/ws/cxf-2.5.x-fixes/services/sts/sts-core/target/cxf-services-sts-core-2.5.6-SNAPSHOT.jar>
to <https://builds.apache.org/job/CXF-2.5-deploy/ws/.repository/org/apache/cxf/services/sts/cxf-services-sts-core/2.5.6-SNAPSHOT/cxf-services-sts-core-2.5.6-SNAPSHOT.jar>
[INFO] Installing <https://builds.apache.org/job/CXF-2.5-deploy/ws/cxf-2.5.x-fixes/services/sts/sts-core/target/cxf-services-sts-core-2.5.6-SNAPSHOT-sources.jar>
to <https://builds.apache.org/job/CXF-2.5-deploy/ws/.repository/org/apache/cxf/services/sts/cxf-services-sts-core/2.5.6-SNAPSHOT/cxf-services-sts-core-2.5.6-SNAPSHOT-sources.jar>
[INFO] Installing <https://builds.apache.org/job/CXF-2.5-deploy/ws/cxf-2.5.x-fixes/services/sts/sts-core/target/cxf-services-sts-core-2.5.6-SNAPSHOT-javadoc.jar>
to <https://builds.apache.org/job/CXF-2.5-deploy/ws/.repository/org/apache/cxf/services/sts/cxf-services-sts-core/2.5.6-SNAPSHOT/cxf-services-sts-core-2.5.6-SNAPSHOT-javadoc.jar>
[INFO] [bundle:install {execution: default-install}]
[INFO] Installing org/apache/cxf/services/sts/cxf-services-sts-core/2.5.6-SNAPSHOT/cxf-services-sts-core-2.5.6-SNAPSHOT.jar
[INFO] Writing OBR metadata
[INFO] [deploy:deploy {execution: default-deploy}]
[INFO] Retrieving previous build number from apache.snapshots.https
[WARNING] *** CHECKSUM FAILED - Checksum failed on download: local = '3151a745def831a4c8854b78780a2a32049e3d11';
remote = '5e66ca9b50b1299ef242a7d41137dc8e5c4cd8a1' - RETRYING
[WARNING] *** CHECKSUM FAILED - Checksum failed on download: local = '3151a745def831a4c8854b78780a2a32049e3d11';
remote = '5e66ca9b50b1299ef242a7d41137dc8e5c4cd8a1' - IGNORING
Uploading: https://repository.apache.org/content/repositories/snapshots/org/apache/cxf/services/sts/cxf-services-sts-core/2.5.6-SNAPSHOT/cxf-services-sts-core-2.5.6-20120816.070020-2.jar
139K uploaded  (cxf-services-sts-core-2.5.6-20120816.070020-2.jar)
[INFO] Retrieving previous metadata from apache.snapshots.https
[INFO] Uploading repository metadata for: 'artifact org.apache.cxf.services.sts:cxf-services-sts-core'
[INFO] Retrieving previous metadata from apache.snapshots.https
[WARNING] *** CHECKSUM FAILED - Checksum failed on download: local = '3151a745def831a4c8854b78780a2a32049e3d11';
remote = '5e66ca9b50b1299ef242a7d41137dc8e5c4cd8a1' - RETRYING
[WARNING] *** CHECKSUM FAILED - Checksum failed on download: local = '3151a745def831a4c8854b78780a2a32049e3d11';
remote = '5e66ca9b50b1299ef242a7d41137dc8e5c4cd8a1' - IGNORING
[INFO] Uploading repository metadata for: 'snapshot org.apache.cxf.services.sts:cxf-services-sts-core:2.5.6-SNAPSHOT'
[INFO] Uploading project information for cxf-services-sts-core 2.5.6-20120816.070020-2
[INFO] Retrieving previous build number from apache.snapshots.https
Uploading: https://repository.apache.org/content/repositories/snapshots/org/apache/cxf/services/sts/cxf-services-sts-core/2.5.6-SNAPSHOT/cxf-services-sts-core-2.5.6-20120816.070020-2-sources.jar
115K uploaded  (cxf-services-sts-core-2.5.6-20120816.070020-2-sources.jar)
[INFO] Retrieving previous build number from apache.snapshots.https
Uploading: https://repository.apache.org/content/repositories/snapshots/org/apache/cxf/services/sts/cxf-services-sts-core/2.5.6-SNAPSHOT/cxf-services-sts-core-2.5.6-20120816.070020-2-javadoc.jar
417K uploaded  (cxf-services-sts-core-2.5.6-20120816.070020-2-javadoc.jar)
[INFO] [bundle:deploy {execution: default-deploy}]
[INFO] Remote OBR update disabled (enable with -DremoteOBR)
[INFO] ------------------------------------------------------------------------
[INFO] Building Apache CXF STS war deployment
[INFO]    task-segment: [deploy]
[INFO] ------------------------------------------------------------------------
[INFO] [cxf-xml2fastinfoset:xml2fastinfoset {execution: xml2fastinfoset}]
[WARNING] The parameter expression: 'project.build.resources' used in mojo: 'process' has
been deprecated. Use 'project.resources' instead.
[INFO] [remote-resources:process {execution: default}]
[INFO] snapshot org.apache.cxf.services.sts:cxf-services-sts-core:2.5.6-SNAPSHOT: checking
for updates from apache.snapshots
[debug] execute contextualize
[INFO] [resources:resources {execution: default-resources}]
[INFO] Using 'UTF-8' encoding to copy filtered resources.
[INFO] Copying 0 resource
[INFO] Copying 5 resources
[INFO] skip non existing resourceDirectory <https://builds.apache.org/job/CXF-2.5-deploy/ws/cxf-2.5.x-fixes/services/sts/sts-war/src/main/resources-filtered>
[INFO] skip non existing resourceDirectory <https://builds.apache.org/job/CXF-2.5-deploy/ws/cxf-2.5.x-fixes/services/sts/sts-war/target/generated/src/main/resources>
[INFO] Copying 3 resources
[INFO] [compiler:compile {execution: default-compile}]
[INFO] Nothing to compile - all classes are up to date
[debug] execute contextualize
[INFO] [resources:testResources {execution: default-testResources}]
[INFO] Using 'UTF-8' encoding to copy filtered resources.
[INFO] skip non existing resourceDirectory <https://builds.apache.org/job/CXF-2.5-deploy/ws/cxf-2.5.x-fixes/services/sts/sts-war/src/test/java>
[INFO] skip non existing resourceDirectory <https://builds.apache.org/job/CXF-2.5-deploy/ws/cxf-2.5.x-fixes/services/sts/sts-war/src/test/resources>
[INFO] skip non existing resourceDirectory <https://builds.apache.org/job/CXF-2.5-deploy/ws/cxf-2.5.x-fixes/services/sts/sts-war/target/generated/src/test/resources>
[INFO] Copying 3 resources
[INFO] snapshot org.apache.cxf:cxf-rt-ws-security:2.5.6-SNAPSHOT: checking for updates from
apache.snapshots
[INFO] snapshot org.apache.cxf:cxf-rt-ws-addr:2.5.6-SNAPSHOT: checking for updates from apache.snapshots
[INFO] [compiler:testCompile {execution: default-testCompile}]
[INFO] No sources to compile
[INFO] [surefire:test {execution: default-test}]
[INFO] Tests are skipped.
[INFO] [war:war {execution: default-war}]
[INFO] Packaging webapp
[INFO] Assembling webapp[cxf-services-sts-war] in [<https://builds.apache.org/job/CXF-2.5-deploy/ws/cxf-2.5.x-fixes/services/sts/sts-war/target/SecurityTokenService]>
[INFO] Dependency[Dependency {groupId=org.apache.cxf, artifactId=cxf-rt-frontend-jaxws, version=2.5.6-SNAPSHOT,
type=jar}] has changed (was Dependency {groupId=org.apache.cxf, artifactId=cxf-rt-frontend-jaxws,
version=2.5.6-SNAPSHOT, type=jar}).
[INFO] Dependency[Dependency {groupId=org.apache.cxf, artifactId=cxf-rt-ws-policy, version=2.5.6-SNAPSHOT,
type=jar}] has changed (was Dependency {groupId=org.apache.cxf, artifactId=cxf-rt-ws-policy,
version=2.5.6-SNAPSHOT, type=jar}).
[INFO] Dependency[Dependency {groupId=org.slf4j, artifactId=slf4j-jdk14, version=1.6.2, type=jar}]
has changed (was Dependency {groupId=org.slf4j, artifactId=slf4j-jdk14, version=1.6.2, type=jar}).
[INFO] Dependency[Dependency {groupId=net.sf.ehcache, artifactId=ehcache-core, version=2.5.1,
type=jar}] has changed (was Dependency {groupId=net.sf.ehcache, artifactId=ehcache-core, version=2.5.1,
type=jar}).
[INFO] Dependency[Dependency {groupId=org.springframework.ldap, artifactId=spring-ldap-core,
version=1.3.1.RELEASE, type=jar}] has changed (was Dependency {groupId=org.springframework.ldap,
artifactId=spring-ldap-core, version=1.3.1.RELEASE, type=jar}).
[INFO] Dependency[Dependency {groupId=com.hazelcast, artifactId=hazelcast, version=1.9.4,
type=jar}] has changed (was Dependency {groupId=com.hazelcast, artifactId=hazelcast, version=1.9.4,
type=jar}).
[INFO] Processing war project
[INFO] Copying webapp resources[<https://builds.apache.org/job/CXF-2.5-deploy/ws/cxf-2.5.x-fixes/services/sts/sts-war/src/main/webapp]>
[INFO] Webapp assembled in[341 msecs]
[INFO] Building war: <https://builds.apache.org/job/CXF-2.5-deploy/ws/cxf-2.5.x-fixes/services/sts/sts-war/target/SecurityTokenService.war>
[INFO] [source:jar-no-fork {execution: attach-sources}]
[INFO] org already added, skipping
[INFO] org/apache already added, skipping
[INFO] org/apache/cxf already added, skipping
[INFO] org/apache/cxf/sts already added, skipping
[INFO] org/apache/cxf/sts/war already added, skipping
[INFO] META-INF already added, skipping
[INFO] META-INF/NOTICE already added, skipping
[INFO] META-INF/DEPENDENCIES already added, skipping
[INFO] META-INF/LICENSE already added, skipping
[INFO] Building jar: <https://builds.apache.org/job/CXF-2.5-deploy/ws/cxf-2.5.x-fixes/services/sts/sts-war/target/SecurityTokenService-sources.jar>
[INFO] org already added, skipping
[INFO] org/apache already added, skipping
[INFO] org/apache/cxf already added, skipping
[INFO] org/apache/cxf/sts already added, skipping
[INFO] org/apache/cxf/sts/war already added, skipping
[INFO] META-INF already added, skipping
[INFO] META-INF/NOTICE already added, skipping
[INFO] META-INF/DEPENDENCIES already added, skipping
[INFO] META-INF/LICENSE already added, skipping
[INFO] [javadoc:jar {execution: attach-javadocs}]
[INFO] Building jar: <https://builds.apache.org/job/CXF-2.5-deploy/ws/cxf-2.5.x-fixes/services/sts/sts-war/target/SecurityTokenService-javadoc.jar>
[INFO] [install:install {execution: default-install}]
[INFO] Installing <https://builds.apache.org/job/CXF-2.5-deploy/ws/cxf-2.5.x-fixes/services/sts/sts-war/target/SecurityTokenService.war>
to <https://builds.apache.org/job/CXF-2.5-deploy/ws/.repository/org/apache/cxf/services/sts/cxf-services-sts-war/2.5.6-SNAPSHOT/cxf-services-sts-war-2.5.6-SNAPSHOT.war>
[INFO] Installing <https://builds.apache.org/job/CXF-2.5-deploy/ws/cxf-2.5.x-fixes/services/sts/sts-war/target/SecurityTokenService-sources.jar>
to <https://builds.apache.org/job/CXF-2.5-deploy/ws/.repository/org/apache/cxf/services/sts/cxf-services-sts-war/2.5.6-SNAPSHOT/cxf-services-sts-war-2.5.6-SNAPSHOT-sources.jar>
[INFO] Installing <https://builds.apache.org/job/CXF-2.5-deploy/ws/cxf-2.5.x-fixes/services/sts/sts-war/target/SecurityTokenService-javadoc.jar>
to <https://builds.apache.org/job/CXF-2.5-deploy/ws/.repository/org/apache/cxf/services/sts/cxf-services-sts-war/2.5.6-SNAPSHOT/cxf-services-sts-war-2.5.6-SNAPSHOT-javadoc.jar>
[INFO] [deploy:deploy {execution: default-deploy}]
[INFO] Retrieving previous build number from apache.snapshots.https
[INFO] ------------------------------------------------------------------------
[ERROR] BUILD ERROR
[INFO] ------------------------------------------------------------------------
[INFO] Error retrieving previous build number for artifact 'org.apache.cxf.services.sts:cxf-services-sts-war:war':
repository metadata for: 'snapshot org.apache.cxf.services.sts:cxf-services-sts-war:2.5.6-SNAPSHOT'
could not be retrieved from repository: apache.snapshots.https due to an error: Error transferring
file: Connection timed out

[INFO] ------------------------------------------------------------------------
[INFO] For more information, run Maven with the -e switch
[INFO] ------------------------------------------------------------------------
[INFO] Total time: 12 minutes 46 seconds
[INFO] Finished at: Thu Aug 16 07:12:51 UTC 2012
[INFO] Final Memory: 249M/322M
[INFO] ------------------------------------------------------------------------
Build step 'Invoke top-level Maven targets' marked build as failure
[locks-and-latches] Releasing all the locks
[locks-and-latches] All the locks released

Mime
View raw message