cxf-notifications mailing list archives

Site index · List index
Message view « Date » · « Thread »
Top « Date » · « Thread »
From Apache Jenkins Server <jenk...@builds.apache.org>
Subject Build failed in Jenkins: CXF-2.4-deploy #249
Date Wed, 25 Jul 2012 06:39:42 GMT
See <https://builds.apache.org/job/CXF-2.4-deploy/249/changes>

Changes:

[dkulp] Resolve merge issue

[dkulp] Recording revisions 1365178 via  git from
https://svn.apache.org/repos/asf/cxf/branches/2.5.x-fixes

[dkulp] Merged revisions 1365178 via  git cherry-pick from
https://svn.apache.org/repos/asf/cxf/branches/2.5.x-fixes

........
  r1365178 | dkulp | 2012-07-24 13:19:07 -0400 (Tue, 24 Jul 2012) | 19 lines

  Merged revisions 1365176 via  git cherry-pick from
  https://svn.apache.org/repos/asf/cxf/branches/2.6.x-fixes

  ........
    r1365176 | dkulp | 2012-07-24 13:16:33 -0400 (Tue, 24 Jul 2012) | 11 lines

    Merged revisions 1365174 via  git cherry-pick from
    https://svn.apache.org/repos/asf/cxf/trunk

    ........
      r1365174 | dkulp | 2012-07-24 13:12:31 -0400 (Tue, 24 Jul 2012) | 3 lines

      [CXF-4388] Wsdl options from artifacts only works if the artifact
      versions are the first options in the list.

    ........

  ........

........

[coheigea] Blocking revisions 1365134 via  git from
https://svn.apache.org/repos/asf/cxf/branches/2.5.x-fixes

........
  r1365134 | coheigea | 2012-07-24 16:33:48 +0100 (Tue, 24 Jul 2012) | 18 lines
  
  Merged revisions 1365131 via  git cherry-pick from
  https://svn.apache.org/repos/asf/cxf/branches/2.6.x-fixes
  
  ........
    r1365131 | coheigea | 2012-07-24 16:32:32 +0100 (Tue, 24 Jul 2012) | 10 lines
  
    Merged revisions 1365130 via  git cherry-pick from
    https://svn.apache.org/repos/asf/cxf/trunk
  
    ........
      r1365130 | coheigea | 2012-07-24 16:31:47 +0100 (Tue, 24 Jul 2012) | 2 lines
  
      Fixing build
  
    ........
  
  ........
  
........

[coheigea] Recording revisions 1365135 via  git from
https://svn.apache.org/repos/asf/cxf/branches/2.5.x-fixes

[sergeyb] Fixing the checkstyle issue

[coheigea] Recording revisions 1365116,1365120 via  git from
https://svn.apache.org/repos/asf/cxf/branches/2.5.x-fixes

[coheigea] Merged revisions 1365097 via  git cherry-pick from
https://svn.apache.org/repos/asf/cxf/trunk

........
  r1365097 | coheigea | 2012-07-24 15:50:49 +0100 (Tue, 24 Jul 2012) | 2 lines

  Update of SecurityConstant javadoc - part I

........

Conflicts:

	rt/ws/security/src/main/java/org/apache/cxf/ws/security/SecurityConstants.java


Conflicts:

	rt/ws/security/src/main/java/org/apache/cxf/ws/security/SecurityConstants.java

------------------------------------------
[...truncated 19518 lines...]
[WARNING] <https://builds.apache.org/job/CXF-2.4-deploy/ws/cxf-2.4.x-fixes/osgi/bundle/all/target/sources/org/apache/cxf/ws/security/SecurityConstants.java>:59:
warning - Tag @link: reference not found: USERNAME
[WARNING] <https://builds.apache.org/job/CXF-2.4-deploy/ws/cxf-2.4.x-fixes/osgi/bundle/all/target/sources/org/apache/cxf/ws/security/SecurityConstants.java>:59:
warning - Tag @link: reference not found: SIGNATURE_PROPERTIES
[WARNING] <https://builds.apache.org/job/CXF-2.4-deploy/ws/cxf-2.4.x-fixes/osgi/bundle/all/target/sources/org/apache/cxf/ws/security/SecurityConstants.java>:71:
warning - Tag @link: reference not found: USERNAME
[WARNING] <https://builds.apache.org/job/CXF-2.4-deploy/ws/cxf-2.4.x-fixes/osgi/bundle/all/target/sources/org/apache/cxf/ws/security/SecurityConstants.java>:71:
warning - Tag @link: reference not found: ENCRYPT_PROPERTIES
[WARNING] <https://builds.apache.org/job/CXF-2.4-deploy/ws/cxf-2.4.x-fixes/osgi/bundle/all/target/sources/org/apache/cxf/ws/security/SecurityConstants.java>:71:
warning - Tag @link: reference not found: ENCRYPT_PROPERTIES
[WARNING] <https://builds.apache.org/job/CXF-2.4-deploy/ws/cxf-2.4.x-fixes/osgi/bundle/all/target/sources/org/apache/cxf/ws/security/SecurityConstants.java>:102:
warning - Tag @link: reference not found: SIGNATURE_CRYPTO
[WARNING] <https://builds.apache.org/job/CXF-2.4-deploy/ws/cxf-2.4.x-fixes/osgi/bundle/all/target/sources/org/apache/cxf/ws/security/SecurityConstants.java>:111:
warning - Tag @link: reference not found: ENCRYPT_CRYPTO
[WARNING] <https://builds.apache.org/job/CXF-2.4-deploy/ws/cxf-2.4.x-fixes/osgi/bundle/all/target/sources/org/apache/cxf/ws/security/SecurityConstants.java>:117:
warning - Tag @link: reference not found: SIGNATURE_PROPERTIES
[WARNING] <https://builds.apache.org/job/CXF-2.4-deploy/ws/cxf-2.4.x-fixes/osgi/bundle/all/target/sources/org/apache/cxf/ws/security/SecurityConstants.java>:123:
warning - Tag @link: reference not found: ENCRYPT_PROPERTIES
[WARNING] <https://builds.apache.org/job/CXF-2.4-deploy/ws/cxf-2.4.x-fixes/osgi/bundle/all/target/sources/org/apache/cxf/transport/jms/uri/JMSEndpoint.java>:89:
warning - @return tag has no arguments.
[WARNING] <https://builds.apache.org/job/CXF-2.4-deploy/ws/cxf-2.4.x-fixes/osgi/bundle/all/target/sources/org/apache/cxf/transport/jms/uri/JMSEndpoint.java>:100:
warning - @return tag has no arguments.
[WARNING] <https://builds.apache.org/job/CXF-2.4-deploy/ws/cxf-2.4.x-fixes/osgi/bundle/all/target/sources/org/apache/cxf/transport/jms/uri/JMSEndpoint.java>:39:
warning - @param argument "uri" is not a parameter name.
[WARNING] <https://builds.apache.org/job/CXF-2.4-deploy/ws/cxf-2.4.x-fixes/osgi/bundle/all/target/sources/org/apache/cxf/transport/jms/uri/JMSEndpoint.java>:39:
warning - @param argument "subject" is not a parameter name.
[WARNING] <https://builds.apache.org/job/CXF-2.4-deploy/ws/cxf-2.4.x-fixes/osgi/bundle/all/target/sources/org/apache/cxf/transport/jms/uri/JMSEndpoint.java>:89:
warning - @param argument "targetserviceParameterName" is not a parameter name.
[WARNING] <https://builds.apache.org/job/CXF-2.4-deploy/ws/cxf-2.4.x-fixes/osgi/bundle/all/target/sources/org/apache/cxf/transport/jms/uri/JMSEndpointParser.java>:191:
warning - @param argument "parameters" is not a parameter name.
[WARNING] <https://builds.apache.org/job/CXF-2.4-deploy/ws/cxf-2.4.x-fixes/osgi/bundle/all/target/sources/org/apache/cxf/transport/jms/uri/ResolveEndpointFailedException.java>:26:
warning - Tag @link: reference not found: Endpoint
[WARNING] <https://builds.apache.org/job/CXF-2.4-deploy/ws/cxf-2.4.x-fixes/osgi/bundle/all/target/sources/org/apache/cxf/javascript/AttributeInfo.java>:69:
warning - @return tag has no arguments.
[WARNING] <https://builds.apache.org/job/CXF-2.4-deploy/ws/cxf-2.4.x-fixes/osgi/bundle/all/target/sources/org/apache/cxf/javascript/AttributeInfo.java>:89:
warning - @return tag has no arguments.
[WARNING] <https://builds.apache.org/job/CXF-2.4-deploy/ws/cxf-2.4.x-fixes/osgi/bundle/all/target/sources/org/apache/cxf/javascript/AttributeInfo.java>:186:
warning - @return tag has no arguments.
[WARNING] <https://builds.apache.org/job/CXF-2.4-deploy/ws/cxf-2.4.x-fixes/osgi/bundle/all/target/sources/org/apache/cxf/javascript/AttributeInfo.java>:247:
warning - @return tag has no arguments.
[WARNING] <https://builds.apache.org/job/CXF-2.4-deploy/ws/cxf-2.4.x-fixes/osgi/bundle/all/target/sources/org/apache/cxf/javascript/AttributeInfo.java>:89:
warning - @param argument "sequenceElement" is not a parameter name.
[WARNING] <https://builds.apache.org/job/CXF-2.4-deploy/ws/cxf-2.4.x-fixes/osgi/bundle/all/target/sources/org/apache/cxf/javascript/BasicNameManager.java>:132:
warning - @inheritDoc used but getJavascriptName(XmlSchemaComplexType) does not override or
implement any method.
[WARNING] <https://builds.apache.org/job/CXF-2.4-deploy/ws/cxf-2.4.x-fixes/osgi/bundle/all/target/sources/org/apache/cxf/javascript/BasicNameManager.java>:56:
warning - @return tag has no arguments.
[WARNING] <https://builds.apache.org/job/CXF-2.4-deploy/ws/cxf-2.4.x-fixes/osgi/bundle/all/target/sources/org/apache/cxf/javascript/BasicNameManager.java>:68:
warning - @return tag has no arguments.
[WARNING] <https://builds.apache.org/job/CXF-2.4-deploy/ws/cxf-2.4.x-fixes/osgi/bundle/all/target/sources/org/apache/cxf/javascript/BasicNameManager.java>:132:
warning - @inheritDoc used but getJavascriptName(XmlSchemaComplexType) does not override or
implement any method.
[WARNING] <https://builds.apache.org/job/CXF-2.4-deploy/ws/cxf-2.4.x-fixes/osgi/bundle/all/target/sources/org/apache/cxf/javascript/JavascriptUtils.java>:281:
warning - @return tag has no arguments.
[WARNING] <https://builds.apache.org/job/CXF-2.4-deploy/ws/cxf-2.4.x-fixes/osgi/bundle/all/target/sources/org/apache/cxf/javascript/JavascriptUtils.java>:270:
warning - @return tag has no arguments.
[WARNING] <https://builds.apache.org/job/CXF-2.4-deploy/ws/cxf-2.4.x-fixes/osgi/bundle/all/target/sources/org/apache/cxf/javascript/JavascriptUtils.java>:441:
warning - @param argument "elementInfo" is not a parameter name.
[WARNING] <https://builds.apache.org/job/CXF-2.4-deploy/ws/cxf-2.4.x-fixes/osgi/bundle/all/target/sources/org/apache/cxf/javascript/NamespacePrefixAccumulator.java>:100:
warning - @return tag has no arguments.
[WARNING] <https://builds.apache.org/job/CXF-2.4-deploy/ws/cxf-2.4.x-fixes/osgi/bundle/all/target/sources/org/apache/cxf/javascript/NamespacePrefixAccumulator.java>:82:
warning - @return tag has no arguments.
[WARNING] <https://builds.apache.org/job/CXF-2.4-deploy/ws/cxf-2.4.x-fixes/osgi/bundle/all/target/sources/org/apache/cxf/javascript/ParticleInfo.java>:73:
warning - @return tag has no arguments.
[WARNING] <https://builds.apache.org/job/CXF-2.4-deploy/ws/cxf-2.4.x-fixes/osgi/bundle/all/target/sources/org/apache/cxf/javascript/ParticleInfo.java>:130:
warning - @return tag has no arguments.
[WARNING] <https://builds.apache.org/job/CXF-2.4-deploy/ws/cxf-2.4.x-fixes/osgi/bundle/all/target/sources/org/apache/cxf/javascript/ParticleInfo.java>:101:
warning - @return tag has no arguments.
[WARNING] <https://builds.apache.org/job/CXF-2.4-deploy/ws/cxf-2.4.x-fixes/osgi/bundle/all/target/sources/org/apache/cxf/javascript/ParticleInfo.java>:393:
warning - @return tag has no arguments.
[WARNING] <https://builds.apache.org/job/CXF-2.4-deploy/ws/cxf-2.4.x-fixes/osgi/bundle/all/target/sources/org/apache/cxf/javascript/ParticleInfo.java>:130:
warning - @param argument "sequenceElement" is not a parameter name.
[WARNING] <https://builds.apache.org/job/CXF-2.4-deploy/ws/cxf-2.4.x-fixes/osgi/bundle/all/target/sources/org/apache/cxf/aegis/type/mtom/AbstractXOPType.java>:196:
warning - @return tag has no arguments.
[WARNING] <https://builds.apache.org/job/CXF-2.4-deploy/ws/cxf-2.4.x-fixes/osgi/bundle/all/target/sources/org/apache/cxf/aegis/type/mtom/AbstractXOPType.java>:89:
warning - @return tag has no arguments.
[WARNING] <https://builds.apache.org/job/CXF-2.4-deploy/ws/cxf-2.4.x-fixes/osgi/bundle/all/target/sources/org/apache/cxf/aegis/type/mtom/AbstractXOPType.java>:190:
warning - @return tag has no arguments.
[WARNING] <https://builds.apache.org/job/CXF-2.4-deploy/ws/cxf-2.4.x-fixes/osgi/bundle/all/target/sources/org/apache/cxf/ws/rm/policy/PolicyUtils.java>:53:
warning - @param argument "rma" is not a parameter name.
[WARNING] <https://builds.apache.org/job/CXF-2.4-deploy/ws/cxf-2.4.x-fixes/osgi/bundle/all/target/sources/org/apache/cxf/aegis/type/basic/ArrayType.java>:424:
warning - @return tag has no arguments.
[WARNING] <https://builds.apache.org/job/CXF-2.4-deploy/ws/cxf-2.4.x-fixes/osgi/bundle/all/target/sources/org/apache/cxf/aegis/type/basic/BeanType.java>:619:
warning - @return tag has no arguments.
[WARNING] <https://builds.apache.org/job/CXF-2.4-deploy/ws/cxf-2.4.x-fixes/osgi/bundle/all/target/sources/org/apache/cxf/aegis/type/basic/BeanType.java>:576:
warning - @return tag has no arguments.
[WARNING] <https://builds.apache.org/job/CXF-2.4-deploy/ws/cxf-2.4.x-fixes/osgi/bundle/all/target/sources/org/apache/cxf/aegis/type/basic/BeanType.java>:605:
warning - @return tag has no arguments.
[WARNING] <https://builds.apache.org/job/CXF-2.4-deploy/ws/cxf-2.4.x-fixes/osgi/bundle/all/target/sources/org/apache/cxf/aegis/type/basic/BeanTypeInfo.java>:85:
warning - @param argument "initiallize" is not a parameter name.
[WARNING] <https://builds.apache.org/job/CXF-2.4-deploy/ws/cxf-2.4.x-fixes/osgi/bundle/all/target/sources/org/apache/cxf/transport/jms/JMSConfiguration.java>:508:
warning - @return tag has no arguments.
[WARNING] <https://builds.apache.org/job/CXF-2.4-deploy/ws/cxf-2.4.x-fixes/osgi/bundle/all/target/sources/org/apache/cxf/transport/jms/JMSDestination.java>:171:
warning - @return tag has no arguments.
[WARNING] <https://builds.apache.org/job/CXF-2.4-deploy/ws/cxf-2.4.x-fixes/osgi/bundle/all/target/sources/org/apache/cxf/transport/jms/JMSFactory.java>:140:
warning - @return tag has no arguments.
[WARNING] <https://builds.apache.org/job/CXF-2.4-deploy/ws/cxf-2.4.x-fixes/osgi/bundle/all/target/sources/org/apache/cxf/transport/jms/JMSFactory.java>:191:
warning - @return tag has no arguments.
[WARNING] <https://builds.apache.org/job/CXF-2.4-deploy/ws/cxf-2.4.x-fixes/osgi/bundle/all/target/sources/org/apache/cxf/transport/jms/JMSFactory.java>:99:
warning - @return tag has no arguments.
[WARNING] <https://builds.apache.org/job/CXF-2.4-deploy/ws/cxf-2.4.x-fixes/osgi/bundle/all/target/sources/org/apache/cxf/transport/jms/JMSFactory.java>:191:
warning - @param argument "destinationName" is not a parameter name.
[WARNING] <https://builds.apache.org/job/CXF-2.4-deploy/ws/cxf-2.4.x-fixes/osgi/bundle/all/target/sources/org/apache/cxf/transport/jms/JMSOldConfigHolder.java>:180:
warning - @return tag has no arguments.
[WARNING] <https://builds.apache.org/job/CXF-2.4-deploy/ws/cxf-2.4.x-fixes/osgi/bundle/all/target/sources/org/apache/cxf/transport/jms/JMSUtils.java>:97:
warning - @param argument "replyTo" is not a parameter name.
[WARNING] <https://builds.apache.org/job/CXF-2.4-deploy/ws/cxf-2.4.x-fixes/osgi/bundle/all/target/sources/org/apache/cxf/transport/jms/JMSUtils.java>:122:
warning - @return tag cannot be used in method with void return type.
[WARNING] <https://builds.apache.org/job/CXF-2.4-deploy/ws/cxf-2.4.x-fixes/osgi/bundle/all/target/sources/org/apache/cxf/jaxws/handler/AnnotationHandlerChainBuilder.java>:72:
warning - @return tag has no arguments.
[WARNING] <https://builds.apache.org/job/CXF-2.4-deploy/ws/cxf-2.4.x-fixes/osgi/bundle/all/target/sources/org/apache/cxf/jaxrs/AbstractJAXRSFactoryBean.java>:267:
warning - @param argument "schema" is not a parameter name.
[WARNING] <https://builds.apache.org/job/CXF-2.4-deploy/ws/cxf-2.4.x-fixes/osgi/bundle/all/target/sources/org/apache/cxf/jaxrs/AbstractJAXRSFactoryBean.java>:283:
warning - @param argument "entityProviders" is not a parameter name.
[WARNING] <https://builds.apache.org/job/CXF-2.4-deploy/ws/cxf-2.4.x-fixes/osgi/bundle/all/target/sources/org/apache/cxf/jaxrs/JAXRSServerFactoryBean.java>:123:
warning - @return tag cannot be used in method with void return type.
[WARNING] <https://builds.apache.org/job/CXF-2.4-deploy/ws/cxf-2.4.x-fixes/osgi/bundle/all/target/sources/org/apache/cxf/jaxrs/JAXRSServerFactoryBean.java>:228:
warning - @param argument "lMaps" is not a parameter name.
[WARNING] <https://builds.apache.org/job/CXF-2.4-deploy/ws/cxf-2.4.x-fixes/osgi/bundle/all/target/sources/org/apache/cxf/jaxrs/JAXRSServerFactoryBean.java>:387:
warning - @param argument "documentLocation" is not a parameter name.
[WARNING] <https://builds.apache.org/job/CXF-2.4-deploy/ws/cxf-2.4.x-fixes/osgi/bundle/all/target/sources/org/apache/cxf/aegis/type/collection/MapType.java>:118:
warning - @return tag has no arguments.
[WARNING] <https://builds.apache.org/job/CXF-2.4-deploy/ws/cxf-2.4.x-fixes/osgi/bundle/all/target/sources/org/apache/cxf/transport/servlet/ServletDestination.java>:46:
warning - @param argument "ci" is not a parameter name.
[WARNING] <https://builds.apache.org/job/CXF-2.4-deploy/ws/cxf-2.4.x-fixes/osgi/bundle/all/target/sources/org/apache/cxf/transport/servlet/ServletDestination.java>:46:
warning - @param argument "cfg" is not a parameter name.
[WARNING] <https://builds.apache.org/job/CXF-2.4-deploy/ws/cxf-2.4.x-fixes/osgi/bundle/all/target/sources/org/apache/cxf/common/logging/LogUtils.java>:171:
warning - @param argument "name" is not a parameter name.
[WARNING] <https://builds.apache.org/job/CXF-2.4-deploy/ws/cxf-2.4.x-fixes/osgi/bundle/all/target/sources/org/apache/cxf/common/logging/LogUtils.java>:183:
warning - @param argument "name" is not a parameter name.
[WARNING] <https://builds.apache.org/job/CXF-2.4-deploy/ws/cxf-2.4.x-fixes/osgi/bundle/all/target/sources/org/apache/cxf/common/logging/LogUtils.java>:206:
warning - @param argument "name" is not a parameter name.
[WARNING] <https://builds.apache.org/job/CXF-2.4-deploy/ws/cxf-2.4.x-fixes/osgi/bundle/all/target/sources/org/apache/cxf/common/logging/LogUtils.java>:218:
warning - @param argument "name" is not a parameter name.
[WARNING] <https://builds.apache.org/job/CXF-2.4-deploy/ws/cxf-2.4.x-fixes/osgi/bundle/all/target/sources/org/apache/cxf/common/logging/Slf4jLogger.java>:50:
warning - Tag @link: reference not found: org.slf4j.bridge.SLF4JBridgeHandler
[WARNING] <https://builds.apache.org/job/CXF-2.4-deploy/ws/cxf-2.4.x-fixes/osgi/bundle/all/target/sources/org/apache/cxf/jaxws/EndpointImpl.java>:534:
warning - @return tag has no arguments.
[WARNING] <https://builds.apache.org/job/CXF-2.4-deploy/ws/cxf-2.4.x-fixes/osgi/bundle/all/target/sources/org/apache/cxf/aegis/AbstractAegisIoImpl.java>:58:
warning - @inheritDoc used but setProperty(String, Object) does not override or implement
any method.
[WARNING] <https://builds.apache.org/job/CXF-2.4-deploy/ws/cxf-2.4.x-fixes/osgi/bundle/all/target/sources/org/apache/cxf/aegis/AbstractAegisIoImpl.java>:65:
warning - @inheritDoc used but setSchema(Schema) does not override or implement any method.
[WARNING] <https://builds.apache.org/job/CXF-2.4-deploy/ws/cxf-2.4.x-fixes/osgi/bundle/all/target/sources/org/apache/cxf/aegis/AbstractAegisIoImpl.java>:58:
warning - @inheritDoc used but setProperty(String, Object) does not override or implement
any method.
[WARNING] <https://builds.apache.org/job/CXF-2.4-deploy/ws/cxf-2.4.x-fixes/osgi/bundle/all/target/sources/org/apache/cxf/aegis/AbstractAegisIoImpl.java>:65:
warning - @inheritDoc used but setSchema(Schema) does not override or implement any method.
[WARNING] <https://builds.apache.org/job/CXF-2.4-deploy/ws/cxf-2.4.x-fixes/osgi/bundle/all/target/sources/org/apache/cxf/aegis/AegisContext.java>:459:
warning - @return tag has no arguments.
[WARNING] <https://builds.apache.org/job/CXF-2.4-deploy/ws/cxf-2.4.x-fixes/osgi/bundle/all/target/sources/org/apache/cxf/aegis/AegisContext.java>:513:
warning - @return tag has no arguments.
[WARNING] <https://builds.apache.org/job/CXF-2.4-deploy/ws/cxf-2.4.x-fixes/osgi/bundle/all/target/sources/org/apache/cxf/aegis/AegisContext.java>:346:
warning - @return tag has no arguments.
[WARNING] <https://builds.apache.org/job/CXF-2.4-deploy/ws/cxf-2.4.x-fixes/osgi/bundle/all/target/sources/org/apache/cxf/aegis/AegisContext.java>:182:
warning - @return tag has no arguments.
[WARNING] <https://builds.apache.org/job/CXF-2.4-deploy/ws/cxf-2.4.x-fixes/osgi/bundle/all/target/sources/org/apache/cxf/aegis/AegisContext.java>:196:
warning - @return tag has no arguments.
[WARNING] <https://builds.apache.org/job/CXF-2.4-deploy/ws/cxf-2.4.x-fixes/osgi/bundle/all/target/sources/org/apache/cxf/aegis/AegisContext.java>:430:
warning - @return tag has no arguments.
[WARNING] <https://builds.apache.org/job/CXF-2.4-deploy/ws/cxf-2.4.x-fixes/osgi/bundle/all/target/sources/org/apache/cxf/aegis/AegisContext.java>:485:
warning - @return tag has no arguments.
[WARNING] <https://builds.apache.org/job/CXF-2.4-deploy/ws/cxf-2.4.x-fixes/osgi/bundle/all/target/sources/org/apache/cxf/aegis/AegisContext.java>:498:
warning - @return tag has no arguments.
[WARNING] <https://builds.apache.org/job/CXF-2.4-deploy/ws/cxf-2.4.x-fixes/osgi/bundle/all/target/sources/org/apache/cxf/aegis/AegisContext.java>:139:
warning - @param argument "mappingNamespaceURI" is not a parameter name.
[WARNING] <https://builds.apache.org/job/CXF-2.4-deploy/ws/cxf-2.4.x-fixes/osgi/bundle/all/target/sources/org/apache/cxf/aegis/AegisContext.java>:385:
warning - @param argument "configuration" is not a parameter name.
[WARNING] <https://builds.apache.org/job/CXF-2.4-deploy/ws/cxf-2.4.x-fixes/osgi/bundle/all/target/sources/org/apache/cxf/aegis/AegisContext.java>:394:
warning - @param argument "configuration" is not a parameter name.
[WARNING] <https://builds.apache.org/job/CXF-2.4-deploy/ws/cxf-2.4.x-fixes/osgi/bundle/all/target/sources/org/apache/cxf/aegis/AegisElementDataReader.java>:41:
warning - @return tag has no arguments.
[WARNING] <https://builds.apache.org/job/CXF-2.4-deploy/ws/cxf-2.4.x-fixes/osgi/bundle/all/target/sources/org/apache/cxf/aegis/AegisReader.java>:43:
warning - @return tag has no arguments.
[WARNING] <https://builds.apache.org/job/CXF-2.4-deploy/ws/cxf-2.4.x-fixes/osgi/bundle/all/target/sources/org/apache/cxf/aegis/AegisReader.java>:35:
warning - @return tag has no arguments.
[WARNING] <https://builds.apache.org/job/CXF-2.4-deploy/ws/cxf-2.4.x-fixes/osgi/bundle/all/target/sources/org/apache/cxf/aegis/AegisIo.java>:47:
warning - Tag @link: can't find FAULT in org.apache.cxf.aegis.AegisIo
[WARNING] <https://builds.apache.org/job/CXF-2.4-deploy/ws/cxf-2.4.x-fixes/osgi/bundle/all/target/sources/org/apache/cxf/aegis/AegisIo.java>:47:
warning - Tag @link: can't find ENDPOINT in org.apache.cxf.aegis.AegisIo
[WARNING] <https://builds.apache.org/job/CXF-2.4-deploy/ws/cxf-2.4.x-fixes/osgi/bundle/all/target/sources/org/apache/cxf/ws/rm/soap/RetransmissionQueueImpl.java>:206:
warning - @param argument "ctx" is not a parameter name.
[WARNING] <https://builds.apache.org/job/CXF-2.4-deploy/ws/cxf-2.4.x-fixes/osgi/bundle/all/target/sources/org/apache/cxf/ws/rm/soap/RetransmissionQueueImpl.java>:240:
warning - @pre is an unknown tag.
[WARNING] <https://builds.apache.org/job/CXF-2.4-deploy/ws/cxf-2.4.x-fixes/osgi/bundle/all/target/sources/org/apache/cxf/ws/rm/soap/RetransmissionQueueImpl.java>:249:
warning - @pre is an unknown tag.
[WARNING] <https://builds.apache.org/job/CXF-2.4-deploy/ws/cxf-2.4.x-fixes/osgi/bundle/all/target/sources/org/apache/cxf/ws/rm/soap/RetransmissionQueueImpl.java>:390:
warning - @param argument "ctx" is not a parameter name.
[WARNING] <https://builds.apache.org/job/CXF-2.4-deploy/ws/cxf-2.4.x-fixes/osgi/bundle/all/target/sources/org/apache/cxf/ws/rm/soap/RetransmissionQueueImpl.java>:574:
warning - @param argument "context" is not a parameter name.
[WARNING] <https://builds.apache.org/job/CXF-2.4-deploy/ws/cxf-2.4.x-fixes/osgi/bundle/all/target/sources/org/apache/cxf/ws/rm/soap/RetransmissionQueueImpl.java>:574:
warning - @param argument "if" is not a parameter name.
[WARNING] <https://builds.apache.org/job/CXF-2.4-deploy/ws/cxf-2.4.x-fixes/osgi/bundle/all/target/sources/org/apache/cxf/ws/rm/soap/RMSoapInterceptor.java>:408:
warning - @param argument "marshaller" is not a parameter name.
[WARNING] <https://builds.apache.org/job/CXF-2.4-deploy/ws/cxf-2.4.x-fixes/osgi/bundle/all/target/sources/org/apache/cxf/common/util/ReflectionUtil.java>:188:
warning - @return tag has no arguments.
[WARNING] <https://builds.apache.org/job/CXF-2.4-deploy/ws/cxf-2.4.x-fixes/osgi/bundle/all/target/sources/org/apache/cxf/common/util/UrlUtils.java>:68:
warning - @return tag has no arguments.
[WARNING] <https://builds.apache.org/job/CXF-2.4-deploy/ws/cxf-2.4.x-fixes/osgi/bundle/all/target/sources/org/apache/cxf/common/util/UrlUtils.java>:49:
warning - @return tag has no arguments.
[WARNING] <https://builds.apache.org/job/CXF-2.4-deploy/ws/cxf-2.4.x-fixes/osgi/bundle/all/target/sources/org/apache/cxf/binding/soap/interceptor/EndpointSelectionInterceptor.java>:40:
warning - @return tag has no arguments.
[WARNING] <https://builds.apache.org/job/CXF-2.4-deploy/ws/cxf-2.4.x-fixes/osgi/bundle/all/target/sources/org/apache/cxf/binding/soap/interceptor/EndpointSelectionInterceptor.java>:40:
warning - Tag @return cannot be used in class documentation.  It can only be used in the following
types of documentation: method.
[WARNING] <https://builds.apache.org/job/CXF-2.4-deploy/ws/cxf-2.4.x-fixes/osgi/bundle/all/target/sources/org/apache/cxf/aegis/util/jdom/StaxBuilder.java>:84:
warning - Tag @link: reference not found: org.jdom.Document org.jdom.Document
[WARNING] <https://builds.apache.org/job/CXF-2.4-deploy/ws/cxf-2.4.x-fixes/osgi/bundle/all/target/sources/org/apache/cxf/aegis/util/jdom/StaxBuilder.java>:168:
warning - Tag @link: reference not found: org.jdom.JDOMFactory
[WARNING] <https://builds.apache.org/job/CXF-2.4-deploy/ws/cxf-2.4.x-fixes/osgi/bundle/all/target/sources/org/apache/cxf/aegis/util/jdom/StaxBuilder.java>:168:
warning - Tag @link: reference not found: org.jdom.JDOMFactory
[WARNING] <https://builds.apache.org/job/CXF-2.4-deploy/ws/cxf-2.4.x-fixes/osgi/bundle/all/target/sources/org/apache/cxf/ws/addressing/AddressingPropertiesImpl.java>:79:
warning - @param argument "iri" is not a parameter name.
[WARNING] <https://builds.apache.org/job/CXF-2.4-deploy/ws/cxf-2.4.x-fixes/osgi/bundle/all/target/sources/org/apache/cxf/ws/addressing/AddressingPropertiesImpl.java>:86:
warning - @param argument "iri" is not a parameter name.
[WARNING] <https://builds.apache.org/job/CXF-2.4-deploy/ws/cxf-2.4.x-fixes/osgi/bundle/all/target/sources/org/apache/cxf/ws/addressing/AddressingPropertiesImpl.java>:201:
warning - @return tag cannot be used in method with void return type.
[WARNING] <https://builds.apache.org/job/CXF-2.4-deploy/ws/cxf-2.4.x-fixes/osgi/bundle/all/target/sources/org/apache/cxf/ws/addressing/ContextUtils.java>:212:
warning - @param argument "handler" is not a parameter name.
[WARNING] <https://builds.apache.org/job/CXF-2.4-deploy/ws/cxf-2.4.x-fixes/osgi/bundle/all/target/sources/org/apache/cxf/ws/addressing/ContextUtils.java>:230:
warning - @param argument "handler" is not a parameter name.
[WARNING] <https://builds.apache.org/job/CXF-2.4-deploy/ws/cxf-2.4.x-fixes/osgi/bundle/all/target/sources/org/apache/cxf/ws/addressing/ContextUtils.java>:358:
warning - @param argument "ref" is not a parameter name.
[WARNING] <https://builds.apache.org/job/CXF-2.4-deploy/ws/cxf-2.4.x-fixes/osgi/bundle/all/target/sources/org/apache/cxf/ws/addressing/ContextUtils.java>:649:
warning - @returned is an unknown tag.
[WARNING] <https://builds.apache.org/job/CXF-2.4-deploy/ws/cxf-2.4.x-fixes/osgi/bundle/all/target/sources/org/apache/cxf/ws/addressing/ContextUtils.java>:670:
warning - @returned is an unknown tag.
[WARNING] <https://builds.apache.org/job/CXF-2.4-deploy/ws/cxf-2.4.x-fixes/osgi/bundle/all/target/sources/org/apache/cxf/ws/addressing/ContextUtils.java>:694:
warning - @returned is an unknown tag.
[WARNING] <https://builds.apache.org/job/CXF-2.4-deploy/ws/cxf-2.4.x-fixes/osgi/bundle/all/target/sources/org/apache/cxf/ws/addressing/ContextUtils.java>:718:
warning - @returned is an unknown tag.
[WARNING] <https://builds.apache.org/job/CXF-2.4-deploy/ws/cxf-2.4.x-fixes/osgi/bundle/all/target/sources/org/apache/cxf/ws/addressing/ContextUtils.java>:744:
warning - @returned is an unknown tag.
[WARNING] <https://builds.apache.org/job/CXF-2.4-deploy/ws/cxf-2.4.x-fixes/osgi/bundle/all/target/sources/org/apache/cxf/ws/addressing/ContextUtils.java>:759:
warning - @returned is an unknown tag.
[WARNING] <https://builds.apache.org/job/CXF-2.4-deploy/ws/cxf-2.4.x-fixes/osgi/bundle/all/target/sources/org/apache/cxf/ws/addressing/ContextUtils.java>:976:
warning - @param argument "message" is not a parameter name.
[WARNING] <https://builds.apache.org/job/CXF-2.4-deploy/ws/cxf-2.4.x-fixes/osgi/bundle/all/target/sources/org/apache/cxf/aegis/util/jdom/StaxBuilder.java>:84:
warning - Tag @link: reference not found: org.jdom.Document org.jdom.Document
[WARNING] <https://builds.apache.org/job/CXF-2.4-deploy/ws/cxf-2.4.x-fixes/osgi/bundle/all/target/sources/org/apache/cxf/transport/jms/uri/ResolveEndpointFailedException.java>:26:
warning - Tag @link: reference not found: Endpoint
[WARNING] com.sun.tools.javac.code.Symbol$CompletionFailure: file org/jibx/binding/model/ModelVisitor.class
not found
[WARNING] <https://builds.apache.org/job/CXF-2.4-deploy/ws/cxf-2.4.x-fixes/osgi/bundle/all/target/sources/org/apache/cxf/transport/jms/uri/ResolveEndpointFailedException.java>:26:
warning - Tag @link: reference not found: Endpoint
[WARNING] <https://builds.apache.org/job/CXF-2.4-deploy/ws/cxf-2.4.x-fixes/osgi/bundle/all/target/sources/org/apache/cxf/bus/osgi/OSGiExtensionLocator.java>:62:
warning - @inheritDoc used but bundleChanged(BundleEvent) does not override or implement any
method.
[WARNING] <https://builds.apache.org/job/CXF-2.4-deploy/ws/cxf-2.4.x-fixes/osgi/bundle/all/target/sources/org/apache/cxf/binding/soap/blueprint/SoapVersionTypeConverter.java>:33:
warning - @inheritDoc used but canConvert(Object, ReifiedType) does not override or implement
any method.
[WARNING] <https://builds.apache.org/job/CXF-2.4-deploy/ws/cxf-2.4.x-fixes/osgi/bundle/all/target/sources/org/apache/cxf/configuration/blueprint/InterceptorTypeConverter.java>:32:
warning - @inheritDoc used but canConvert(Object, ReifiedType) does not override or implement
any method.
[WARNING] <https://builds.apache.org/job/CXF-2.4-deploy/ws/cxf-2.4.x-fixes/osgi/bundle/all/target/sources/org/apache/cxf/binding/soap/blueprint/SoapVersionTypeConverter.java>:40:
warning - @inheritDoc used but convert(Object, ReifiedType) does not override or implement
any method.
[WARNING] <https://builds.apache.org/job/CXF-2.4-deploy/ws/cxf-2.4.x-fixes/osgi/bundle/all/target/sources/org/apache/cxf/configuration/blueprint/InterceptorTypeConverter.java>:38:
warning - @inheritDoc used but convert(Object, ReifiedType) does not override or implement
any method.
[WARNING] <https://builds.apache.org/job/CXF-2.4-deploy/ws/cxf-2.4.x-fixes/osgi/bundle/all/target/sources/org/apache/cxf/ws/security/sts/provider/model/ObjectFactory.java>:581:
warning - Tag @link: reference not found: byte[]
[WARNING] <https://builds.apache.org/job/CXF-2.4-deploy/ws/cxf-2.4.x-fixes/osgi/bundle/all/target/sources/org/apache/cxf/ws/security/sts/provider/model/xmldsig/ObjectFactory.java>:519:
warning - Tag @link: reference not found: byte[]
[WARNING] <https://builds.apache.org/job/CXF-2.4-deploy/ws/cxf-2.4.x-fixes/osgi/bundle/all/target/sources/org/apache/cxf/ws/security/sts/provider/model/xmldsig/ObjectFactory.java>:267:
warning - Tag @link: reference not found: byte[]
[WARNING] <https://builds.apache.org/job/CXF-2.4-deploy/ws/cxf-2.4.x-fixes/osgi/bundle/all/target/sources/org/apache/cxf/ws/security/sts/provider/model/xmldsig/ObjectFactory.java>:258:
warning - Tag @link: reference not found: byte[]
[WARNING] <https://builds.apache.org/job/CXF-2.4-deploy/ws/cxf-2.4.x-fixes/osgi/bundle/all/target/sources/org/apache/cxf/ws/security/sts/provider/model/xmldsig/ObjectFactory.java>:555:
warning - Tag @link: reference not found: byte[]
[WARNING] <https://builds.apache.org/job/CXF-2.4-deploy/ws/cxf-2.4.x-fixes/osgi/bundle/all/target/sources/org/apache/cxf/ws/security/sts/provider/model/xmldsig/ObjectFactory.java>:285:
warning - Tag @link: reference not found: byte[]
[WARNING] <https://builds.apache.org/job/CXF-2.4-deploy/ws/cxf-2.4.x-fixes/osgi/bundle/all/target/sources/org/apache/cxf/ws/security/sts/provider/model/xmldsig/ObjectFactory.java>:312:
warning - Tag @link: reference not found: byte[]
[WARNING] <https://builds.apache.org/job/CXF-2.4-deploy/ws/cxf-2.4.x-fixes/osgi/bundle/all/target/sources/org/apache/cxf/ws/security/sts/provider/model/xmldsig/ObjectFactory.java>:276:
warning - Tag @link: reference not found: byte[]
[WARNING] <https://builds.apache.org/job/CXF-2.4-deploy/ws/cxf-2.4.x-fixes/osgi/bundle/all/target/sources/org/apache/cxf/ws/security/SecurityConstants.java>:111:
warning - Tag @link: reference not found: ENCRYPT_CRYPTO
[WARNING] <https://builds.apache.org/job/CXF-2.4-deploy/ws/cxf-2.4.x-fixes/osgi/bundle/all/target/sources/org/apache/cxf/aegis/util/jdom/StaxBuilder.java>:168:
warning - Tag @link: reference not found: org.jdom.JDOMFactory
[WARNING] <https://builds.apache.org/job/CXF-2.4-deploy/ws/cxf-2.4.x-fixes/osgi/bundle/all/target/sources/org/apache/cxf/javascript/BasicNameManager.java>:132:
warning - @inheritDoc used but getJavascriptName(XmlSchemaComplexType) does not override or
implement any method.
[WARNING] <https://builds.apache.org/job/CXF-2.4-deploy/ws/cxf-2.4.x-fixes/osgi/bundle/all/target/sources/org/apache/cxf/ws/security/SecurityConstants.java>:50:
warning - Tag @link: reference not found: CALLBACK_HANDLER
[WARNING] <https://builds.apache.org/job/CXF-2.4-deploy/ws/cxf-2.4.x-fixes/osgi/bundle/all/target/sources/org/apache/cxf/transport/jms/uri/ResolveEndpointFailedException.java>:26:
warning - Tag @link: reference not found: Endpoint
[WARNING] <https://builds.apache.org/job/CXF-2.4-deploy/ws/cxf-2.4.x-fixes/osgi/bundle/all/target/sources/org/apache/cxf/jaxrs/provider/AbstractConfigurableProvider.java>:65:
warning - Tag @link: reference not found: Consumes
[WARNING] <https://builds.apache.org/job/CXF-2.4-deploy/ws/cxf-2.4.x-fixes/osgi/bundle/all/target/sources/org/apache/cxf/jaxrs/provider/AbstractConfigurableProvider.java>:82:
warning - Tag @link: reference not found: Produces
[WARNING] <https://builds.apache.org/job/CXF-2.4-deploy/ws/cxf-2.4.x-fixes/osgi/bundle/all/target/sources/org/apache/cxf/aegis/AbstractAegisIoImpl.java>:58:
warning - @inheritDoc used but setProperty(String, Object) does not override or implement
any method.
[WARNING] <https://builds.apache.org/job/CXF-2.4-deploy/ws/cxf-2.4.x-fixes/osgi/bundle/all/target/sources/org/apache/cxf/aegis/AbstractAegisIoImpl.java>:65:
warning - @inheritDoc used but setSchema(Schema) does not override or implement any method.
[WARNING] <https://builds.apache.org/job/CXF-2.4-deploy/ws/cxf-2.4.x-fixes/osgi/bundle/all/target/sources/org/apache/cxf/ws/security/SecurityConstants.java>:102:
warning - Tag @link: reference not found: SIGNATURE_CRYPTO
[WARNING] <https://builds.apache.org/job/CXF-2.4-deploy/ws/cxf-2.4.x-fixes/osgi/bundle/all/target/sources/org/apache/cxf/bus/osgi/OSGiExtensionLocator.java>:75:
warning - @inheritDoc used but start(BundleContext) does not override or implement any method.
[WARNING] <https://builds.apache.org/job/CXF-2.4-deploy/ws/cxf-2.4.x-fixes/osgi/bundle/all/target/sources/org/apache/cxf/aegis/util/jdom/StaxBuilder.java>:84:
warning - Tag @link: reference not found: org.jdom.Document org.jdom.Document
[WARNING] <https://builds.apache.org/job/CXF-2.4-deploy/ws/cxf-2.4.x-fixes/osgi/bundle/all/target/sources/org/apache/cxf/bus/osgi/OSGiExtensionLocator.java>:91:
warning - @inheritDoc used but stop(BundleContext) does not override or implement any method.
[INFO] Building jar: <https://builds.apache.org/job/CXF-2.4-deploy/ws/cxf-2.4.x-fixes/osgi/bundle/all/target/cxf-bundle-2.4.9-SNAPSHOT-javadoc.jar>
[INFO] [install:install {execution: default-install}]
[INFO] Installing <https://builds.apache.org/job/CXF-2.4-deploy/ws/cxf-2.4.x-fixes/osgi/bundle/all/target/cxf-bundle-2.4.9-SNAPSHOT.jar>
to /home/jenkins/jenkins-slave/maven-repositories/1/org/apache/cxf/cxf-bundle/2.4.9-SNAPSHOT/cxf-bundle-2.4.9-SNAPSHOT.jar
[INFO] Installing <https://builds.apache.org/job/CXF-2.4-deploy/ws/cxf-2.4.x-fixes/osgi/bundle/all/target/cxf-bundle-2.4.9-SNAPSHOT-sources.jar>
to /home/jenkins/jenkins-slave/maven-repositories/1/org/apache/cxf/cxf-bundle/2.4.9-SNAPSHOT/cxf-bundle-2.4.9-SNAPSHOT-sources.jar
[INFO] Installing <https://builds.apache.org/job/CXF-2.4-deploy/ws/cxf-2.4.x-fixes/osgi/bundle/all/target/cxf-bundle-2.4.9-SNAPSHOT-sources.jar>
to /home/jenkins/jenkins-slave/maven-repositories/1/org/apache/cxf/cxf-bundle/2.4.9-SNAPSHOT/cxf-bundle-2.4.9-SNAPSHOT-sources.jar
[INFO] Installing <https://builds.apache.org/job/CXF-2.4-deploy/ws/cxf-2.4.x-fixes/osgi/bundle/all/target/cxf-bundle-2.4.9-SNAPSHOT-javadoc.jar>
to /home/jenkins/jenkins-slave/maven-repositories/1/org/apache/cxf/cxf-bundle/2.4.9-SNAPSHOT/cxf-bundle-2.4.9-SNAPSHOT-javadoc.jar
[INFO] Installing <https://builds.apache.org/job/CXF-2.4-deploy/ws/cxf-2.4.x-fixes/osgi/bundle/all/target/cxf-bundle-2.4.9-SNAPSHOT-javadoc.jar>
to /home/jenkins/jenkins-slave/maven-repositories/1/org/apache/cxf/cxf-bundle/2.4.9-SNAPSHOT/cxf-bundle-2.4.9-SNAPSHOT-javadoc.jar
[INFO] [bundle:install {execution: default-install}]
[INFO] Installing org/apache/cxf/cxf-bundle/2.4.9-SNAPSHOT/cxf-bundle-2.4.9-SNAPSHOT.jar
[INFO] Installing org/apache/cxf/cxf-bundle/2.4.9-SNAPSHOT/cxf-bundle-2.4.9-SNAPSHOT-sources.jar
[INFO] Writing OBR metadata
[INFO] [deploy:deploy {execution: default-deploy}]
[INFO] Retrieving previous build number from apache.snapshots.https
[WARNING] *** CHECKSUM FAILED - Checksum failed on download: local = 'afe1ed9ed9f660407de32634defb4f1ba9f28055';
remote = '10062a3b9b2bcd52a6db42ecfa91d8bf0904467c' - RETRYING
[WARNING] *** CHECKSUM FAILED - Checksum failed on download: local = 'afe1ed9ed9f660407de32634defb4f1ba9f28055';
remote = '10062a3b9b2bcd52a6db42ecfa91d8bf0904467c' - IGNORING
Uploading: https://repository.apache.org/content/repositories/snapshots/org/apache/cxf/cxf-bundle/2.4.9-SNAPSHOT/cxf-bundle-2.4.9-20120725.061855-17.jar
5667K uploaded  (cxf-bundle-2.4.9-20120725.061855-17.jar)
[INFO] Uploading project information for cxf-bundle 2.4.9-20120725.061855-17
[INFO] Retrieving previous metadata from apache.snapshots.https
[INFO] Uploading repository metadata for: 'artifact org.apache.cxf:cxf-bundle'
[INFO] Retrieving previous metadata from apache.snapshots.https
[WARNING] *** CHECKSUM FAILED - Checksum failed on download: local = 'afe1ed9ed9f660407de32634defb4f1ba9f28055';
remote = '10062a3b9b2bcd52a6db42ecfa91d8bf0904467c' - RETRYING
[WARNING] *** CHECKSUM FAILED - Checksum failed on download: local = 'afe1ed9ed9f660407de32634defb4f1ba9f28055';
remote = '10062a3b9b2bcd52a6db42ecfa91d8bf0904467c' - IGNORING
[INFO] Uploading repository metadata for: 'snapshot org.apache.cxf:cxf-bundle:2.4.9-SNAPSHOT'
[INFO] Retrieving previous build number from apache.snapshots.https
Uploading: https://repository.apache.org/content/repositories/snapshots/org/apache/cxf/cxf-bundle/2.4.9-SNAPSHOT/cxf-bundle-2.4.9-20120725.061855-17-sources.jar
4438K uploaded  (cxf-bundle-2.4.9-20120725.061855-17-sources.jar)
[INFO] Retrieving previous build number from apache.snapshots.https
Uploading: https://repository.apache.org/content/repositories/snapshots/org/apache/cxf/cxf-bundle/2.4.9-SNAPSHOT/cxf-bundle-2.4.9-20120725.061855-17-sources.jar
4438K uploaded  (cxf-bundle-2.4.9-20120725.061855-17-sources.jar)
[INFO] Retrieving previous build number from apache.snapshots.https
Uploading: https://repository.apache.org/content/repositories/snapshots/org/apache/cxf/cxf-bundle/2.4.9-SNAPSHOT/cxf-bundle-2.4.9-20120725.061855-17-javadoc.jar
14548K uploaded  (cxf-bundle-2.4.9-20120725.061855-17-javadoc.jar)
[INFO] Retrieving previous build number from apache.snapshots.https
Uploading: https://repository.apache.org/content/repositories/snapshots/org/apache/cxf/cxf-bundle/2.4.9-SNAPSHOT/cxf-bundle-2.4.9-20120725.061855-17-javadoc.jar
14548K uploaded  (cxf-bundle-2.4.9-20120725.061855-17-javadoc.jar)
[INFO] [bundle:deploy {execution: default-deploy}]
[INFO] Remote OBR update disabled (enable with -DremoteOBR)
Jul 25, 2012 6:39:37 AM hudson.remoting.SynchronousCommandTransport$ReaderThread run
SEVERE: I/O error in channel channel
java.io.StreamCorruptedException
	at java.io.ObjectInputStream.readObject0(ObjectInputStream.java:1332)
	at java.io.ObjectInputStream.readObject(ObjectInputStream.java:348)
	at hudson.remoting.Command.readFrom(Command.java:90)
	at hudson.remoting.ClassicCommandTransport.read(ClassicCommandTransport.java:59)
	at hudson.remoting.SynchronousCommandTransport$ReaderThread.run(SynchronousCommandTransport.java:48)
channel stopped
[INFO] ------------------------------------------------------------------------
[ERROR] FATAL ERROR
[INFO] ------------------------------------------------------------------------
[INFO] null
[INFO] ------------------------------------------------------------------------
[INFO] Trace
java.lang.reflect.UndeclaredThrowableException
	at $Proxy2.isArchivingDisabled(Unknown Source)
	at hudson.maven.MavenBuildProxy$Filter.isArchivingDisabled(MavenBuildProxy.java:227)
	at hudson.maven.reporters.MavenArtifact.archive(MavenArtifact.java:223)
	at hudson.maven.reporters.MavenArtifactArchiver.postBuild(MavenArtifactArchiver.java:108)
	at hudson.maven.Maven2Builder.postModule(Maven2Builder.java:127)
	at hudson.maven.MavenBuilder$Adapter.fireLeaveModule(MavenBuilder.java:327)
	at hudson.maven.MavenBuilder$Adapter.postBuild(MavenBuilder.java:285)
	at org.apache.maven.lifecycle.LifecycleExecutorInterceptor.execute(LifecycleExecutorInterceptor.java:68)
	at org.apache.maven.DefaultMaven.doExecute(DefaultMaven.java:328)
	at org.apache.maven.DefaultMaven.execute(DefaultMaven.java:138)
	at org.apache.maven.cli.MavenCli.main(MavenCli.java:362)
	at sun.reflect.NativeMethodAccessorImpl.invoke0(Native Method)
	at sun.reflect.NativeMethodAccessorImpl.invoke(NativeMethodAccessorImpl.java:39)
	at sun.reflect.DelegatingMethodAccessorImpl.invoke(DelegatingMethodAccessorImpl.java:25)
	at java.lang.reflect.Method.invoke(Method.java:592)
	at org.codehaus.classworlds.Launcher.launchEnhanced(Launcher.java:315)
	at org.codehaus.classworlds.Launcher.launch(Launcher.java:255)
	at hudson.maven.agent.Main.launch(Main.java:185)
	at hudson.maven.MavenBuilder.call(MavenBuilder.java:151)
	at hudson.maven.Maven2Builder.call(Maven2Builder.java:77)
	at hudson.maven.Maven2Builder.call(Maven2Builder.java:53)
	at hudson.remoting.UserRequest.perform(UserRequest.java:118)
	at hudson.remoting.UserRequest.perform(UserRequest.java:48)
	at hudson.remoting.Request$2.run(Request.java:326)
	at hudson.remoting.InterceptingExecutorService$1.call(InterceptingExecutorService.java:72)
	at java.util.concurrent.FutureTask$Sync.innerRun(FutureTask.java:269)
	at java.util.concurrent.FutureTask.run(FutureTask.java:123)
	at java.util.concurrent.ThreadPoolExecutor$Worker.runTask(ThreadPoolExecutor.java:651)
	at java.util.concurrent.ThreadPoolExecutor$Worker.run(ThreadPoolExecutor.java:676)
	at java.lang.Thread.run(Thread.java:595)
Caused by: hudson.remoting.ChannelClosedException: channel is already closed
	at hudson.remoting.Channel.send(Channel.java:492)
	at hudson.remoting.Request.call(Request.java:129)
	at hudson.remoting.Channel.call(Channel.java:663)
	at hudson.remoting.RemoteInvocationHandler.invoke(RemoteInvocationHandler.java:158)
	... 30 more
Caused by: java.io.StreamCorruptedException
	at java.io.ObjectInputStream.readObject0(ObjectInputStream.java:1332)
	at java.io.ObjectInputStream.readObject(ObjectInputStream.java:348)
	at hudson.remoting.Command.readFrom(Command.java:90)
	at hudson.remoting.ClassicCommandTransport.read(ClassicCommandTransport.java:59)
	at hudson.remoting.SynchronousCommandTransport$ReaderThread.run(SynchronousCommandTransport.java:48)
[INFO] ------------------------------------------------------------------------
[INFO] Total time: 21 minutes 5 seconds
[INFO] Finished at: Wed Jul 25 06:39:37 UTC 2012
[locks-and-latches] Releasing all the locks
[locks-and-latches] All the locks released
ERROR: Maven JVM terminated unexpectedly with exit code 0


Mime
View raw message