cxf-notifications mailing list archives

Site index · List index
Message view « Date » · « Thread »
Top « Date » · « Thread »
From Apache Jenkins Server <jenk...@builds.apache.org>
Subject Build failed in Jenkins: CXF-2.5-deploy #122
Date Fri, 29 Jun 2012 06:32:23 GMT
See <https://builds.apache.org/job/CXF-2.5-deploy/122/changes>

Changes:

[sergeyb] Merged revisions 1355164 via svnmerge from 
https://svn.apache.org/repos/asf/cxf/branches/2.6.x-fixes

................
  r1355164 | sergeyb | 2012-06-28 22:26:58 +0100 (Thu, 28 Jun 2012) | 9 lines
  
  Merged revisions 1355160 via svnmerge from 
  https://svn.apache.org/repos/asf/cxf/trunk
  
  ........
    r1355160 | sergeyb | 2012-06-28 22:22:52 +0100 (Thu, 28 Jun 2012) | 1 line
    
    [CXF-4398] Updating HTTPConduit to check 303, patch from Fred B applied
  ........
................

------------------------------------------
[...truncated 6097 lines...]
[INFO] org/apache/cxf/tools/java2wsdl/processor/internal/jaxws already added, skipping
[INFO] org/apache/cxf/tools/java2wsdl/processor/internal/jaxws/generator already added, skipping
[INFO] org/apache/cxf/tools/java2wsdl/processor/internal/jaxws/generator/template already
added, skipping
[INFO] org/apache/cxf/tools/java2js already added, skipping
[INFO] org/apache/cxf/tools/java2js/processor already added, skipping
[INFO] META-INF/cxf/java2wsbeans.xml already added, skipping
[INFO] org/apache/cxf/tools/java2ws/java2ws.xml already added, skipping
[INFO] org/apache/cxf/tools/java2ws/Messages.properties already added, skipping
[INFO] org/apache/cxf/tools/java2wsdl/generator/wsdl11/date_type_cust_embed.vm already added,
skipping
[INFO] org/apache/cxf/tools/java2wsdl/generator/wsdl11/date_type_cust.vm already added, skipping
[INFO] org/apache/cxf/tools/java2wsdl/generator/wsdl11/wrapperbean.vm already added, skipping
[INFO] org/apache/cxf/tools/java2wsdl/processor/Messages.properties already added, skipping
[INFO] org/apache/cxf/tools/java2wsdl/processor/internal/build.xml.vm already added, skipping
[INFO] org/apache/cxf/tools/java2wsdl/processor/internal/simple/generator/Messages.properties
already added, skipping
[INFO] org/apache/cxf/tools/java2wsdl/processor/internal/simple/generator/template/impl.vm
already added, skipping
[INFO] org/apache/cxf/tools/java2wsdl/processor/internal/simple/generator/template/server.vm
already added, skipping
[INFO] org/apache/cxf/tools/java2wsdl/processor/internal/simple/generator/template/sei.vm
already added, skipping
[INFO] org/apache/cxf/tools/java2wsdl/processor/internal/simple/generator/template/client.vm
already added, skipping
[INFO] org/apache/cxf/tools/java2wsdl/processor/internal/jaxws/Messages.properties already
added, skipping
[INFO] org/apache/cxf/tools/java2wsdl/processor/internal/jaxws/generator/Messages.properties
already added, skipping
[INFO] org/apache/cxf/tools/java2wsdl/processor/internal/jaxws/generator/template/javafirst-sei.vm
already added, skipping
[INFO] org/apache/cxf/tools/java2wsdl/processor/internal/jaxws/generator/template/javafirst-client.vm
already added, skipping
[INFO] org/apache/cxf/tools/java2wsdl/processor/internal/jaxws/generator/template/javafirst-server.vm
already added, skipping
[INFO] org/apache/cxf/tools/java2wsdl/processor/internal/jaxws/generator/template/javafirst-impl.vm
already added, skipping
[INFO] org/apache/cxf/tools/java2js/java2js.xml already added, skipping
[INFO] META-INF already added, skipping
[INFO] META-INF/LICENSE already added, skipping
[INFO] META-INF/NOTICE already added, skipping
[INFO] META-INF/DEPENDENCIES already added, skipping
[INFO] [javadoc:jar {execution: attach-javadocs}]
[INFO] 
6 warnings
[WARNING] Javadoc Warnings
[WARNING] <https://builds.apache.org/job/CXF-2.5-deploy/ws/cxf-2.5.x-fixes/tools/javato/ws/src/main/java/org/apache/cxf/tools/java2wsdl/processor/internal/ServiceBuilderFactory.java>:78:
warning - @return tag has no arguments.
[WARNING] <https://builds.apache.org/job/CXF-2.5-deploy/ws/cxf-2.5.x-fixes/tools/javato/ws/src/main/java/org/apache/cxf/tools/java2wsdl/processor/internal/ServiceBuilderFactory.java>:87:
warning - @param argument "databindingName" is not a parameter name.
[WARNING] <https://builds.apache.org/job/CXF-2.5-deploy/ws/cxf-2.5.x-fixes/tools/javato/ws/src/main/java/org/apache/cxf/tools/java2wsdl/processor/internal/SpringServiceBuilderFactory.java>:68:
warning - @return tag has no arguments.
[WARNING] <https://builds.apache.org/job/CXF-2.5-deploy/ws/cxf-2.5.x-fixes/tools/javato/ws/src/main/java/org/apache/cxf/tools/java2wsdl/processor/internal/SpringServiceBuilderFactory.java>:117:
warning - @return tag has no arguments.
[WARNING] <https://builds.apache.org/job/CXF-2.5-deploy/ws/cxf-2.5.x-fixes/tools/javato/ws/src/main/java/org/apache/cxf/tools/java2wsdl/processor/internal/SpringServiceBuilderFactory.java>:68:
warning - @param argument "databindingName" is not a parameter name.
[WARNING] <https://builds.apache.org/job/CXF-2.5-deploy/ws/cxf-2.5.x-fixes/tools/javato/ws/src/main/java/org/apache/cxf/tools/java2wsdl/processor/internal/SpringServiceBuilderFactory.java>:117:
warning - @param argument "bus" is not a parameter name.
[INFO] Building jar: <https://builds.apache.org/job/CXF-2.5-deploy/ws/cxf-2.5.x-fixes/tools/javato/ws/target/cxf-tools-java2ws-2.5.5-SNAPSHOT-javadoc.jar>
[INFO] [install:install {execution: default-install}]
[INFO] Installing <https://builds.apache.org/job/CXF-2.5-deploy/ws/cxf-2.5.x-fixes/tools/javato/ws/target/cxf-tools-java2ws-2.5.5-SNAPSHOT.jar>
to <https://builds.apache.org/job/CXF-2.5-deploy/ws/.repository/org/apache/cxf/cxf-tools-java2ws/2.5.5-SNAPSHOT/cxf-tools-java2ws-2.5.5-SNAPSHOT.jar>
[INFO] Installing <https://builds.apache.org/job/CXF-2.5-deploy/ws/cxf-2.5.x-fixes/tools/javato/ws/target/cxf-tools-java2ws-2.5.5-SNAPSHOT-sources.jar>
to <https://builds.apache.org/job/CXF-2.5-deploy/ws/.repository/org/apache/cxf/cxf-tools-java2ws/2.5.5-SNAPSHOT/cxf-tools-java2ws-2.5.5-SNAPSHOT-sources.jar>
[INFO] Installing <https://builds.apache.org/job/CXF-2.5-deploy/ws/cxf-2.5.x-fixes/tools/javato/ws/target/cxf-tools-java2ws-2.5.5-SNAPSHOT-javadoc.jar>
to <https://builds.apache.org/job/CXF-2.5-deploy/ws/.repository/org/apache/cxf/cxf-tools-java2ws/2.5.5-SNAPSHOT/cxf-tools-java2ws-2.5.5-SNAPSHOT-javadoc.jar>
[INFO] [deploy:deploy {execution: default-deploy}]
[INFO] Retrieving previous build number from apache.snapshots.https
[WARNING] *** CHECKSUM FAILED - Checksum failed on download: local = '31f6e4b701b6f942e1686b83aa6c8e32c7492efa';
remote = 'a6c797e948c3d4552caa712dfdd146d86e77ed3b' - RETRYING
[WARNING] *** CHECKSUM FAILED - Checksum failed on download: local = '31f6e4b701b6f942e1686b83aa6c8e32c7492efa';
remote = 'a6c797e948c3d4552caa712dfdd146d86e77ed3b' - IGNORING
Uploading: https://repository.apache.org/content/repositories/snapshots/org/apache/cxf/cxf-tools-java2ws/2.5.5-SNAPSHOT/cxf-tools-java2ws-2.5.5-20120629.062640-17.jar
115K uploaded  (cxf-tools-java2ws-2.5.5-20120629.062640-17.jar)
[INFO] Retrieving previous metadata from apache.snapshots.https
[INFO] Uploading repository metadata for: 'artifact org.apache.cxf:cxf-tools-java2ws'
[INFO] Uploading project information for cxf-tools-java2ws 2.5.5-20120629.062640-17
[INFO] Retrieving previous metadata from apache.snapshots.https
[WARNING] *** CHECKSUM FAILED - Checksum failed on download: local = '31f6e4b701b6f942e1686b83aa6c8e32c7492efa';
remote = 'a6c797e948c3d4552caa712dfdd146d86e77ed3b' - RETRYING
[WARNING] *** CHECKSUM FAILED - Checksum failed on download: local = '31f6e4b701b6f942e1686b83aa6c8e32c7492efa';
remote = 'a6c797e948c3d4552caa712dfdd146d86e77ed3b' - IGNORING
[INFO] Uploading repository metadata for: 'snapshot org.apache.cxf:cxf-tools-java2ws:2.5.5-SNAPSHOT'
[INFO] Retrieving previous build number from apache.snapshots.https
Uploading: https://repository.apache.org/content/repositories/snapshots/org/apache/cxf/cxf-tools-java2ws/2.5.5-SNAPSHOT/cxf-tools-java2ws-2.5.5-20120629.062640-17-sources.jar
91K uploaded  (cxf-tools-java2ws-2.5.5-20120629.062640-17-sources.jar)
[INFO] Retrieving previous build number from apache.snapshots.https
Uploading: https://repository.apache.org/content/repositories/snapshots/org/apache/cxf/cxf-tools-java2ws/2.5.5-SNAPSHOT/cxf-tools-java2ws-2.5.5-20120629.062640-17-javadoc.jar
275K uploaded  (cxf-tools-java2ws-2.5.5-20120629.062640-17-javadoc.jar)
[INFO] ------------------------------------------------------------------------
[INFO] Building Apache CXF Command Line Tools JavaTo
[INFO]    task-segment: [deploy]
[INFO] ------------------------------------------------------------------------
[INFO] [site:attach-descriptor {execution: default-attach-descriptor}]
[INFO] [source:jar-no-fork {execution: attach-sources}]
[INFO] [javadoc:jar {execution: attach-javadocs}]
[INFO] Not executing Javadoc as the project is not a Java classpath-capable package
[INFO] [install:install {execution: default-install}]
[INFO] Installing <https://builds.apache.org/job/CXF-2.5-deploy/ws/cxf-2.5.x-fixes/tools/javato/pom.xml>
to <https://builds.apache.org/job/CXF-2.5-deploy/ws/.repository/org/apache/cxf/cxf-tools-javato/2.5.5-SNAPSHOT/cxf-tools-javato-2.5.5-SNAPSHOT.pom>
[INFO] [deploy:deploy {execution: default-deploy}]
[INFO] Retrieving previous build number from apache.snapshots.https
[WARNING] *** CHECKSUM FAILED - Checksum failed on download: local = '7939d58d5b770faf37bf7c8788ab652399078968';
remote = '6de6d49b21e703523365ca7120ab577a439a4b1f' - RETRYING
[WARNING] *** CHECKSUM FAILED - Checksum failed on download: local = '7939d58d5b770faf37bf7c8788ab652399078968';
remote = '6de6d49b21e703523365ca7120ab577a439a4b1f' - IGNORING
Uploading: https://repository.apache.org/content/repositories/snapshots/org/apache/cxf/cxf-tools-javato/2.5.5-SNAPSHOT/cxf-tools-javato-2.5.5-20120629.062640-17.pom
1K uploaded  (cxf-tools-javato-2.5.5-20120629.062640-17.pom)
[INFO] Retrieving previous metadata from apache.snapshots.https
[WARNING] *** CHECKSUM FAILED - Checksum failed on download: local = '7939d58d5b770faf37bf7c8788ab652399078968';
remote = '6de6d49b21e703523365ca7120ab577a439a4b1f' - RETRYING
[WARNING] *** CHECKSUM FAILED - Checksum failed on download: local = '7939d58d5b770faf37bf7c8788ab652399078968';
remote = '6de6d49b21e703523365ca7120ab577a439a4b1f' - IGNORING
[INFO] Uploading repository metadata for: 'snapshot org.apache.cxf:cxf-tools-javato:2.5.5-SNAPSHOT'
[INFO] Retrieving previous metadata from apache.snapshots.https
[INFO] Uploading repository metadata for: 'artifact org.apache.cxf:cxf-tools-javato'
[INFO] ------------------------------------------------------------------------
[INFO] Building Apache CXF Runtime SDO DataBinding
[INFO]    task-segment: [deploy]
[INFO] ------------------------------------------------------------------------
[INFO] [cxf-xml2fastinfoset:xml2fastinfoset {execution: xml2fastinfoset}]
[WARNING] The parameter expression: 'project.build.resources' used in mojo: 'process' has
been deprecated. Use 'project.resources' instead.
[INFO] [remote-resources:process {execution: default}]
[debug] execute contextualize
[INFO] [resources:resources {execution: default-resources}]
[INFO] Using 'UTF-8' encoding to copy filtered resources.
[INFO] Copying 0 resource
[INFO] Copying 2 resources
[INFO] skip non existing resourceDirectory <https://builds.apache.org/job/CXF-2.5-deploy/ws/cxf-2.5.x-fixes/rt/databinding/sdo/src/main/resources-filtered>
[INFO] skip non existing resourceDirectory <https://builds.apache.org/job/CXF-2.5-deploy/ws/cxf-2.5.x-fixes/rt/databinding/sdo/target/generated/src/main/resources>
[INFO] Copying 3 resources
[INFO] [compiler:compile {execution: default-compile}]
[INFO] Nothing to compile - all classes are up to date
[INFO] [cxf-codegen:wsdl2java {execution: generate-test-sources-static}]
[debug] execute contextualize
[INFO] [resources:testResources {execution: default-testResources}]
[INFO] Using 'UTF-8' encoding to copy filtered resources.
[INFO] Copying 2 resources
[INFO] Copying 3 resources
[INFO] skip non existing resourceDirectory <https://builds.apache.org/job/CXF-2.5-deploy/ws/cxf-2.5.x-fixes/rt/databinding/sdo/target/generated/src/test/resources>
[INFO] Copying 3 resources
[INFO] [compiler:testCompile {execution: default-testCompile}]
[INFO] Nothing to compile - all classes are up to date
[INFO] [surefire:test {execution: default-test}]
[INFO] Tests are skipped.
[INFO] [jar:jar {execution: default-jar}]
[INFO] Building jar: <https://builds.apache.org/job/CXF-2.5-deploy/ws/cxf-2.5.x-fixes/rt/databinding/sdo/target/cxf-rt-databinding-sdo-2.5.5-SNAPSHOT.jar>
[INFO] [source:jar-no-fork {execution: attach-sources}]
[INFO] org already added, skipping
[INFO] org/apache already added, skipping
[INFO] org/apache/cxf already added, skipping
[INFO] org/apache/cxf/sdo already added, skipping
[INFO] org/apache/cxf/sdo/tools already added, skipping
[INFO] META-INF already added, skipping
[INFO] META-INF already added, skipping
[INFO] META-INF/LICENSE already added, skipping
[INFO] META-INF/NOTICE already added, skipping
[INFO] META-INF/DEPENDENCIES already added, skipping
[INFO] Building jar: <https://builds.apache.org/job/CXF-2.5-deploy/ws/cxf-2.5.x-fixes/rt/databinding/sdo/target/cxf-rt-databinding-sdo-2.5.5-SNAPSHOT-sources.jar>
[INFO] org already added, skipping
[INFO] org/apache already added, skipping
[INFO] org/apache/cxf already added, skipping
[INFO] org/apache/cxf/sdo already added, skipping
[INFO] org/apache/cxf/sdo/tools already added, skipping
[INFO] META-INF already added, skipping
[INFO] META-INF already added, skipping
[INFO] META-INF/LICENSE already added, skipping
[INFO] META-INF/NOTICE already added, skipping
[INFO] META-INF/DEPENDENCIES already added, skipping
[INFO] [javadoc:jar {execution: attach-javadocs}]
[INFO] Building jar: <https://builds.apache.org/job/CXF-2.5-deploy/ws/cxf-2.5.x-fixes/rt/databinding/sdo/target/cxf-rt-databinding-sdo-2.5.5-SNAPSHOT-javadoc.jar>
[INFO] [install:install {execution: default-install}]
[INFO] Installing <https://builds.apache.org/job/CXF-2.5-deploy/ws/cxf-2.5.x-fixes/rt/databinding/sdo/target/cxf-rt-databinding-sdo-2.5.5-SNAPSHOT.jar>
to <https://builds.apache.org/job/CXF-2.5-deploy/ws/.repository/org/apache/cxf/cxf-rt-databinding-sdo/2.5.5-SNAPSHOT/cxf-rt-databinding-sdo-2.5.5-SNAPSHOT.jar>
[INFO] Installing <https://builds.apache.org/job/CXF-2.5-deploy/ws/cxf-2.5.x-fixes/rt/databinding/sdo/target/cxf-rt-databinding-sdo-2.5.5-SNAPSHOT-sources.jar>
to <https://builds.apache.org/job/CXF-2.5-deploy/ws/.repository/org/apache/cxf/cxf-rt-databinding-sdo/2.5.5-SNAPSHOT/cxf-rt-databinding-sdo-2.5.5-SNAPSHOT-sources.jar>
[INFO] Installing <https://builds.apache.org/job/CXF-2.5-deploy/ws/cxf-2.5.x-fixes/rt/databinding/sdo/target/cxf-rt-databinding-sdo-2.5.5-SNAPSHOT-javadoc.jar>
to <https://builds.apache.org/job/CXF-2.5-deploy/ws/.repository/org/apache/cxf/cxf-rt-databinding-sdo/2.5.5-SNAPSHOT/cxf-rt-databinding-sdo-2.5.5-SNAPSHOT-javadoc.jar>
[INFO] [deploy:deploy {execution: default-deploy}]
[INFO] Retrieving previous build number from apache.snapshots.https
[WARNING] *** CHECKSUM FAILED - Checksum failed on download: local = 'cd504346fde1ad04193c7b7e88f05557736c3135';
remote = 'ca4b3697dd64a6803270fd8ccde07d4293bbb486' - RETRYING
[WARNING] *** CHECKSUM FAILED - Checksum failed on download: local = 'cd504346fde1ad04193c7b7e88f05557736c3135';
remote = 'ca4b3697dd64a6803270fd8ccde07d4293bbb486' - IGNORING
Uploading: https://repository.apache.org/content/repositories/snapshots/org/apache/cxf/cxf-rt-databinding-sdo/2.5.5-SNAPSHOT/cxf-rt-databinding-sdo-2.5.5-20120629.062640-17.jar
26K uploaded  (cxf-rt-databinding-sdo-2.5.5-20120629.062640-17.jar)
[INFO] Retrieving previous metadata from apache.snapshots.https
[WARNING] *** CHECKSUM FAILED - Checksum failed on download: local = 'cd504346fde1ad04193c7b7e88f05557736c3135';
remote = 'ca4b3697dd64a6803270fd8ccde07d4293bbb486' - RETRYING
[WARNING] *** CHECKSUM FAILED - Checksum failed on download: local = 'cd504346fde1ad04193c7b7e88f05557736c3135';
remote = 'ca4b3697dd64a6803270fd8ccde07d4293bbb486' - IGNORING
[INFO] Uploading repository metadata for: 'snapshot org.apache.cxf:cxf-rt-databinding-sdo:2.5.5-SNAPSHOT'
[INFO] Retrieving previous metadata from apache.snapshots.https
[INFO] Uploading repository metadata for: 'artifact org.apache.cxf:cxf-rt-databinding-sdo'
[INFO] Uploading project information for cxf-rt-databinding-sdo 2.5.5-20120629.062640-17
[INFO] Retrieving previous build number from apache.snapshots.https
Uploading: https://repository.apache.org/content/repositories/snapshots/org/apache/cxf/cxf-rt-databinding-sdo/2.5.5-SNAPSHOT/cxf-rt-databinding-sdo-2.5.5-20120629.062640-17-sources.jar
17K uploaded  (cxf-rt-databinding-sdo-2.5.5-20120629.062640-17-sources.jar)
[INFO] Retrieving previous build number from apache.snapshots.https
Uploading: https://repository.apache.org/content/repositories/snapshots/org/apache/cxf/cxf-rt-databinding-sdo/2.5.5-SNAPSHOT/cxf-rt-databinding-sdo-2.5.5-20120629.062640-17-javadoc.jar
51K uploaded  (cxf-rt-databinding-sdo-2.5.5-20120629.062640-17-javadoc.jar)
[INFO] ------------------------------------------------------------------------
[INFO] Building Apache CXF Runtime JAX-RS Frontend
[INFO]    task-segment: [deploy]
[INFO] ------------------------------------------------------------------------
[INFO] [cxf-xml2fastinfoset:xml2fastinfoset {execution: xml2fastinfoset}]
[WARNING] The parameter expression: 'project.build.resources' used in mojo: 'process' has
been deprecated. Use 'project.resources' instead.
[INFO] [remote-resources:process {execution: default}]
[debug] execute contextualize
[INFO] [resources:resources {execution: default-resources}]
[INFO] Using 'UTF-8' encoding to copy filtered resources.
[INFO] Copying 7 resources
[INFO] Copying 6 resources
[INFO] skip non existing resourceDirectory <https://builds.apache.org/job/CXF-2.5-deploy/ws/cxf-2.5.x-fixes/rt/frontend/jaxrs/src/main/resources-filtered>
[INFO] skip non existing resourceDirectory <https://builds.apache.org/job/CXF-2.5-deploy/ws/cxf-2.5.x-fixes/rt/frontend/jaxrs/target/generated/src/main/resources>
[INFO] Copying 3 resources
[INFO] [compiler:compile {execution: default-compile}]
[INFO] Nothing to compile - all classes are up to date
[INFO] [xmlbeans:xmlbeans-test {execution: default}]
[INFO] All schema objects are up to date.
[debug] execute contextualize
[INFO] [resources:testResources {execution: default-testResources}]
[INFO] Using 'UTF-8' encoding to copy filtered resources.
[INFO] Copying 14 resources
[INFO] Copying 7 resources
[INFO] Copying 10 resources
[INFO] Copying 3 resources
[INFO] Copying 10 resources
[INFO] [compiler:testCompile {execution: default-testCompile}]
[INFO] Compiling 140 source files to <https://builds.apache.org/job/CXF-2.5-deploy/ws/cxf-2.5.x-fixes/rt/frontend/jaxrs/target/test-classes>
[INFO] -------------------------------------------------------------
[ERROR] COMPILATION ERROR : 
[INFO] -------------------------------------------------------------
[ERROR] <https://builds.apache.org/job/CXF-2.5-deploy/ws/cxf-2.5.x-fixes/rt/frontend/jaxrs/src/test/java/org/apache/cxf/jaxrs/fortest/jaxb/jaxbelement/ParamJAXBElement.java>:[43,1]
'class' or 'interface' expected
[ERROR] <https://builds.apache.org/job/CXF-2.5-deploy/ws/cxf-2.5.x-fixes/rt/frontend/jaxrs/src/test/java/org/apache/cxf/jaxrs/fortest/jaxb/jaxbelement/ParamJAXBElement.java>:[48,15]
'class' or 'interface' expected
[ERROR] <https://builds.apache.org/job/CXF-2.5-deploy/ws/cxf-2.5.x-fixes/rt/frontend/jaxrs/src/test/java/org/apache/cxf/jaxrs/fortest/jaxb/jaxbelement/ParamJAXBElement.java>:[62,0]
'class' or 'interface' expected
[ERROR] <https://builds.apache.org/job/CXF-2.5-deploy/ws/cxf-2.5.x-fixes/rt/frontend/jaxrs/src/test/java/org/apache/cxf/jaxrs/fortest/jaxb/jaxbelement/ParamJAXBElement.java>:[63,0]
'class' or 'interface' expected
[ERROR] <https://builds.apache.org/job/CXF-2.5-deploy/ws/cxf-2.5.x-fixes/rt/frontend/jaxrs/src/test/java/org/apache/cxf/jaxrs/fortest/jaxb/jaxbelement/package-info.java>:[42,0]
'class' or 'interface' expected
[ERROR] <https://builds.apache.org/job/CXF-2.5-deploy/ws/cxf-2.5.x-fixes/rt/frontend/jaxrs/src/test/java/org/apache/cxf/jaxrs/fortest/jaxb/jaxbelement/ParamType.java>:[48,1]
'class' or 'interface' expected
[ERROR] <https://builds.apache.org/job/CXF-2.5-deploy/ws/cxf-2.5.x-fixes/rt/frontend/jaxrs/src/test/java/org/apache/cxf/jaxrs/fortest/jaxb/jaxbelement/ParamType.java>:[53,15]
'class' or 'interface' expected
[ERROR] <https://builds.apache.org/job/CXF-2.5-deploy/ws/cxf-2.5.x-fixes/rt/frontend/jaxrs/src/test/java/org/apache/cxf/jaxrs/fortest/jaxb/jaxbelement/ParamType.java>:[67,0]
'class' or 'interface' expected
[ERROR] <https://builds.apache.org/job/CXF-2.5-deploy/ws/cxf-2.5.x-fixes/rt/frontend/jaxrs/src/test/java/org/apache/cxf/jaxrs/fortest/jaxb/jaxbelement/ParamType.java>:[69,0]
'class' or 'interface' expected
[ERROR] <https://builds.apache.org/job/CXF-2.5-deploy/ws/cxf-2.5.x-fixes/rt/frontend/jaxrs/src/test/java/org/apache/cxf/jaxrs/fortest/jaxb/jaxbelement/ParamType.java>:[70,0]
'class' or 'interface' expected
[ERROR] <https://builds.apache.org/job/CXF-2.5-deploy/ws/cxf-2.5.x-fixes/rt/frontend/jaxrs/src/test/java/org/apache/cxf/jaxrs/fortest/jaxb/jaxbelement/ParamType.java>:[71,0]
'class' or 'interface' expected
[ERROR] <https://builds.apache.org/job/CXF-2.5-deploy/ws/cxf-2.5.x-fixes/rt/frontend/jaxrs/src/test/java/org/apache/cxf/jaxrs/fortest/jaxb/jaxbelement/ParamType.java>:[72,0]
'class' or 'interface' expected
[ERROR] <https://builds.apache.org/job/CXF-2.5-deploy/ws/cxf-2.5.x-fixes/rt/frontend/jaxrs/src/test/java/org/apache/cxf/jaxrs/fortest/jaxb/jaxbelement/ObjectFactory.java>:[53,1]
'class' or 'interface' expected
[ERROR] <https://builds.apache.org/job/CXF-2.5-deploy/ws/cxf-2.5.x-fixes/rt/frontend/jaxrs/src/test/java/org/apache/cxf/jaxrs/fortest/jaxb/jaxbelement/ObjectFactory.java>:[58,15]
'class' or 'interface' expected
[ERROR] <https://builds.apache.org/job/CXF-2.5-deploy/ws/cxf-2.5.x-fixes/rt/frontend/jaxrs/src/test/java/org/apache/cxf/jaxrs/fortest/jaxb/jaxbelement/ObjectFactory.java>:[72,0]
'class' or 'interface' expected
[ERROR] <https://builds.apache.org/job/CXF-2.5-deploy/ws/cxf-2.5.x-fixes/rt/frontend/jaxrs/src/test/java/org/apache/cxf/jaxrs/fortest/jaxb/jaxbelement/ObjectFactory.java>:[73,0]
'class' or 'interface' expected
[ERROR] <https://builds.apache.org/job/CXF-2.5-deploy/ws/cxf-2.5.x-fixes/rt/frontend/jaxrs/src/test/java/org/apache/cxf/jaxrs/fortest/jaxb/jaxbelement/ObjectFactory.java>:[74,0]
'class' or 'interface' expected
[ERROR] <https://builds.apache.org/job/CXF-2.5-deploy/ws/cxf-2.5.x-fixes/rt/frontend/jaxrs/src/test/java/org/apache/cxf/jaxrs/fortest/jaxb/jaxbelement/ObjectFactory.java>:[75,0]
'class' or 'interface' expected
[INFO] 18 errors 
[INFO] -------------------------------------------------------------
[INFO] ------------------------------------------------------------------------
[ERROR] BUILD FAILURE
[INFO] ------------------------------------------------------------------------
[INFO] Compilation failure

<https://builds.apache.org/job/CXF-2.5-deploy/ws/cxf-2.5.x-fixes/rt/frontend/jaxrs/src/test/java/org/apache/cxf/jaxrs/fortest/jaxb/jaxbelement/ParamJAXBElement.java>:[43,1]
'class' or 'interface' expected
<https://builds.apache.org/job/CXF-2.5-deploy/ws/cxf-2.5.x-fixes/rt/frontend/jaxrs/src/test/java/org/apache/cxf/jaxrs/fortest/jaxb/jaxbelement/ParamJAXBElement.java>:[48,15]
'class' or 'interface' expected
<https://builds.apache.org/job/CXF-2.5-deploy/ws/cxf-2.5.x-fixes/rt/frontend/jaxrs/src/test/java/org/apache/cxf/jaxrs/fortest/jaxb/jaxbelement/ParamJAXBElement.java>:[62,0]
'class' or 'interface' expected
<https://builds.apache.org/job/CXF-2.5-deploy/ws/cxf-2.5.x-fixes/rt/frontend/jaxrs/src/test/java/org/apache/cxf/jaxrs/fortest/jaxb/jaxbelement/ParamJAXBElement.java>:[63,0]
'class' or 'interface' expected
<https://builds.apache.org/job/CXF-2.5-deploy/ws/cxf-2.5.x-fixes/rt/frontend/jaxrs/src/test/java/org/apache/cxf/jaxrs/fortest/jaxb/jaxbelement/package-info.java>:[42,0]
'class' or 'interface' expected
<https://builds.apache.org/job/CXF-2.5-deploy/ws/cxf-2.5.x-fixes/rt/frontend/jaxrs/src/test/java/org/apache/cxf/jaxrs/fortest/jaxb/jaxbelement/ParamType.java>:[48,1]
'class' or 'interface' expected
<https://builds.apache.org/job/CXF-2.5-deploy/ws/cxf-2.5.x-fixes/rt/frontend/jaxrs/src/test/java/org/apache/cxf/jaxrs/fortest/jaxb/jaxbelement/ParamType.java>:[53,15]
'class' or 'interface' expected
<https://builds.apache.org/job/CXF-2.5-deploy/ws/cxf-2.5.x-fixes/rt/frontend/jaxrs/src/test/java/org/apache/cxf/jaxrs/fortest/jaxb/jaxbelement/ParamType.java>:[67,0]
'class' or 'interface' expected
<https://builds.apache.org/job/CXF-2.5-deploy/ws/cxf-2.5.x-fixes/rt/frontend/jaxrs/src/test/java/org/apache/cxf/jaxrs/fortest/jaxb/jaxbelement/ParamType.java>:[69,0]
'class' or 'interface' expected
<https://builds.apache.org/job/CXF-2.5-deploy/ws/cxf-2.5.x-fixes/rt/frontend/jaxrs/src/test/java/org/apache/cxf/jaxrs/fortest/jaxb/jaxbelement/ParamType.java>:[70,0]
'class' or 'interface' expected
<https://builds.apache.org/job/CXF-2.5-deploy/ws/cxf-2.5.x-fixes/rt/frontend/jaxrs/src/test/java/org/apache/cxf/jaxrs/fortest/jaxb/jaxbelement/ParamType.java>:[71,0]
'class' or 'interface' expected
<https://builds.apache.org/job/CXF-2.5-deploy/ws/cxf-2.5.x-fixes/rt/frontend/jaxrs/src/test/java/org/apache/cxf/jaxrs/fortest/jaxb/jaxbelement/ParamType.java>:[72,0]
'class' or 'interface' expected
<https://builds.apache.org/job/CXF-2.5-deploy/ws/cxf-2.5.x-fixes/rt/frontend/jaxrs/src/test/java/org/apache/cxf/jaxrs/fortest/jaxb/jaxbelement/ObjectFactory.java>:[53,1]
'class' or 'interface' expected
<https://builds.apache.org/job/CXF-2.5-deploy/ws/cxf-2.5.x-fixes/rt/frontend/jaxrs/src/test/java/org/apache/cxf/jaxrs/fortest/jaxb/jaxbelement/ObjectFactory.java>:[58,15]
'class' or 'interface' expected
<https://builds.apache.org/job/CXF-2.5-deploy/ws/cxf-2.5.x-fixes/rt/frontend/jaxrs/src/test/java/org/apache/cxf/jaxrs/fortest/jaxb/jaxbelement/ObjectFactory.java>:[72,0]
'class' or 'interface' expected
<https://builds.apache.org/job/CXF-2.5-deploy/ws/cxf-2.5.x-fixes/rt/frontend/jaxrs/src/test/java/org/apache/cxf/jaxrs/fortest/jaxb/jaxbelement/ObjectFactory.java>:[73,0]
'class' or 'interface' expected
<https://builds.apache.org/job/CXF-2.5-deploy/ws/cxf-2.5.x-fixes/rt/frontend/jaxrs/src/test/java/org/apache/cxf/jaxrs/fortest/jaxb/jaxbelement/ObjectFactory.java>:[74,0]
'class' or 'interface' expected
<https://builds.apache.org/job/CXF-2.5-deploy/ws/cxf-2.5.x-fixes/rt/frontend/jaxrs/src/test/java/org/apache/cxf/jaxrs/fortest/jaxb/jaxbelement/ObjectFactory.java>:[75,0]
'class' or 'interface' expected

[INFO] ------------------------------------------------------------------------
[INFO] For more information, run Maven with the -e switch
[INFO] ------------------------------------------------------------------------
[INFO] Total time: 5 minutes 52 seconds
[INFO] Finished at: Fri Jun 29 06:32:20 UTC 2012
[INFO] Final Memory: 171M/237M
[INFO] ------------------------------------------------------------------------
Build step 'Invoke top-level Maven targets' marked build as failure
[locks-and-latches] Releasing all the locks
[locks-and-latches] All the locks released

Mime
View raw message