cxf-notifications mailing list archives

Site index · List index
Message view « Date » · « Thread »
Top « Date » · « Thread »
From Apache Jenkins Server <jenk...@builds.apache.org>
Subject Build failed in Jenkins: CXF-2.5-deploy » Apache CXF Runtime JAX-RS Frontend #123
Date Sat, 30 Jun 2012 08:01:29 GMT
See <https://builds.apache.org/job/CXF-2.5-deploy/org.apache.cxf$cxf-rt-frontend-jaxrs/123/changes>

Changes:

[sergeyb] Merged revisions 1355465 via svnmerge from 
https://svn.apache.org/repos/asf/cxf/branches/2.6.x-fixes

................
  r1355465 | sergeyb | 2012-06-29 17:41:27 +0100 (Fri, 29 Jun 2012) | 9 lines
  
  Merged revisions 1355462 via svnmerge from 
  https://svn.apache.org/repos/asf/cxf/trunk
  
  ........
    r1355462 | sergeyb | 2012-06-29 17:36:49 +0100 (Fri, 29 Jun 2012) | 1 line
    
    [CXF-4348] Ignoring optional multipart media type parameters when possible
  ........
................

[dkulp] Merged revisions 1355412 via  git cherry-pick from
https://svn.apache.org/repos/asf/cxf/branches/2.6.x-fixes

........
  r1355412 | dkulp | 2012-06-29 10:34:53 -0400 (Fri, 29 Jun 2012) | 10 lines

  Merged revisions 1354199 via  git cherry-pick from
  https://svn.apache.org/repos/asf/cxf/trunk

  ........
    r1354199 | dkulp | 2012-06-26 16:05:20 -0400 (Tue, 26 Jun 2012) | 2 lines

    Fix some warnings that the new Juno Eclipse release flags

  ........

........

[sergeyb] Merged revisions 1355395 via svnmerge from 
https://svn.apache.org/repos/asf/cxf/branches/2.6.x-fixes

................
  r1355395 | sergeyb | 2012-06-29 15:02:39 +0100 (Fri, 29 Jun 2012) | 9 lines
  
  Merged revisions 1355380 via svnmerge from 
  https://svn.apache.org/repos/asf/cxf/trunk
  
  ........
    r1355380 | sergeyb | 2012-06-29 14:38:13 +0100 (Fri, 29 Jun 2012) | 1 line
    
    [CXF-4400] Better handling of redirect and static resource requests in AbstractHttpServlet
  ........
................

------------------------------------------
[INFO] ------------------------------------------------------------------------
[INFO] Building Apache CXF Runtime JAX-RS Frontend
[INFO]    task-segment: [clean, install]
[INFO] ------------------------------------------------------------------------
[INFO] [clean:clean {execution: default-clean}]
[INFO] Deleting <https://builds.apache.org/job/CXF-2.5-deploy/org.apache.cxf$cxf-rt-frontend-jaxrs/ws/target>
[INFO] [cxf-xml2fastinfoset:xml2fastinfoset {execution: xml2fastinfoset}]
[WARNING] The parameter expression: 'project.build.resources' used in mojo: 'process' has
been deprecated. Use 'project.resources' instead.
[INFO] [remote-resources:process {execution: default}]
[debug] execute contextualize
[INFO] [resources:resources {execution: default-resources}]
[INFO] Using 'UTF-8' encoding to copy filtered resources.
[INFO] Copying 7 resources
[INFO] Copying 6 resources
[INFO] skip non existing resourceDirectory <https://builds.apache.org/job/CXF-2.5-deploy/org.apache.cxf$cxf-rt-frontend-jaxrs/ws/src/main/resources-filtered>
[INFO] skip non existing resourceDirectory <https://builds.apache.org/job/CXF-2.5-deploy/org.apache.cxf$cxf-rt-frontend-jaxrs/ws/target/generated/src/main/resources>
[INFO] Copying 3 resources
[INFO] [compiler:compile {execution: default-compile}]
[INFO] Compiling 198 source files to <https://builds.apache.org/job/CXF-2.5-deploy/org.apache.cxf$cxf-rt-frontend-jaxrs/ws/target/classes>
[INFO] -------------------------------------------------------------
[ERROR] COMPILATION ERROR : 
[INFO] -------------------------------------------------------------
[ERROR] <https://builds.apache.org/job/CXF-2.5-deploy/org.apache.cxf$cxf-rt-frontend-jaxrs/ws/src/main/java/org/apache/cxf/jaxrs/model/ResourceTypes.java>:[61,0]
'class' or 'interface' expected
[ERROR] <https://builds.apache.org/job/CXF-2.5-deploy/org.apache.cxf$cxf-rt-frontend-jaxrs/ws/src/main/java/org/apache/cxf/jaxrs/model/ResourceTypes.java>:[63,0]
'class' or 'interface' expected
[ERROR] <https://builds.apache.org/job/CXF-2.5-deploy/org.apache.cxf$cxf-rt-frontend-jaxrs/ws/src/main/java/org/apache/cxf/jaxrs/model/ResourceTypes.java>:[64,0]
'class' or 'interface' expected
[ERROR] <https://builds.apache.org/job/CXF-2.5-deploy/org.apache.cxf$cxf-rt-frontend-jaxrs/ws/src/main/java/org/apache/cxf/jaxrs/model/ResourceTypes.java>:[65,0]
'class' or 'interface' expected
[ERROR] <https://builds.apache.org/job/CXF-2.5-deploy/org.apache.cxf$cxf-rt-frontend-jaxrs/ws/src/main/java/org/apache/cxf/jaxrs/model/ResourceTypes.java>:[67,0]
'class' or 'interface' expected
[INFO] 5 errors 
[INFO] -------------------------------------------------------------
[JENKINS] Archiving <https://builds.apache.org/job/CXF-2.5-deploy/org.apache.cxf$cxf-rt-frontend-jaxrs/ws/pom.xml>
to /home/hudson/hudson/jobs/CXF-2.5-deploy/modules/org.apache.cxf$cxf-rt-frontend-jaxrs/builds/2012-06-30_07-55-54/archive/org.apache.cxf/cxf-rt-frontend-jaxrs/2.5.5-SNAPSHOT/cxf-rt-frontend-jaxrs-2.5.5-SNAPSHOT.pom
[INFO] ------------------------------------------------------------------------
[ERROR] BUILD FAILURE
[INFO] ------------------------------------------------------------------------
[INFO] Compilation failure

<https://builds.apache.org/job/CXF-2.5-deploy/org.apache.cxf$cxf-rt-frontend-jaxrs/ws/src/main/java/org/apache/cxf/jaxrs/model/ResourceTypes.java>:[61,0]
'class' or 'interface' expected
<https://builds.apache.org/job/CXF-2.5-deploy/org.apache.cxf$cxf-rt-frontend-jaxrs/ws/src/main/java/org/apache/cxf/jaxrs/model/ResourceTypes.java>:[63,0]
'class' or 'interface' expected
<https://builds.apache.org/job/CXF-2.5-deploy/org.apache.cxf$cxf-rt-frontend-jaxrs/ws/src/main/java/org/apache/cxf/jaxrs/model/ResourceTypes.java>:[64,0]
'class' or 'interface' expected
<https://builds.apache.org/job/CXF-2.5-deploy/org.apache.cxf$cxf-rt-frontend-jaxrs/ws/src/main/java/org/apache/cxf/jaxrs/model/ResourceTypes.java>:[65,0]
'class' or 'interface' expected
<https://builds.apache.org/job/CXF-2.5-deploy/org.apache.cxf$cxf-rt-frontend-jaxrs/ws/src/main/java/org/apache/cxf/jaxrs/model/ResourceTypes.java>:[67,0]
'class' or 'interface' expected

[INFO] ------------------------------------------------------------------------
[INFO] Trace
org.apache.maven.BuildFailureException: Compilation failure
	at org.apache.maven.lifecycle.DefaultLifecycleExecutor.executeGoals(DefaultLifecycleExecutor.java:715)
	at org.apache.maven.lifecycle.DefaultLifecycleExecutor.executeGoalWithLifecycle(DefaultLifecycleExecutor.java:556)
	at org.apache.maven.lifecycle.DefaultLifecycleExecutor.executeGoal(DefaultLifecycleExecutor.java:535)
	at org.apache.maven.lifecycle.DefaultLifecycleExecutor.executeGoalAndHandleFailures(DefaultLifecycleExecutor.java:387)
	at org.apache.maven.lifecycle.DefaultLifecycleExecutor.executeTaskSegments(DefaultLifecycleExecutor.java:348)
	at org.apache.maven.lifecycle.DefaultLifecycleExecutor.execute(DefaultLifecycleExecutor.java:180)
	at org.apache.maven.lifecycle.LifecycleExecutorInterceptor.execute(LifecycleExecutorInterceptor.java:65)
	at org.apache.maven.DefaultMaven.doExecute(DefaultMaven.java:328)
	at org.apache.maven.DefaultMaven.execute(DefaultMaven.java:138)
	at org.apache.maven.cli.MavenCli.main(MavenCli.java:362)
	at sun.reflect.NativeMethodAccessorImpl.invoke0(Native Method)
	at sun.reflect.NativeMethodAccessorImpl.invoke(NativeMethodAccessorImpl.java:39)
	at sun.reflect.DelegatingMethodAccessorImpl.invoke(DelegatingMethodAccessorImpl.java:25)
	at java.lang.reflect.Method.invoke(Method.java:592)
	at org.codehaus.classworlds.Launcher.launchEnhanced(Launcher.java:315)
	at org.codehaus.classworlds.Launcher.launch(Launcher.java:255)
	at hudson.maven.agent.Main.launch(Main.java:185)
	at hudson.maven.MavenBuilder.call(MavenBuilder.java:151)
	at hudson.maven.Maven2Builder.call(Maven2Builder.java:77)
	at hudson.maven.Maven2Builder.call(Maven2Builder.java:53)
	at hudson.remoting.UserRequest.perform(UserRequest.java:118)
	at hudson.remoting.UserRequest.perform(UserRequest.java:48)
	at hudson.remoting.Request$2.run(Request.java:287)
	at hudson.remoting.InterceptingExecutorService$1.call(InterceptingExecutorService.java:72)
	at java.util.concurrent.FutureTask$Sync.innerRun(FutureTask.java:269)
	at java.util.concurrent.FutureTask.run(FutureTask.java:123)
	at java.util.concurrent.ThreadPoolExecutor$Worker.runTask(ThreadPoolExecutor.java:651)
	at java.util.concurrent.ThreadPoolExecutor$Worker.run(ThreadPoolExecutor.java:676)
	at java.lang.Thread.run(Thread.java:595)
Caused by: org.apache.maven.plugin.CompilationFailureException: Compilation failure
	at org.apache.maven.plugin.AbstractCompilerMojo.execute(AbstractCompilerMojo.java:729)
	at org.apache.maven.plugin.CompilerMojo.execute(CompilerMojo.java:128)
	at org.apache.maven.plugin.DefaultPluginManager.executeMojo(DefaultPluginManager.java:490)
	at hudson.maven.agent.PluginManagerInterceptor.executeMojo(PluginManagerInterceptor.java:182)
	at org.apache.maven.lifecycle.DefaultLifecycleExecutor.executeGoals(DefaultLifecycleExecutor.java:694)
	... 28 more
[INFO] ------------------------------------------------------------------------
[INFO] Total time: 4 minutes 56 seconds
[INFO] Finished at: Sat Jun 30 08:01:27 UTC 2012
[INFO] Final Memory: 179M/237M
[INFO] ------------------------------------------------------------------------

Mime
View raw message