cxf-notifications mailing list archives

Site index · List index
Message view « Date » · « Thread »
Top « Date » · « Thread »
From Apache Jenkins Server <jenk...@builds.apache.org>
Subject Build failed in Jenkins: CXF-2.5-deploy #111
Date Sat, 16 Jun 2012 08:09:28 GMT
See <https://builds.apache.org/job/CXF-2.5-deploy/111/changes>

Changes:

[dkulp] Blocking revisions 1349022,1349839,1350315,1350752,1350753 via  git from
https://svn.apache.org/repos/asf/cxf/branches/2.6.x-fixes

........
  r1349022 | dkulp | 2012-06-11 17:25:03 -0400 (Mon, 11 Jun 2012) | 10 lines
  
  Merged revisions 1349016 via  git cherry-pick from
  https://svn.apache.org/repos/asf/cxf/trunk
  
  ........
    r1349016 | dkulp | 2012-06-11 17:16:43 -0400 (Mon, 11 Jun 2012) | 2 lines
  
    [CXF-4371] Only block the flush for StaxOut based writing.
  
  ........
  
........
........
  r1349839 | sergeyb | 2012-06-13 09:40:23 -0400 (Wed, 13 Jun 2012) | 2 lines
  
  Fixing the test as JAXB schema compiler does not handle XmlNs correctly in Java5
  
........
........
  r1350315 | sergeyb | 2012-06-14 12:13:40 -0400 (Thu, 14 Jun 2012) | 9 lines
  
  Merged revisions 1350305 via svnmerge from
  https://svn.apache.org/repos/asf/cxf/trunk
  
  ........
    r1350305 | sergeyb | 2012-06-14 16:53:47 +0100 (Thu, 14 Jun 2012) | 1 line
  
    [CXF-4381] Adding an optional DOM4J provider
  ........
  
........
........
  r1350752 | dkulp | 2012-06-15 15:36:43 -0400 (Fri, 15 Jun 2012) | 3 lines
  
  Recording revisions 1350617,1350633,1350739 via  git from
  https://svn.apache.org/repos/asf/cxf/trunk
  
........
........
  r1350753 | dkulp | 2012-06-15 15:36:45 -0400 (Fri, 15 Jun 2012) | 16 lines
  
  Blocking revisions 1350561,1350619 via  git from
  https://svn.apache.org/repos/asf/cxf/trunk
  
  ........
    r1350561 | coheigea | 2012-06-15 06:22:39 -0400 (Fri, 15 Jun 2012) | 2 lines
  
    Added a WS-Security test that uses JaxWsProxyFactoryBean
  
  ........
  ........
    r1350619 | dkulp | 2012-06-15 09:48:45 -0400 (Fri, 15 Jun 2012) | 2 lines
  
    Fix a test that is randomly failing with ActiveMQ 5.6.
  
  ........
  
........

[dkulp] Recording revisions 1350308,1350749,1350750,1350751 via  git from
https://svn.apache.org/repos/asf/cxf/branches/2.6.x-fixes

[dkulp] Merged revisions 1350751 via  git cherry-pick from
https://svn.apache.org/repos/asf/cxf/branches/2.6.x-fixes

........
  r1350751 | dkulp | 2012-06-15 15:36:38 -0400 (Fri, 15 Jun 2012) | 10 lines

  Merged revisions 1350739 via  git cherry-pick from
  https://svn.apache.org/repos/asf/cxf/trunk

  ........
    r1350739 | dkulp | 2012-06-15 15:00:22 -0400 (Fri, 15 Jun 2012) | 2 lines

    The managers will grab these and auto-register them.

  ........

........

[dkulp] Merged revisions 1350750 via  git cherry-pick from
https://svn.apache.org/repos/asf/cxf/branches/2.6.x-fixes

........
  r1350750 | dkulp | 2012-06-15 15:36:34 -0400 (Fri, 15 Jun 2012) | 10 lines

  Merged revisions 1350633 via  git cherry-pick from
  https://svn.apache.org/repos/asf/cxf/trunk

  ........
    r1350633 | ay | 2012-06-15 10:09:01 -0400 (Fri, 15 Jun 2012) | 2 lines

    [CXF-4383] Some temporary files are not deleted after WS-RM scenarios

  ........

........

[dkulp] Merged revisions 1350749 via  git cherry-pick from
https://svn.apache.org/repos/asf/cxf/branches/2.6.x-fixes

........
  r1350749 | dkulp | 2012-06-15 15:36:29 -0400 (Fri, 15 Jun 2012) | 10 lines

  Merged revisions 1350617 via  git cherry-pick from
  https://svn.apache.org/repos/asf/cxf/trunk

  ........
    r1350617 | ay | 2012-06-15 09:41:58 -0400 (Fri, 15 Jun 2012) | 2 lines

    cleanup DBTables at the beginning in ws-rm systests

  ........

........

[dkulp] Merged revisions 1350308 via  git cherry-pick from
https://svn.apache.org/repos/asf/cxf/branches/2.6.x-fixes

........
  r1350308 | sergeyb | 2012-06-14 12:00:58 -0400 (Thu, 14 Jun 2012) | 13 lines

  Merged revisions 1350215,1350303 via svnmerge from
  https://svn.apache.org/repos/asf/cxf/trunk

  ........
    r1350215 | ningjiang | 2012-06-14 13:45:51 +0100 (Thu, 14 Jun 2012) | 1 line

    Fix a comment typo of JAXRSSoapBookTest
  ........
    r1350303 | sergeyb | 2012-06-14 16:50:09 +0100 (Thu, 14 Jun 2012) | 1 line

    Minor update to Form to override toString
  ........

........

[sergeyb] Merged revisions 1350583 via svnmerge from 
https://svn.apache.org/repos/asf/cxf/branches/2.6.x-fixes

................
  r1350583 | sergeyb | 2012-06-15 12:38:14 +0100 (Fri, 15 Jun 2012) | 9 lines
  
  Merged revisions 1350582 via svnmerge from 
  https://svn.apache.org/repos/asf/cxf/trunk
  
  ........
    r1350582 | sergeyb | 2012-06-15 12:35:25 +0100 (Fri, 15 Jun 2012) | 1 line
    
    [CXF-3562] Removing references to HTTPUrlConnection from the jjaxrs client code, applying
a patch from Willem
  ........
................

------------------------------------------
[...truncated 11570 lines...]
AU        api/src/main/java/org/apache/cxf/service/package.html
A         api/src/main/java/org/apache/cxf/tools
A         api/src/main/java/org/apache/cxf/tools/validator
AU        api/src/main/java/org/apache/cxf/tools/validator/ServiceValidator.java
AU        api/src/main/java/org/apache/cxf/tools/validator/AbstractValidator.java
A         api/src/main/java/org/apache/cxf/tools/common
AU        api/src/main/java/org/apache/cxf/tools/common/ToolConstants.java
AU        api/src/main/java/org/apache/cxf/BusFactory.java
A         api/src/main/java/org/apache/cxf/databinding
AU        api/src/main/java/org/apache/cxf/databinding/WrapperHelper.java
AU        api/src/main/java/org/apache/cxf/databinding/BaseDataWriter.java
AU        api/src/main/java/org/apache/cxf/databinding/PropertiesAwareDataBinding.java
AU        api/src/main/java/org/apache/cxf/databinding/AbstractWrapperHelper.java
AU        api/src/main/java/org/apache/cxf/databinding/DataBinding.java
AU        api/src/main/java/org/apache/cxf/databinding/DataWriter.java
AU        api/src/main/java/org/apache/cxf/databinding/BaseDataReader.java
AU        api/src/main/java/org/apache/cxf/databinding/AbstractDataBinding.java
AU        api/src/main/java/org/apache/cxf/databinding/DataReader.java
AU        api/src/main/java/org/apache/cxf/databinding/WrapperCapableDatabinding.java
A         api/src/main/java/org/apache/cxf/configuration
AU        api/src/main/java/org/apache/cxf/configuration/ConfiguredBeanLocator.java
AU        api/src/main/java/org/apache/cxf/configuration/Configurable.java
AU        api/src/main/java/org/apache/cxf/configuration/Configurer.java
A         api/src/main/java/org/apache/cxf/configuration/jsse
AU        api/src/main/java/org/apache/cxf/configuration/jsse/TLSClientParameters.java
AU        api/src/main/java/org/apache/cxf/configuration/jsse/TLSServerParameters.java
AU        api/src/main/java/org/apache/cxf/configuration/jsse/TLSParameterBase.java
A         api/src/main/java/org/apache/cxf/io
AU        api/src/main/java/org/apache/cxf/io/DelegatingInputStream.java
AU        api/src/main/java/org/apache/cxf/io/CachedOutputStreamCallback.java
AU        api/src/main/java/org/apache/cxf/io/AbstractWrappedOutputStream.java
AU        api/src/main/java/org/apache/cxf/io/CacheSizeExceededException.java
AU        api/src/main/java/org/apache/cxf/io/CachedOutputStream.java
AU        api/src/main/java/org/apache/cxf/io/StaxValidationManager.java
AU        api/src/main/java/org/apache/cxf/io/AbstractThresholdOutputStream.java
A         api/src/main/java/org/apache/cxf/security
AU        api/src/main/java/org/apache/cxf/security/LoginSecurityContext.java
AU        api/src/main/java/org/apache/cxf/security/SecurityContext.java
A         api/src/main/java/org/apache/cxf/security/transport
AU        api/src/main/java/org/apache/cxf/security/transport/TLSSessionInfo.java
A         api/src/main/java/org/apache/cxf/buslifecycle
AU        api/src/main/java/org/apache/cxf/buslifecycle/BusLifeCycleListener.java
AU        api/src/main/java/org/apache/cxf/buslifecycle/BusCreationListener.java
AU        api/src/main/java/org/apache/cxf/buslifecycle/BusLifeCycleManager.java
AU        api/src/main/java/org/apache/cxf/Bus.java
A         api/src/main/java/org/apache/cxf/wsdl
AU        api/src/main/java/org/apache/cxf/wsdl/EndpointReferenceUtils.java
AU        api/src/main/java/org/apache/cxf/wsdl/EndpointUtilsException.java
AU        api/src/main/java/org/apache/cxf/wsdl/JAXBExtensionHelper.java
AU        api/src/main/java/org/apache/cxf/wsdl/Messages.properties
AU        api/src/main/java/org/apache/cxf/wsdl/WSDLManager.java
AU        api/src/main/java/org/apache/cxf/wsdl/WSDLExtensibilityPlugin.java
AU        api/src/main/java/org/apache/cxf/wsdl/WSAEndpointReferenceUtils.java
AU        api/src/main/java/org/apache/cxf/wsdl/AbstractWSDLPlugin.java
AU        api/src/main/java/org/apache/cxf/wsdl/TExtensibilityElementImpl.java
AU        api/src/main/java/org/apache/cxf/wsdl/WSDLExtensionLoader.java
AU        api/src/main/java/org/apache/cxf/wsdl/PrettyPrintXMLStreamWriter.java
A         api/src/main/java/org/apache/cxf/binding
AU        api/src/main/java/org/apache/cxf/binding/BindingFactory.java
AU        api/src/main/java/org/apache/cxf/binding/Binding.java
AU        api/src/main/java/org/apache/cxf/binding/BindingFactoryManager.java
AU        api/src/main/java/org/apache/cxf/binding/package.html
A         api/src/main/java/org/apache/cxf/headers
AU        api/src/main/java/org/apache/cxf/headers/HeaderManager.java
AU        api/src/main/java/org/apache/cxf/headers/Header.java
AU        api/src/main/java/org/apache/cxf/headers/HeaderProcessor.java
A         api/src/main/java/org/apache/cxf/extension
AU        api/src/main/java/org/apache/cxf/extension/BusExtension.java
AU        api/src/main/java/org/apache/cxf/extension/Registry.java
AU        api/src/main/java/org/apache/cxf/extension/RegistryImpl.java
A         api/src/main/build-resources
AU        api/src/main/build-resources/catalog.cat
A         api/src/main/resources
A         api/src/main/resources/META-INF
A         api/src/main/resources/META-INF/spring.schemas
A         api/src/main/resources/schemas
A         api/src/main/resources/schemas/configuration
AU        api/src/main/resources/schemas/configuration/security.xsd
AU        api/src/main/resources/schemas/configuration/security.xjb
AU        api/src/main/resources/schemas/configuration/parameterized-types.xsd
A         api/src/main/resources/schemas/wsdl
AU        api/src/main/resources/schemas/wsdl/addressing.xsd
AU        api/src/main/resources/schemas/wsdl/soap-encoding.xsd
AU        api/src/main/resources/schemas/wsdl/swaref.xsd
AU        api/src/main/resources/schemas/wsdl/wsrm.xsd
AU        api/src/main/resources/schemas/wsdl/addressing200403.xsd
AU        api/src/main/resources/schemas/wsdl/ws-addr-wsdl.xjb
AU        api/src/main/resources/schemas/wsdl/wsdl.xjb
AU        api/src/main/resources/schemas/wsdl/mime-binding.xsd
AU        api/src/main/resources/schemas/wsdl/xml.xsd
AU        api/src/main/resources/schemas/wsdl/ws-addr.xsd
AU        api/src/main/resources/schemas/wsdl/http.xjb
AU        api/src/main/resources/schemas/wsdl/addressing.xjb
AU        api/src/main/resources/schemas/wsdl/ws-addr-wsdl.xsd
AU        api/src/main/resources/schemas/wsdl/wsdl.xsd
AU        api/src/main/resources/schemas/wsdl/soap-binding.xsd
AU        api/src/main/resources/schemas/wsdl/jms-context.xsd
AU        api/src/main/resources/schemas/wsdl/http.xsd
AU        api/src/main/resources/schemas/wsdl/xmime.xsd
AU        api/src/main/resources/schemas/wsdl/addressing200403.xjb
AU        api/src/main/resources/schemas/wsdl/XMLSchema.xsd
AU        api/pom.xml
A         etc
A         etc/eclipse.prefs
A         etc/idea
AU        etc/idea/README.txt
AU        etc/idea/settings.jar
A         etc/eclipse
AU        etc/eclipse/CXF.importorder
AU        etc/eclipse/CXFCleanUp.xml
AU        etc/eclipse/codetemplates.xml
AU        etc/eclipse/template.checkstyle-config.xml
AU        etc/eclipse/addcheckstyle.xsl
AU        etc/eclipse/CXFCodeFormatter.xml
AU        etc/eclipse/xmltemplates.xml
AU        etc/apache-header.txt
AU        etc/rat.unknowns.txt
AU        etc/cxf.rdf
A         etc/survey
AU        etc/survey/SurveySummary.pdf
AU        etc/survey/README
AU        etc/svn-auto-props
AU        KEYS
 U        .
At revision 1350877
[locks-and-latches] Checking to see if we really have the locks
[locks-and-latches] Have all the locks, build can start
Parsing POMs
[cxf-2.5.x-fixes] $ /home/hudson/tools/maven/apache-maven-2.2.1/bin/mvn -Dmaven.repo.local=<https://builds.apache.org/job/CXF-2.5-deploy/ws/.repository>
-B deploy -Pdeploy,everything,nochecks -Dmaven.test.skip.exec=true
[INFO] Scanning for projects...
[INFO] ------------------------------------------------------------------------
[ERROR] FATAL ERROR
[INFO] ------------------------------------------------------------------------
[INFO] Failed to resolve artifact.

GroupId: org.apache.cxf.samples
ArtifactId: cxf-samples
Version: 2.5.4-SNAPSHOT

Reason: Unable to download the artifact from any repository

  org.apache.cxf.samples:cxf-samples:pom:2.5.4-SNAPSHOT

from the specified remote repositories:
  central (http://repo1.maven.org/maven2)



[INFO] ------------------------------------------------------------------------
[INFO] Trace
org.apache.maven.reactor.MavenExecutionException: Cannot find parent: org.apache.cxf.samples:cxf-samples
for project: org.apache.cxf.samples:jax_rs_minimal_osgi:jar:2.5.4-SNAPSHOT for project org.apache.cxf.samples:jax_rs_minimal_osgi:jar:2.5.4-SNAPSHOT
	at org.apache.maven.DefaultMaven.getProjects(DefaultMaven.java:404)
	at org.apache.maven.DefaultMaven.doExecute(DefaultMaven.java:272)
	at org.apache.maven.DefaultMaven.execute(DefaultMaven.java:138)
	at org.apache.maven.cli.MavenCli.main(MavenCli.java:362)
	at org.apache.maven.cli.compat.CompatibleMain.main(CompatibleMain.java:60)
	at sun.reflect.NativeMethodAccessorImpl.invoke0(Native Method)
	at sun.reflect.NativeMethodAccessorImpl.invoke(NativeMethodAccessorImpl.java:39)
	at sun.reflect.DelegatingMethodAccessorImpl.invoke(DelegatingMethodAccessorImpl.java:25)
	at java.lang.reflect.Method.invoke(Method.java:592)
	at org.codehaus.classworlds.Launcher.launchEnhanced(Launcher.java:315)
	at org.codehaus.classworlds.Launcher.launch(Launcher.java:255)
	at org.codehaus.classworlds.Launcher.mainWithExitCode(Launcher.java:430)
	at org.codehaus.classworlds.Launcher.main(Launcher.java:375)
Caused by: org.apache.maven.project.ProjectBuildingException: Cannot find parent: org.apache.cxf.samples:cxf-samples
for project: org.apache.cxf.samples:jax_rs_minimal_osgi:jar:2.5.4-SNAPSHOT for project org.apache.cxf.samples:jax_rs_minimal_osgi:jar:2.5.4-SNAPSHOT
	at org.apache.maven.project.DefaultMavenProjectBuilder.assembleLineage(DefaultMavenProjectBuilder.java:1396)
	at org.apache.maven.project.DefaultMavenProjectBuilder.buildInternal(DefaultMavenProjectBuilder.java:823)
	at org.apache.maven.project.DefaultMavenProjectBuilder.buildFromSourceFileInternal(DefaultMavenProjectBuilder.java:508)
	at org.apache.maven.project.DefaultMavenProjectBuilder.build(DefaultMavenProjectBuilder.java:200)
	at org.apache.maven.DefaultMaven.getProject(DefaultMaven.java:604)
	at org.apache.maven.DefaultMaven.collectProjects(DefaultMaven.java:487)
	at org.apache.maven.DefaultMaven.collectProjects(DefaultMaven.java:560)
	at org.apache.maven.DefaultMaven.collectProjects(DefaultMaven.java:560)
	at org.apache.maven.DefaultMaven.collectProjects(DefaultMaven.java:560)
	at org.apache.maven.DefaultMaven.getProjects(DefaultMaven.java:391)
	... 12 more
Caused by: org.apache.maven.project.ProjectBuildingException: POM 'org.apache.cxf.samples:cxf-samples'
not found in repository: Unable to download the artifact from any repository

  org.apache.cxf.samples:cxf-samples:pom:2.5.4-SNAPSHOT

from the specified remote repositories:
  central (http://repo1.maven.org/maven2)

 for project org.apache.cxf.samples:cxf-samples
	at org.apache.maven.project.DefaultMavenProjectBuilder.findModelFromRepository(DefaultMavenProjectBuilder.java:605)
	at org.apache.maven.project.DefaultMavenProjectBuilder.assembleLineage(DefaultMavenProjectBuilder.java:1392)
	... 21 more
Caused by: org.apache.maven.artifact.resolver.ArtifactNotFoundException: Unable to download
the artifact from any repository

  org.apache.cxf.samples:cxf-samples:pom:2.5.4-SNAPSHOT

from the specified remote repositories:
  central (http://repo1.maven.org/maven2)


	at org.apache.maven.artifact.resolver.DefaultArtifactResolver.resolve(DefaultArtifactResolver.java:228)
	at org.apache.maven.artifact.resolver.DefaultArtifactResolver.resolve(DefaultArtifactResolver.java:90)
	at org.apache.maven.project.DefaultMavenProjectBuilder.findModelFromRepository(DefaultMavenProjectBuilder.java:558)
	... 22 more
Caused by: org.apache.maven.wagon.ResourceDoesNotExistException: Unable to download the artifact
from any repository
	at org.apache.maven.artifact.manager.DefaultWagonManager.getArtifact(DefaultWagonManager.java:404)
	at org.apache.maven.artifact.resolver.DefaultArtifactResolver.resolve(DefaultArtifactResolver.java:216)
	... 24 more
[INFO] ------------------------------------------------------------------------
[INFO] Total time: 9 seconds
[INFO] Finished at: Sat Jun 16 08:09:28 UTC 2012
[INFO] Final Memory: 22M/59M
[INFO] ------------------------------------------------------------------------
Build step 'Invoke top-level Maven targets' marked build as failure
[locks-and-latches] Releasing all the locks
[locks-and-latches] All the locks released
ERROR: Failed to parse POMs
hudson.util.IOException2: remote file operation failed: <https://builds.apache.org/job/CXF-2.5-deploy/ws/cxf-2.5.x-fixes>
at hudson.remoting.Channel@75775df8:ubuntu2
	at hudson.FilePath.act(FilePath.java:835)
	at hudson.FilePath.act(FilePath.java:821)
	at hudson.maven.MavenModuleSetBuild$RunnerImpl.parsePoms(MavenModuleSetBuild.java:910)
	at hudson.maven.MavenModuleSetBuild$RunnerImpl.doRun(MavenModuleSetBuild.java:654)
	at hudson.model.AbstractBuild$AbstractRunner.run(AbstractBuild.java:480)
	at hudson.model.Run.run(Run.java:1434)
	at hudson.maven.MavenModuleSetBuild.run(MavenModuleSetBuild.java:477)
	at hudson.model.ResourceController.execute(ResourceController.java:88)
	at hudson.model.Executor.run(Executor.java:239)
Caused by: hudson.remoting.ProxyException: hudson.maven.MavenModuleSetBuild$MavenExecutionException:
org.apache.maven.project.ProjectBuildingException: Some problems were encountered while processing
the POMs:
[FATAL] Non-resolvable parent POM: Could not find artifact org.apache.cxf.samples:cxf-samples:pom:2.5.4-SNAPSHOT
and 'parent.relativePath' points at wrong local POM @ line 28, column 10

	at hudson.maven.MavenModuleSetBuild$PomParser.invoke(MavenModuleSetBuild.java:1278)
	at hudson.maven.MavenModuleSetBuild$PomParser.invoke(MavenModuleSetBuild.java:1045)
	at hudson.FilePath$FileCallableWrapper.call(FilePath.java:2177)
	at hudson.remoting.UserRequest.perform(UserRequest.java:118)
	at hudson.remoting.UserRequest.perform(UserRequest.java:48)
	at hudson.remoting.Request$2.run(Request.java:287)
	at hudson.remoting.InterceptingExecutorService$1.call(InterceptingExecutorService.java:72)
	at java.util.concurrent.FutureTask$Sync.innerRun(FutureTask.java:334)
	at java.util.concurrent.FutureTask.run(FutureTask.java:166)
	at java.util.concurrent.ThreadPoolExecutor.runWorker(ThreadPoolExecutor.java:1110)
	at java.util.concurrent.ThreadPoolExecutor$Worker.run(ThreadPoolExecutor.java:603)
	at java.lang.Thread.run(Thread.java:636)
Caused by: hudson.remoting.ProxyException: org.apache.maven.project.ProjectBuildingException:
Some problems were encountered while processing the POMs:
[FATAL] Non-resolvable parent POM: Could not find artifact org.apache.cxf.samples:cxf-samples:pom:2.5.4-SNAPSHOT
and 'parent.relativePath' points at wrong local POM @ line 28, column 10

	at org.apache.maven.project.DefaultProjectBuilder.build(DefaultProjectBuilder.java:363)
	at hudson.maven.MavenEmbedder.buildProjects(MavenEmbedder.java:361)
	at hudson.maven.MavenEmbedder.readProjects(MavenEmbedder.java:331)
	at hudson.maven.MavenEmbedder.readProject(MavenEmbedder.java:322)
	at hudson.maven.MavenModuleSetBuild$PomParser.readChilds(MavenModuleSetBuild.java:1332)
	at hudson.maven.MavenModuleSetBuild$PomParser.readChilds(MavenModuleSetBuild.java:1335)
	at hudson.maven.MavenModuleSetBuild$PomParser.readChilds(MavenModuleSetBuild.java:1335)
	at hudson.maven.MavenModuleSetBuild$PomParser.invoke(MavenModuleSetBuild.java:1239)
	... 11 more

Mime
View raw message