cxf-notifications mailing list archives

Site index · List index
Message view « Date » · « Thread »
Top « Date » · « Thread »
From Apache Jenkins Server <jenk...@builds.apache.org>
Subject Build failed in Jenkins: CXF-2.5-deploy » Apache CXF Runtime JAX-RS Frontend #119
Date Tue, 26 Jun 2012 07:19:29 GMT
See <https://builds.apache.org/job/CXF-2.5-deploy/org.apache.cxf$cxf-rt-frontend-jaxrs/119/changes>

Changes:

[sergeyb] Merged revisions 1352968 via svnmerge from 
https://svn.apache.org/repos/asf/cxf/branches/2.6.x-fixes

................
  r1352968 | sergeyb | 2012-06-22 17:52:20 +0100 (Fri, 22 Jun 2012) | 13 lines
  
  Merged revisions 1352965-1352966 via svnmerge from 
  https://svn.apache.org/repos/asf/cxf/trunk
  
  ........
    r1352965 | sergeyb | 2012-06-22 17:48:11 +0100 (Fri, 22 Jun 2012) | 1 line
    
    [CXF-4393] Initial support for checking custom catalogs when creating JAXB Schemas
  ........
    r1352966 | sergeyb | 2012-06-22 17:49:03 +0100 (Fri, 22 Jun 2012) | 1 line
    
    [CXF-4393] One more modified file
  ........
................

[sergeyb] Merged revisions 1352619 via svnmerge from 
https://svn.apache.org/repos/asf/cxf/branches/2.6.x-fixes

................
  r1352619 | sergeyb | 2012-06-21 18:06:11 +0100 (Thu, 21 Jun 2012) | 9 lines
  
  Merged revisions 1352616 via svnmerge from 
  https://svn.apache.org/repos/asf/cxf/trunk
  
  ........
    r1352616 | sergeyb | 2012-06-21 17:59:24 +0100 (Thu, 21 Jun 2012) | 1 line
    
    [CXF-4350] Checking Request URI for query parameters if no QUERY_STRING is set as in case
of JMS/Local
  ........
................

[ningjiang] Merged revisions 1352070 via svnmerge from 
https://svn.apache.org/repos/asf/cxf/branches/2.6.x-fixes

................
  r1352070 | sergeyb | 2012-06-20 20:50:14 +0800 (Wed, 20 Jun 2012) | 9 lines
  
  Merged revisions 1352069 via svnmerge from 
  https://svn.apache.org/repos/asf/cxf/trunk
  
  ........
    r1352069 | sergeyb | 2012-06-20 13:45:59 +0100 (Wed, 20 Jun 2012) | 1 line
    
    [CXF-4350] Getting JAX-RS client code to support JMS, applying a patch from Willem with
minor updates
  ........
................

[sergeyb] Merged revisions 1351677 via svnmerge from 
https://svn.apache.org/repos/asf/cxf/branches/2.6.x-fixes

................
  r1351677 | sergeyb | 2012-06-19 13:36:15 +0100 (Tue, 19 Jun 2012) | 9 lines
  
  Merged revisions 1351674 via svnmerge from 
  https://svn.apache.org/repos/asf/cxf/trunk
  
  ........
    r1351674 | sergeyb | 2012-06-19 13:32:29 +0100 (Tue, 19 Jun 2012) | 1 line
    
    Avoiding checking for single specific prefixes in the schema generated by JAXB as the
output is different depending on JAXB versions
  ........
................

[sergeyb] Merged revisions 1351659 via svnmerge from 
https://svn.apache.org/repos/asf/cxf/branches/2.6.x-fixes

................
  r1351659 | sergeyb | 2012-06-19 13:01:22 +0100 (Tue, 19 Jun 2012) | 9 lines
  
  Merged revisions 1351657 via svnmerge from 
  https://svn.apache.org/repos/asf/cxf/trunk
  
  ........
    r1351657 | sergeyb | 2012-06-19 12:57:21 +0100 (Tue, 19 Jun 2012) | 1 line
    
    [CXF-4380] Support for reading custom JAXBElements
  ........
................

[sergeyb] Fixing the compilation failure on 2.5.x

[sergeyb] Merged revisions 1351628 via svnmerge from 
https://svn.apache.org/repos/asf/cxf/branches/2.6.x-fixes

................
  r1351628 | sergeyb | 2012-06-19 10:53:23 +0100 (Tue, 19 Jun 2012) | 9 lines
  
  Merged revisions 1351626 via svnmerge from 
  https://svn.apache.org/repos/asf/cxf/trunk
  
  ........
    r1351626 | sergeyb | 2012-06-19 10:49:55 +0100 (Tue, 19 Jun 2012) | 1 line
    
    [CXF-4359] Adding Types to a single JAXBContext
  ........
................

[dkulp] Merged revisions 1350308 via  git cherry-pick from
https://svn.apache.org/repos/asf/cxf/branches/2.6.x-fixes

........
  r1350308 | sergeyb | 2012-06-14 12:00:58 -0400 (Thu, 14 Jun 2012) | 13 lines

  Merged revisions 1350215,1350303 via svnmerge from
  https://svn.apache.org/repos/asf/cxf/trunk

  ........
    r1350215 | ningjiang | 2012-06-14 13:45:51 +0100 (Thu, 14 Jun 2012) | 1 line

    Fix a comment typo of JAXRSSoapBookTest
  ........
    r1350303 | sergeyb | 2012-06-14 16:50:09 +0100 (Thu, 14 Jun 2012) | 1 line

    Minor update to Form to override toString
  ........

........

[sergeyb] Merged revisions 1350583 via svnmerge from 
https://svn.apache.org/repos/asf/cxf/branches/2.6.x-fixes

................
  r1350583 | sergeyb | 2012-06-15 12:38:14 +0100 (Fri, 15 Jun 2012) | 9 lines
  
  Merged revisions 1350582 via svnmerge from 
  https://svn.apache.org/repos/asf/cxf/trunk
  
  ........
    r1350582 | sergeyb | 2012-06-15 12:35:25 +0100 (Fri, 15 Jun 2012) | 1 line
    
    [CXF-3562] Removing references to HTTPUrlConnection from the jjaxrs client code, applying
a patch from Willem
  ........
................

------------------------------------------
[INFO] ------------------------------------------------------------------------
[INFO] Building Apache CXF Runtime JAX-RS Frontend
[INFO]    task-segment: [clean, install]
[INFO] ------------------------------------------------------------------------
[INFO] [clean:clean {execution: default-clean}]
[INFO] [cxf-xml2fastinfoset:xml2fastinfoset {execution: xml2fastinfoset}]
[WARNING] The parameter expression: 'project.build.resources' used in mojo: 'process' has
been deprecated. Use 'project.resources' instead.
[INFO] [remote-resources:process {execution: default}]
Downloading: http://repo1.maven.org/maven2/javax/ws/rs/jsr311-api/1.1.1/jsr311-api-1.1.1.pom
1K downloaded  (jsr311-api-1.1.1.pom)
Downloading: http://repo1.maven.org/maven2/org/apache/abdera/abdera-core/1.1.2/abdera-core-1.1.2.pom
1K downloaded  (abdera-core-1.1.2.pom)
Downloading: http://repo1.maven.org/maven2/org/apache/abdera/abdera/1.1.2/abdera-1.1.2.pom
3K downloaded  (abdera-1.1.2.pom)
Downloading: http://repo1.maven.org/maven2/org/apache/abdera/abdera-i18n/1.1.2/abdera-i18n-1.1.2.pom
572b downloaded  (abdera-i18n-1.1.2.pom)
Downloading: http://repo1.maven.org/maven2/org/apache/abdera/abdera-parser/1.1.2/abdera-parser-1.1.2.pom
740b downloaded  (abdera-parser-1.1.2.pom)
Downloading: http://repo1.maven.org/maven2/org/apache/ws/commons/axiom/axiom-impl/1.2.10/axiom-impl-1.2.10.pom
1K downloaded  (axiom-impl-1.2.10.pom)
Downloading: http://repo1.maven.org/maven2/org/apache/ws/commons/axiom/axiom-parent/1.2.10/axiom-parent-1.2.10.pom
3K downloaded  (axiom-parent-1.2.10.pom)
Downloading: http://repo1.maven.org/maven2/org/apache/ws/commons/axiom/axiom-api/1.2.10/axiom-api-1.2.10.pom
2K downloaded  (axiom-api-1.2.10.pom)
Downloading: http://repo1.maven.org/maven2/jaxen/jaxen/1.1.1/jaxen-1.1.1.pom
1K downloaded  (jaxen-1.1.1.pom)
Downloading: http://repo1.maven.org/maven2/org/apache/abdera/abdera-extensions-json/1.1.2/abdera-extensions-json-1.1.2.pom
483b downloaded  (abdera-extensions-json-1.1.2.pom)
Downloading: http://repo1.maven.org/maven2/org/apache/abdera/abdera-extensions-main/1.1.2/abdera-extensions-main-1.1.2.pom
453b downloaded  (abdera-extensions-main-1.1.2.pom)
Downloading: http://repo1.maven.org/maven2/org/codehaus/jettison/jettison/1.3.1/jettison-1.3.1.pom
1K downloaded  (jettison-1.3.1.pom)
Downloading: http://repo1.maven.org/maven2/org/codehaus/jettison/jettison/1.3.1/jettison-1.3.1.jar
Downloading: http://repo1.maven.org/maven2/org/apache/ws/commons/axiom/axiom-impl/1.2.10/axiom-impl-1.2.10.jar
Downloading: http://repo1.maven.org/maven2/jaxen/jaxen/1.1.1/jaxen-1.1.1.jar
Downloading: http://repo1.maven.org/maven2/org/apache/abdera/abdera-core/1.1.2/abdera-core-1.1.2.jar
Downloading: http://repo1.maven.org/maven2/javax/ws/rs/jsr311-api/1.1.1/jsr311-api-1.1.1.jar
38K downloaded  (jsr311-api-1.1.1.jar)
66K downloaded  (jettison-1.3.1.jar)
105K downloaded  (axiom-impl-1.2.10.jar)
138K downloaded  (abdera-core-1.1.2.jar)
Downloading: http://repo1.maven.org/maven2/org/apache/ws/commons/axiom/axiom-api/1.2.10/axiom-api-1.2.10.jar
Downloading: http://repo1.maven.org/maven2/org/apache/abdera/abdera-i18n/1.1.2/abdera-i18n-1.1.2.jar
356K downloaded  (axiom-api-1.2.10.jar)
470K downloaded  (abdera-i18n-1.1.2.jar)
Downloading: http://repo1.maven.org/maven2/org/apache/abdera/abdera-parser/1.1.2/abdera-parser-1.1.2.jar
194K downloaded  (jaxen-1.1.1.jar)
940K downloaded  (abdera-parser-1.1.2.jar)
Downloading: http://repo1.maven.org/maven2/org/apache/abdera/abdera-extensions-json/1.1.2/abdera-extensions-json-1.1.2.jar
24K downloaded  (abdera-extensions-json-1.1.2.jar)
Downloading: http://repo1.maven.org/maven2/org/apache/abdera/abdera-extensions-main/1.1.2/abdera-extensions-main-1.1.2.jar
22K downloaded  (abdera-extensions-main-1.1.2.jar)
[debug] execute contextualize
[INFO] [resources:resources {execution: default-resources}]
[INFO] Using 'UTF-8' encoding to copy filtered resources.
[INFO] Copying 7 resources
[INFO] Copying 6 resources
[INFO] skip non existing resourceDirectory <https://builds.apache.org/job/CXF-2.5-deploy/org.apache.cxf$cxf-rt-frontend-jaxrs/ws/src/main/resources-filtered>
[INFO] skip non existing resourceDirectory <https://builds.apache.org/job/CXF-2.5-deploy/org.apache.cxf$cxf-rt-frontend-jaxrs/ws/target/generated/src/main/resources>
[INFO] Copying 3 resources
[INFO] [compiler:compile {execution: default-compile}]
[INFO] Compiling 197 source files to <https://builds.apache.org/job/CXF-2.5-deploy/org.apache.cxf$cxf-rt-frontend-jaxrs/ws/target/classes>
[INFO] [xmlbeans:xmlbeans-test {execution: default}]
[debug] execute contextualize
[INFO] [resources:testResources {execution: default-testResources}]
[INFO] Using 'UTF-8' encoding to copy filtered resources.
[INFO] Copying 14 resources
[INFO] Copying 7 resources
[INFO] Copying 10 resources
[INFO] Copying 3 resources
[INFO] Copying 10 resources
[INFO] [compiler:testCompile {execution: default-testCompile}]
[INFO] Compiling 139 source files to <https://builds.apache.org/job/CXF-2.5-deploy/org.apache.cxf$cxf-rt-frontend-jaxrs/ws/target/test-classes>
[INFO] -------------------------------------------------------------
[ERROR] COMPILATION ERROR : 
[INFO] -------------------------------------------------------------
[ERROR] <https://builds.apache.org/job/CXF-2.5-deploy/org.apache.cxf$cxf-rt-frontend-jaxrs/ws/src/test/java/org/apache/cxf/jaxrs/fortest/jaxb/jaxbelement/ParamJAXBElement.java>:[43,1]
'class' or 'interface' expected
[ERROR] <https://builds.apache.org/job/CXF-2.5-deploy/org.apache.cxf$cxf-rt-frontend-jaxrs/ws/src/test/java/org/apache/cxf/jaxrs/fortest/jaxb/jaxbelement/ParamJAXBElement.java>:[48,15]
'class' or 'interface' expected
[ERROR] <https://builds.apache.org/job/CXF-2.5-deploy/org.apache.cxf$cxf-rt-frontend-jaxrs/ws/src/test/java/org/apache/cxf/jaxrs/fortest/jaxb/jaxbelement/ParamJAXBElement.java>:[62,0]
'class' or 'interface' expected
[ERROR] <https://builds.apache.org/job/CXF-2.5-deploy/org.apache.cxf$cxf-rt-frontend-jaxrs/ws/src/test/java/org/apache/cxf/jaxrs/fortest/jaxb/jaxbelement/ParamJAXBElement.java>:[63,0]
'class' or 'interface' expected
[ERROR] <https://builds.apache.org/job/CXF-2.5-deploy/org.apache.cxf$cxf-rt-frontend-jaxrs/ws/src/test/java/org/apache/cxf/jaxrs/fortest/jaxb/jaxbelement/package-info.java>:[42,0]
'class' or 'interface' expected
[ERROR] <https://builds.apache.org/job/CXF-2.5-deploy/org.apache.cxf$cxf-rt-frontend-jaxrs/ws/src/test/java/org/apache/cxf/jaxrs/fortest/jaxb/jaxbelement/ParamType.java>:[48,1]
'class' or 'interface' expected
[ERROR] <https://builds.apache.org/job/CXF-2.5-deploy/org.apache.cxf$cxf-rt-frontend-jaxrs/ws/src/test/java/org/apache/cxf/jaxrs/fortest/jaxb/jaxbelement/ParamType.java>:[53,15]
'class' or 'interface' expected
[ERROR] <https://builds.apache.org/job/CXF-2.5-deploy/org.apache.cxf$cxf-rt-frontend-jaxrs/ws/src/test/java/org/apache/cxf/jaxrs/fortest/jaxb/jaxbelement/ParamType.java>:[67,0]
'class' or 'interface' expected
[ERROR] <https://builds.apache.org/job/CXF-2.5-deploy/org.apache.cxf$cxf-rt-frontend-jaxrs/ws/src/test/java/org/apache/cxf/jaxrs/fortest/jaxb/jaxbelement/ParamType.java>:[69,0]
'class' or 'interface' expected
[ERROR] <https://builds.apache.org/job/CXF-2.5-deploy/org.apache.cxf$cxf-rt-frontend-jaxrs/ws/src/test/java/org/apache/cxf/jaxrs/fortest/jaxb/jaxbelement/ParamType.java>:[70,0]
'class' or 'interface' expected
[ERROR] <https://builds.apache.org/job/CXF-2.5-deploy/org.apache.cxf$cxf-rt-frontend-jaxrs/ws/src/test/java/org/apache/cxf/jaxrs/fortest/jaxb/jaxbelement/ParamType.java>:[71,0]
'class' or 'interface' expected
[ERROR] <https://builds.apache.org/job/CXF-2.5-deploy/org.apache.cxf$cxf-rt-frontend-jaxrs/ws/src/test/java/org/apache/cxf/jaxrs/fortest/jaxb/jaxbelement/ParamType.java>:[72,0]
'class' or 'interface' expected
[ERROR] <https://builds.apache.org/job/CXF-2.5-deploy/org.apache.cxf$cxf-rt-frontend-jaxrs/ws/src/test/java/org/apache/cxf/jaxrs/fortest/jaxb/jaxbelement/ObjectFactory.java>:[53,1]
'class' or 'interface' expected
[ERROR] <https://builds.apache.org/job/CXF-2.5-deploy/org.apache.cxf$cxf-rt-frontend-jaxrs/ws/src/test/java/org/apache/cxf/jaxrs/fortest/jaxb/jaxbelement/ObjectFactory.java>:[58,15]
'class' or 'interface' expected
[ERROR] <https://builds.apache.org/job/CXF-2.5-deploy/org.apache.cxf$cxf-rt-frontend-jaxrs/ws/src/test/java/org/apache/cxf/jaxrs/fortest/jaxb/jaxbelement/ObjectFactory.java>:[72,0]
'class' or 'interface' expected
[ERROR] <https://builds.apache.org/job/CXF-2.5-deploy/org.apache.cxf$cxf-rt-frontend-jaxrs/ws/src/test/java/org/apache/cxf/jaxrs/fortest/jaxb/jaxbelement/ObjectFactory.java>:[73,0]
'class' or 'interface' expected
[ERROR] <https://builds.apache.org/job/CXF-2.5-deploy/org.apache.cxf$cxf-rt-frontend-jaxrs/ws/src/test/java/org/apache/cxf/jaxrs/fortest/jaxb/jaxbelement/ObjectFactory.java>:[74,0]
'class' or 'interface' expected
[ERROR] <https://builds.apache.org/job/CXF-2.5-deploy/org.apache.cxf$cxf-rt-frontend-jaxrs/ws/src/test/java/org/apache/cxf/jaxrs/fortest/jaxb/jaxbelement/ObjectFactory.java>:[75,0]
'class' or 'interface' expected
[INFO] 18 errors 
[INFO] -------------------------------------------------------------
[JENKINS] Archiving <https://builds.apache.org/job/CXF-2.5-deploy/org.apache.cxf$cxf-rt-frontend-jaxrs/ws/pom.xml>
to /home/hudson/hudson/jobs/CXF-2.5-deploy/modules/org.apache.cxf$cxf-rt-frontend-jaxrs/builds/2012-06-26_07-14-06/archive/org.apache.cxf/cxf-rt-frontend-jaxrs/2.5.5-SNAPSHOT/cxf-rt-frontend-jaxrs-2.5.5-SNAPSHOT.pom
[INFO] ------------------------------------------------------------------------
[ERROR] BUILD FAILURE
[INFO] ------------------------------------------------------------------------
[INFO] Compilation failure

<https://builds.apache.org/job/CXF-2.5-deploy/org.apache.cxf$cxf-rt-frontend-jaxrs/ws/src/test/java/org/apache/cxf/jaxrs/fortest/jaxb/jaxbelement/ParamJAXBElement.java>:[43,1]
'class' or 'interface' expected
<https://builds.apache.org/job/CXF-2.5-deploy/org.apache.cxf$cxf-rt-frontend-jaxrs/ws/src/test/java/org/apache/cxf/jaxrs/fortest/jaxb/jaxbelement/ParamJAXBElement.java>:[48,15]
'class' or 'interface' expected
<https://builds.apache.org/job/CXF-2.5-deploy/org.apache.cxf$cxf-rt-frontend-jaxrs/ws/src/test/java/org/apache/cxf/jaxrs/fortest/jaxb/jaxbelement/ParamJAXBElement.java>:[62,0]
'class' or 'interface' expected
<https://builds.apache.org/job/CXF-2.5-deploy/org.apache.cxf$cxf-rt-frontend-jaxrs/ws/src/test/java/org/apache/cxf/jaxrs/fortest/jaxb/jaxbelement/ParamJAXBElement.java>:[63,0]
'class' or 'interface' expected
<https://builds.apache.org/job/CXF-2.5-deploy/org.apache.cxf$cxf-rt-frontend-jaxrs/ws/src/test/java/org/apache/cxf/jaxrs/fortest/jaxb/jaxbelement/package-info.java>:[42,0]
'class' or 'interface' expected
<https://builds.apache.org/job/CXF-2.5-deploy/org.apache.cxf$cxf-rt-frontend-jaxrs/ws/src/test/java/org/apache/cxf/jaxrs/fortest/jaxb/jaxbelement/ParamType.java>:[48,1]
'class' or 'interface' expected
<https://builds.apache.org/job/CXF-2.5-deploy/org.apache.cxf$cxf-rt-frontend-jaxrs/ws/src/test/java/org/apache/cxf/jaxrs/fortest/jaxb/jaxbelement/ParamType.java>:[53,15]
'class' or 'interface' expected
<https://builds.apache.org/job/CXF-2.5-deploy/org.apache.cxf$cxf-rt-frontend-jaxrs/ws/src/test/java/org/apache/cxf/jaxrs/fortest/jaxb/jaxbelement/ParamType.java>:[67,0]
'class' or 'interface' expected
<https://builds.apache.org/job/CXF-2.5-deploy/org.apache.cxf$cxf-rt-frontend-jaxrs/ws/src/test/java/org/apache/cxf/jaxrs/fortest/jaxb/jaxbelement/ParamType.java>:[69,0]
'class' or 'interface' expected
<https://builds.apache.org/job/CXF-2.5-deploy/org.apache.cxf$cxf-rt-frontend-jaxrs/ws/src/test/java/org/apache/cxf/jaxrs/fortest/jaxb/jaxbelement/ParamType.java>:[70,0]
'class' or 'interface' expected
<https://builds.apache.org/job/CXF-2.5-deploy/org.apache.cxf$cxf-rt-frontend-jaxrs/ws/src/test/java/org/apache/cxf/jaxrs/fortest/jaxb/jaxbelement/ParamType.java>:[71,0]
'class' or 'interface' expected
<https://builds.apache.org/job/CXF-2.5-deploy/org.apache.cxf$cxf-rt-frontend-jaxrs/ws/src/test/java/org/apache/cxf/jaxrs/fortest/jaxb/jaxbelement/ParamType.java>:[72,0]
'class' or 'interface' expected
<https://builds.apache.org/job/CXF-2.5-deploy/org.apache.cxf$cxf-rt-frontend-jaxrs/ws/src/test/java/org/apache/cxf/jaxrs/fortest/jaxb/jaxbelement/ObjectFactory.java>:[53,1]
'class' or 'interface' expected
<https://builds.apache.org/job/CXF-2.5-deploy/org.apache.cxf$cxf-rt-frontend-jaxrs/ws/src/test/java/org/apache/cxf/jaxrs/fortest/jaxb/jaxbelement/ObjectFactory.java>:[58,15]
'class' or 'interface' expected
<https://builds.apache.org/job/CXF-2.5-deploy/org.apache.cxf$cxf-rt-frontend-jaxrs/ws/src/test/java/org/apache/cxf/jaxrs/fortest/jaxb/jaxbelement/ObjectFactory.java>:[72,0]
'class' or 'interface' expected
<https://builds.apache.org/job/CXF-2.5-deploy/org.apache.cxf$cxf-rt-frontend-jaxrs/ws/src/test/java/org/apache/cxf/jaxrs/fortest/jaxb/jaxbelement/ObjectFactory.java>:[73,0]
'class' or 'interface' expected
<https://builds.apache.org/job/CXF-2.5-deploy/org.apache.cxf$cxf-rt-frontend-jaxrs/ws/src/test/java/org/apache/cxf/jaxrs/fortest/jaxb/jaxbelement/ObjectFactory.java>:[74,0]
'class' or 'interface' expected
<https://builds.apache.org/job/CXF-2.5-deploy/org.apache.cxf$cxf-rt-frontend-jaxrs/ws/src/test/java/org/apache/cxf/jaxrs/fortest/jaxb/jaxbelement/ObjectFactory.java>:[75,0]
'class' or 'interface' expected

[INFO] ------------------------------------------------------------------------
[INFO] Trace
org.apache.maven.BuildFailureException: Compilation failure
	at org.apache.maven.lifecycle.DefaultLifecycleExecutor.executeGoals(DefaultLifecycleExecutor.java:715)
	at org.apache.maven.lifecycle.DefaultLifecycleExecutor.executeGoalWithLifecycle(DefaultLifecycleExecutor.java:556)
	at org.apache.maven.lifecycle.DefaultLifecycleExecutor.executeGoal(DefaultLifecycleExecutor.java:535)
	at org.apache.maven.lifecycle.DefaultLifecycleExecutor.executeGoalAndHandleFailures(DefaultLifecycleExecutor.java:387)
	at org.apache.maven.lifecycle.DefaultLifecycleExecutor.executeTaskSegments(DefaultLifecycleExecutor.java:348)
	at org.apache.maven.lifecycle.DefaultLifecycleExecutor.execute(DefaultLifecycleExecutor.java:180)
	at org.apache.maven.lifecycle.LifecycleExecutorInterceptor.execute(LifecycleExecutorInterceptor.java:65)
	at org.apache.maven.DefaultMaven.doExecute(DefaultMaven.java:328)
	at org.apache.maven.DefaultMaven.execute(DefaultMaven.java:138)
	at org.apache.maven.cli.MavenCli.main(MavenCli.java:362)
	at sun.reflect.NativeMethodAccessorImpl.invoke0(Native Method)
	at sun.reflect.NativeMethodAccessorImpl.invoke(NativeMethodAccessorImpl.java:39)
	at sun.reflect.DelegatingMethodAccessorImpl.invoke(DelegatingMethodAccessorImpl.java:25)
	at java.lang.reflect.Method.invoke(Method.java:592)
	at org.codehaus.classworlds.Launcher.launchEnhanced(Launcher.java:315)
	at org.codehaus.classworlds.Launcher.launch(Launcher.java:255)
	at hudson.maven.agent.Main.launch(Main.java:185)
	at hudson.maven.MavenBuilder.call(MavenBuilder.java:151)
	at hudson.maven.Maven2Builder.call(Maven2Builder.java:77)
	at hudson.maven.Maven2Builder.call(Maven2Builder.java:53)
	at hudson.remoting.UserRequest.perform(UserRequest.java:118)
	at hudson.remoting.UserRequest.perform(UserRequest.java:48)
	at hudson.remoting.Request$2.run(Request.java:287)
	at hudson.remoting.InterceptingExecutorService$1.call(InterceptingExecutorService.java:72)
	at java.util.concurrent.FutureTask$Sync.innerRun(FutureTask.java:269)
	at java.util.concurrent.FutureTask.run(FutureTask.java:123)
	at java.util.concurrent.ThreadPoolExecutor$Worker.runTask(ThreadPoolExecutor.java:651)
	at java.util.concurrent.ThreadPoolExecutor$Worker.run(ThreadPoolExecutor.java:676)
	at java.lang.Thread.run(Thread.java:595)
Caused by: org.apache.maven.plugin.CompilationFailureException: Compilation failure
	at org.apache.maven.plugin.AbstractCompilerMojo.execute(AbstractCompilerMojo.java:729)
	at org.apache.maven.plugin.TestCompilerMojo.execute(TestCompilerMojo.java:161)
	at org.apache.maven.plugin.DefaultPluginManager.executeMojo(DefaultPluginManager.java:490)
	at hudson.maven.agent.PluginManagerInterceptor.executeMojo(PluginManagerInterceptor.java:182)
	at org.apache.maven.lifecycle.DefaultLifecycleExecutor.executeGoals(DefaultLifecycleExecutor.java:694)
	... 28 more
[INFO] ------------------------------------------------------------------------
[INFO] Total time: 4 minutes 51 seconds
[INFO] Finished at: Tue Jun 26 07:19:27 UTC 2012
[INFO] Final Memory: 180M/277M
[INFO] ------------------------------------------------------------------------

Mime
View raw message