cxf-notifications mailing list archives

Site index · List index
Message view « Date » · « Thread »
Top « Date » · « Thread »
From Apache Jenkins Server <jenk...@builds.apache.org>
Subject Build failed in Jenkins: CXF-2.5-deploy #91
Date Tue, 22 May 2012 06:58:09 GMT
See <https://builds.apache.org/job/CXF-2.5-deploy/91/changes>

Changes:

[coheigea] Blocking revisions 1341084 via  git from
https://svn.apache.org/repos/asf/cxf/trunk

........
  r1341084 | coheigea | 2012-05-21 16:55:04 +0100 (Mon, 21 May 2012) | 2 lines
  
  [CXF-4330] - Enforce that received IssuedTokens contain the required claims
  
........

[ema] svnmerge.py block -r 1340902, it has been manually merged

[ema] [CXF-4326]:Remove the XPathFactory.newInstance from XPathUtils' constructor to improve
the performance a bit

------------------------------------------
[...truncated 17023 lines...]
[INFO] [antrun:run {execution: process-sources-xsl}]
[WARNING] Parameter tasks is deprecated, use target instead
[INFO] Executing tasks

main:
[INFO] Executed tasks
[WARNING] The parameter expression: 'project.build.resources' used in mojo: 'process' has
been deprecated. Use 'project.resources' instead.
[INFO] [remote-resources:process {execution: default}]
[INFO] [site:attach-descriptor {execution: default-attach-descriptor}]
[INFO] [source:jar-no-fork {execution: attach-sources}]
[INFO] [javadoc:jar {execution: attach-javadocs}]
[INFO] Not executing Javadoc as the project is not a Java classpath-capable package
[INFO] [dependency:unpack {execution: unpack-javadoc}]
[INFO] Configured Artifact: org.apache.cxf:cxf-api:javadoc:2.5.4-SNAPSHOT:jar
> isMarkerOlder:
  artifact1 = <https://builds.apache.org/job/CXF-2.5-deploy/ws/.repository/org/apache/cxf/cxf-api/2.5.4-SNAPSHOT/cxf-api-2.5.4-SNAPSHOT-javadoc.jar>
  marker    = <https://builds.apache.org/job/CXF-2.5-deploy/ws/cxf-2.5.x-fixes/distribution/target/dependency-maven-plugin-markers/org.apache.cxf-cxf-api-jar-javadoc-2.5.4-SNAPSHOT.marker>
    artifact1 lastModified: 1337668214000
    marker lastModified: 1337149950000
< true = marker older than artifact?
[INFO] Unpacking <https://builds.apache.org/job/CXF-2.5-deploy/ws/.repository/org/apache/cxf/cxf-api/2.5.4-SNAPSHOT/cxf-api-2.5.4-SNAPSHOT-javadoc.jar>
to <https://builds.apache.org/job/CXF-2.5-deploy/ws/cxf-2.5.x-fixes/distribution/target/javadoc>
with includes "" and excludes ""
[INFO] [assembly:single {execution: distribution-package-bin}]
[INFO] Reading assembly descriptor: src/main/assembly/bin.xml
[WARNING] Cannot include project artifact: org.apache.cxf:apache-cxf:pom:2.5.4-SNAPSHOT; it
doesn't have an associated file or directory.
[WARNING] Cannot include project artifact: org.apache.cxf:apache-cxf:pom:2.5.4-SNAPSHOT; it
doesn't have an associated file or directory.
[WARNING] Cannot include project artifact: org.apache.cxf:apache-cxf:pom:2.5.4-SNAPSHOT; it
doesn't have an associated file or directory.
[INFO] Copying files to <https://builds.apache.org/job/CXF-2.5-deploy/ws/cxf-2.5.x-fixes/distribution/target/apache-cxf-2.5.4-SNAPSHOT>
[WARNING] Assembly file: <https://builds.apache.org/job/CXF-2.5-deploy/ws/cxf-2.5.x-fixes/distribution/target/apache-cxf-2.5.4-SNAPSHOT>
is not a regular file (it may be a directory). It cannot be attached to the project build
for installation or deployment.
[WARNING] Cannot include project artifact: org.apache.cxf:apache-cxf:pom:2.5.4-SNAPSHOT; it
doesn't have an associated file or directory.
[WARNING] Cannot include project artifact: org.apache.cxf:apache-cxf:pom:2.5.4-SNAPSHOT; it
doesn't have an associated file or directory.
[WARNING] Cannot include project artifact: org.apache.cxf:apache-cxf:pom:2.5.4-SNAPSHOT; it
doesn't have an associated file or directory.
[INFO] Building tar: <https://builds.apache.org/job/CXF-2.5-deploy/ws/cxf-2.5.x-fixes/distribution/target/apache-cxf-2.5.4-SNAPSHOT.tar.gz>
[WARNING] Cannot include project artifact: org.apache.cxf:apache-cxf:pom:2.5.4-SNAPSHOT; it
doesn't have an associated file or directory.
[WARNING] Cannot include project artifact: org.apache.cxf:apache-cxf:pom:2.5.4-SNAPSHOT; it
doesn't have an associated file or directory.
[WARNING] Cannot include project artifact: org.apache.cxf:apache-cxf:pom:2.5.4-SNAPSHOT; it
doesn't have an associated file or directory.
[INFO] Building zip: <https://builds.apache.org/job/CXF-2.5-deploy/ws/cxf-2.5.x-fixes/distribution/target/apache-cxf-2.5.4-SNAPSHOT.zip>
[INFO] [assembly:single {execution: distribution-package-src}]
[INFO] Reading assembly descriptor: src/main/assembly/src.xml
[INFO] Building tar: <https://builds.apache.org/job/CXF-2.5-deploy/ws/cxf-2.5.x-fixes/distribution/target/apache-cxf-2.5.4-SNAPSHOT-src.tar.gz>
[INFO] Building zip: <https://builds.apache.org/job/CXF-2.5-deploy/ws/cxf-2.5.x-fixes/distribution/target/apache-cxf-2.5.4-SNAPSHOT-src.zip>
[INFO] [install:install {execution: default-install}]
[INFO] Installing <https://builds.apache.org/job/CXF-2.5-deploy/ws/cxf-2.5.x-fixes/distribution/pom.xml>
to <https://builds.apache.org/job/CXF-2.5-deploy/ws/.repository/org/apache/cxf/apache-cxf/2.5.4-SNAPSHOT/apache-cxf-2.5.4-SNAPSHOT.pom>
[INFO] Installing <https://builds.apache.org/job/CXF-2.5-deploy/ws/cxf-2.5.x-fixes/distribution/target/apache-cxf-2.5.4-SNAPSHOT.tar.gz>
to <https://builds.apache.org/job/CXF-2.5-deploy/ws/.repository/org/apache/cxf/apache-cxf/2.5.4-SNAPSHOT/apache-cxf-2.5.4-SNAPSHOT.tar.gz>
[INFO] Installing <https://builds.apache.org/job/CXF-2.5-deploy/ws/cxf-2.5.x-fixes/distribution/target/apache-cxf-2.5.4-SNAPSHOT.zip>
to <https://builds.apache.org/job/CXF-2.5-deploy/ws/.repository/org/apache/cxf/apache-cxf/2.5.4-SNAPSHOT/apache-cxf-2.5.4-SNAPSHOT.zip>
[INFO] Installing <https://builds.apache.org/job/CXF-2.5-deploy/ws/cxf-2.5.x-fixes/distribution/target/apache-cxf-2.5.4-SNAPSHOT-src.tar.gz>
to <https://builds.apache.org/job/CXF-2.5-deploy/ws/.repository/org/apache/cxf/apache-cxf/2.5.4-SNAPSHOT/apache-cxf-2.5.4-SNAPSHOT-src.tar.gz>
[INFO] Installing <https://builds.apache.org/job/CXF-2.5-deploy/ws/cxf-2.5.x-fixes/distribution/target/apache-cxf-2.5.4-SNAPSHOT-src.zip>
to <https://builds.apache.org/job/CXF-2.5-deploy/ws/.repository/org/apache/cxf/apache-cxf/2.5.4-SNAPSHOT/apache-cxf-2.5.4-SNAPSHOT-src.zip>
[INFO] [deploy:deploy {execution: default-deploy}]
[INFO] Retrieving previous build number from apache.snapshots.https
[WARNING] *** CHECKSUM FAILED - Checksum failed on download: local = '8fcbe1e14b0af800de73b51d11333327e630fbda';
remote = '596863c5ba38f6acf1fe81cf41154a5c6ee7f3b0' - RETRYING
[WARNING] *** CHECKSUM FAILED - Checksum failed on download: local = '8fcbe1e14b0af800de73b51d11333327e630fbda';
remote = '596863c5ba38f6acf1fe81cf41154a5c6ee7f3b0' - IGNORING
Uploading: https://repository.apache.org/content/repositories/snapshots/org/apache/cxf/apache-cxf/2.5.4-SNAPSHOT/apache-cxf-2.5.4-20120522.062926-21.pom
21K uploaded  (apache-cxf-2.5.4-20120522.062926-21.pom)
[INFO] Retrieving previous metadata from apache.snapshots.https
[WARNING] *** CHECKSUM FAILED - Checksum failed on download: local = '8fcbe1e14b0af800de73b51d11333327e630fbda';
remote = '596863c5ba38f6acf1fe81cf41154a5c6ee7f3b0' - RETRYING
[WARNING] *** CHECKSUM FAILED - Checksum failed on download: local = '8fcbe1e14b0af800de73b51d11333327e630fbda';
remote = '596863c5ba38f6acf1fe81cf41154a5c6ee7f3b0' - IGNORING
[INFO] Uploading repository metadata for: 'snapshot org.apache.cxf:apache-cxf:2.5.4-SNAPSHOT'
[INFO] Retrieving previous metadata from apache.snapshots.https
[INFO] Uploading repository metadata for: 'artifact org.apache.cxf:apache-cxf'
[INFO] Retrieving previous build number from apache.snapshots.https
Uploading: https://repository.apache.org/content/repositories/snapshots/org/apache/cxf/apache-cxf/2.5.4-SNAPSHOT/apache-cxf-2.5.4-20120522.062926-21.tar.gz
34307K uploaded  (apache-cxf-2.5.4-20120522.062926-21.tar.gz)
[INFO] Retrieving previous build number from apache.snapshots.https
Uploading: https://repository.apache.org/content/repositories/snapshots/org/apache/cxf/apache-cxf/2.5.4-SNAPSHOT/apache-cxf-2.5.4-20120522.062926-21.zip
36113K uploaded  (apache-cxf-2.5.4-20120522.062926-21.zip)
[INFO] Retrieving previous build number from apache.snapshots.https
Uploading: https://repository.apache.org/content/repositories/snapshots/org/apache/cxf/apache-cxf/2.5.4-SNAPSHOT/apache-cxf-2.5.4-20120522.062926-21-src.tar.gz
6323K uploaded  (apache-cxf-2.5.4-20120522.062926-21-src.tar.gz)
[INFO] Retrieving previous build number from apache.snapshots.https
Uploading: https://repository.apache.org/content/repositories/snapshots/org/apache/cxf/apache-cxf/2.5.4-SNAPSHOT/apache-cxf-2.5.4-20120522.062926-21-src.zip
14107K uploaded  (apache-cxf-2.5.4-20120522.062926-21-src.zip)
[INFO] 
[INFO] 
[INFO] ------------------------------------------------------------------------
[INFO] Reactor Summary:
[INFO] ------------------------------------------------------------------------
[INFO] Apache CXF ............................................ SUCCESS [11.735s]
[INFO] Apache CXF Parent ..................................... SUCCESS [3.304s]
[INFO] Apache CXF Common Utilities ........................... SUCCESS [16.550s]
[INFO] Apache CXF API ........................................ SUCCESS [25.896s]
[INFO] Apache CXF Woodstox/MSV Schema Validation ............. SUCCESS [8.684s]
[INFO] Apache CXF XML Schema Validation with Xerces .......... SUCCESS [5.690s]
[INFO] Apache CXF Common ..................................... SUCCESS [2.087s]
[INFO] Apache CXF Runtime Core ............................... SUCCESS [15.215s]
[INFO] Apache CXF Command Line Tools Common .................. SUCCESS [9.047s]
[INFO] Apache CXF Command Line Tools Validator ............... SUCCESS [6.678s]
[INFO] Apache CXF Command Line Tools WSDLTo Core ............. SUCCESS [7.106s]
[INFO] Apache CXF Command Line Tools WSDLTo JAXWS Frontend ... SUCCESS [8.568s]
[INFO] Apache CXF Runtime JAXB DataBinding ................... SUCCESS [7.776s]
[INFO] Apache CXF Runtime SOAP Binding ....................... SUCCESS [9.928s]
[INFO] Apache CXF Runtime JavaScript Client Generator Projects  SUCCESS [2.169s]
[INFO] Apache CXF Runtime JavaScript Client Generator ........ SUCCESS [6.915s]
[INFO] Apache CXF Command Line Tools WSDL to JavaScript Front End  SUCCESS [6.974s]
[INFO] Apache CXF Command Line Tools WSDLTo JAXB Databinding . SUCCESS [7.158s]
[INFO] Apache CXF Runtime Transport Common Used Classes ...... SUCCESS [7.676s]
[INFO] Apache CXF Maven Plugins .............................. SUCCESS [2.314s]
[INFO] Apache CXF WSDL Validator Maven2 Plugin ............... SUCCESS [7.201s]
[INFO] Apache CXF Code Generation Maven2 Plugins ............. SUCCESS [7.660s]
[INFO] Apache CXF Test Utilities ............................. SUCCESS [39.403s]
[INFO] Apache CXF Runtime Management ......................... SUCCESS [7.607s]
[INFO] Apache CXF Runtime JMS Transport ...................... SUCCESS [9.643s]
[INFO] Apache CXF Runtime XML Binding ........................ SUCCESS [6.980s]
[INFO] Apache CXF Runtime Local Transport .................... SUCCESS [6.157s]
[INFO] Apache CXF Runtime HTTP Transport ..................... SUCCESS [10.435s]
[INFO] Apache CXF Runtime HTTP Jetty Transport ............... SUCCESS [9.309s]
[INFO] Apache CXF Runtime Simple Frontend .................... SUCCESS [8.386s]
[INFO] Apache CXF Runtime WS Addressing ...................... SUCCESS [8.102s]
[INFO] Apache CXF Runtime JAX-WS Frontend .................... SUCCESS [13.400s]
[INFO] Apache CXF Runtime XmlBeans DataBinding ............... SUCCESS [9.490s]
[INFO] Apache CXF Command Line Tools WSDLTo Test ............. SUCCESS [5.324s]
[INFO] Apache CXF Command Line Tools WSDLTo Misctools ........ SUCCESS [8.479s]
[INFO] Apache CXF Command Line Tools ......................... SUCCESS [2.333s]
[INFO] Apache CXF Command Line Tools WSDLTo .................. SUCCESS [2.197s]
[INFO] Apache CXF Runtime Aegis Databinding .................. SUCCESS [14.003s]
[INFO] Apache CXF Command Line Tools JavaTo WS ............... SUCCESS [15.139s]
[INFO] Apache CXF Command Line Tools JavaTo .................. SUCCESS [2.478s]
[INFO] Apache CXF Runtime SDO DataBinding .................... SUCCESS [10.913s]
[INFO] Apache CXF Runtime JAX-RS Frontend .................... SUCCESS [19.736s]
[INFO] Apache CXF Command Line Tools WADLTo JAXRS Frontend ... SUCCESS [7.394s]
[INFO] Apache CXF Command Line Tools WADLTo .................. SUCCESS [2.585s]
[INFO] Apache CXF Runtime CORBA Binding ...................... SUCCESS [12.876s]
[INFO] Apache CXF Command Line Tools CORBA ................... SUCCESS [13.804s]
[INFO] Apache CXF Runtime JiBX DataBinding ................... SUCCESS [19.367s]
[INFO] Apache CXF Runtime HTTP Binding ....................... SUCCESS [11.587s]
[INFO] Apache CXF Runtime Object Binding ..................... SUCCESS [8.120s]
[INFO] Apache CXF Runtime Colocated Binding .................. SUCCESS [7.268s]
[INFO] Apache CXF Runtime .................................... SUCCESS [3.719s]
[INFO] Apache CXF Runtime Bindings ........................... SUCCESS [3.631s]
[INFO] Apache CXF Runtime JavaScript Frontend ................ SUCCESS [7.092s]
[INFO] Apache CXF Runtime WS Policy .......................... SUCCESS [13.390s]
[INFO] Apache CXF Runtime WS Reliable Messaging .............. SUCCESS [15.584s]
[INFO] Apache CXF Runtime WS MetadataExchange ................ SUCCESS [7.347s]
[INFO] Apache CXF Runtime WS Security ........................ SUCCESS [22.482s]
[INFO] Apache CXF RS XML Security ............................ SUCCESS [8.367s]
[INFO] Apache CXF Runtime RS Security OAuth Parent ........... SUCCESS [2.717s]
[INFO] Apache CXF Runtime OAuth 1.0a ......................... SUCCESS [8.583s]
[INFO] Apache CXF RS Cross-Origin Resource Sharing ........... SUCCESS [7.284s]
[INFO] Apache CXF Runtime Web Management ..................... SUCCESS [54.689s]
[INFO] Apache CXF Runtime JavaScript Client Generator Tests .. SUCCESS [4.617s]
[INFO] Apache CXF JCA Connection ............................. SUCCESS [11.142s]
[INFO] Apache CXF Integration ................................ SUCCESS [2.310s]
[INFO] Apache CXF Java2WS Maven2 Plugin ...................... SUCCESS [8.758s]
[INFO] Apache CXF WADL2Java Code Generation Maven2 Plugin .... SUCCESS [7.941s]
[INFO] Apache CXF CORBA Tools Maven2 Plugins ................. SUCCESS [7.576s]
[INFO] Apache CXF Archetype - Simple JAX-WS Java First ....... SUCCESS [5.322s]
[INFO] Apache CXF Archetype - Simple JAX-RS webapp ........... SUCCESS [4.571s]
[INFO] Apache CXF Maven Archetypes ........................... SUCCESS [2.125s]
[INFO] Apache CXF STS Core ................................... SUCCESS [12.020s]
[INFO] Apache CXF STS war deployment ......................... SUCCESS [17.258s]
[INFO] Apache CXF STS basic systests ......................... SUCCESS [8.516s]
[INFO] Apache CXF STS advanced systests ...................... SUCCESS [8.289s]
[INFO] Apache CXF Services ................................... SUCCESS [2.633s]
[INFO] Apache CXF STS service ................................ SUCCESS [2.186s]
[INFO] Apache CXF STS systests ............................... SUCCESS [2.340s]
[INFO] Apache CXF WSN API .................................... SUCCESS [13.109s]
[INFO] Apache CXF WSN Core ................................... SUCCESS [10.074s]
[INFO] Apache CXF WSN OSGi ................................... SUCCESS [6.833s]
[INFO] Apache CXF WSN service ................................ SUCCESS [1.696s]
[INFO] Apache CXF Karaf Parent ............................... SUCCESS [1.834s]
[INFO] Apache CXF Karaf Features ............................. SUCCESS [2.862s]
[INFO] Apache CXF Karaf Commands ............................. SUCCESS [6.773s]
[INFO] Apache CXF Bundle Parent .............................. SUCCESS [2.644s]
[INFO] Apache CXF Bundle Jar ................................. SUCCESS [2:39.565s]
[INFO] Apache CXF Minimal Bundle Jar ......................... SUCCESS [1:39.253s]
[INFO] Apache CXF JAX-RS Bundle Jar .......................... SUCCESS [56.929s]
[INFO] Apache CXF Container Integration System Tests ......... SUCCESS [3.209s]
[INFO] Apache CXF Container Integration Test Webapp .......... SUCCESS [8.912s]
[INFO] Apache CXF Uncategorized System Tests ................. SUCCESS [19.134s]
[INFO] Apache CXF Transport System Tests ..................... SUCCESS [8.134s]
[INFO] Apache CXF Transport System Tests JMS ................. SUCCESS [11.079s]
[INFO] Apache CXF JAX-WS System Tests ........................ SUCCESS [7.249s]
[INFO] Apache CXF Databinding System Tests ................... SUCCESS [11.354s]
[INFO] Apache CXF JAX-RS System Tests ........................ SUCCESS [17.148s]
[INFO] Apache CXF WS-* Specifications System Tests ........... SUCCESS [7.006s]
[INFO] Apache CXF WS-RM Specifications System Tests .......... SUCCESS [5.237s]
[INFO] Apache CXF WS-Security System Tests ................... SUCCESS [17.017s]
[INFO] Apache CXF WS-Security Interop System Tests ........... SUCCESS [10.711s]
[INFO] Apache CXF JAX-RS System Advanced Security Tests ...... SUCCESS [5.983s]
[INFO] Test for writing wsdl to repo ......................... SUCCESS [11.704s]
[INFO] Test for generating code from wsdl in repo ............ SUCCESS [43.611s]
[INFO] Apache CXF System Tests ............................... SUCCESS [3.057s]
[INFO] Apache CXF System Tests for Maven Plugins ............. SUCCESS [7.463s]
[INFO] Apache CXF Manifest Jar ............................... SUCCESS [5.542s]
[INFO] Apache CXF Samples .................................... SUCCESS [0.959s]
[INFO] Colocated Demo using Document/Literal Style ........... SUCCESS [1.780s]
[INFO] JavaScript Client Demo using Document/Literal Style ... SUCCESS [1.395s]
[INFO] Generated JavaScript Sample using JAX-WS and JSR-181 .. SUCCESS [0.284s]
[INFO] Java First demo service using the JAXWSFactoryBeans ... SUCCESS [0.134s]
[INFO] Java First demo using JAX-WS and JMS .................. SUCCESS [0.239s]
[INFO] JAX-RS Content Negotiation Demo ....................... SUCCESS [0.384s]
[INFO] JAX-RS Basic Demo With HTTPS communications ........... SUCCESS [0.288s]
[INFO] JAX-RS Basic Demo ..................................... SUCCESS [0.225s]
[INFO] CXF sample using a callbak object ..................... SUCCESS [4.016s]
[INFO] WSDL first demo using BARE Style in XML Binding (pure XML over HTTP)  SUCCESS [1.037s]
[INFO] JAX-WS Dispatch/Provider Demo ......................... SUCCESS [4.012s]
[INFO] WSDL first demo using Document/Literal Style and XMLBeans DataBinding  SUCCESS [1.609s]
[INFO] WSDL first demo using SOAP12 in Document/Literal Style  SUCCESS [1.283s]
[INFO] CXF Dynamic Client Sample ............................. SUCCESS [1.316s]
[INFO] JMS Transport Queue Demo using Document-Literal Style . SUCCESS [1.297s]
[INFO] WSDL first demo using the jms transport and jmsConfigFeature  SUCCESS [1.159s]
[INFO] RESTful Hello World Demo .............................. SUCCESS [0.187s]
[INFO] WSDL first demo using Document/Literal Style .......... SUCCESS [3.118s]
[INFO] CXF sample using the Aegis Binding without any webservice  SUCCESS [0.620s]
[INFO] Java First demo using JAX-WS APIs ..................... SUCCESS [1.731s]
[INFO] WS-RM Demo ............................................ SUCCESS [1.796s]
[INFO] CXF Sample of Stream GZIP Interceptor ................. SUCCESS [1.192s]
[INFO] Spring HTTP Sample .................................... SUCCESS [2.212s]
[INFO] Spring HTTP Servlet demo with ruby support ............ SUCCESS [4.325s]
[INFO] Spring HTTP Servlet demo with groovy support .......... SUCCESS [2.614s]
[INFO] Hello world javascript demo ........................... SUCCESS [2.220s]
[INFO] CXF WS-Security UT Demo ............................... SUCCESS [1.133s]
[INFO] WS-Security UT Sign Demo .............................. SUCCESS [1.354s]
[INFO] CXF WS-Security Sign Encoding Demo .................... SUCCESS [1.115s]
[INFO] WS-Security UT Policy Demo ............................ SUCCESS [1.081s]
[INFO] MTOM Demo for SWA and XOP ............................. SUCCESS [1.062s]
[INFO] JAX-WS Asynchronous Demo using Document/Literal Style . SUCCESS [1.214s]
[INFO] Java First POJO Sample ................................ SUCCESS [0.430s]
[INFO] WS-Policy Demo ........................................ SUCCESS [1.046s]
[INFO] Hello World Client Demo using JavaScript .............. SUCCESS [1.150s]
[INFO] WSDL first demo using HTTPS ........................... SUCCESS [1.066s]
[INFO] WS-Addressing Demo .................................... SUCCESS [1.237s]
[INFO] Sample using SOAP Headers ............................. SUCCESS [1.012s]
[INFO] SOAP/JMS Transport Specification Demo using Document-Literal Style  SUCCESS [1.023s]
[INFO] CXF sample using WRAPPED Style in XML Binding (pure XML over HTTP)  SUCCESS [1.126s]
[INFO] RESTful HTTP Binding Demo ............................. SUCCESS [0.284s]
[INFO] CXF sample using code first POJO's and the Aegis Binding  SUCCESS [1.050s]
[INFO] Sample of JAX-* Service Using an Aegis Client ......... SUCCESS [0.156s]
[INFO] JAX-WS Handler Demo ................................... SUCCESS [1.274s]
[INFO] WSDL first demo using RPC-Literal Style ............... SUCCESS [1.208s]
[INFO] JMS Transport Publish/Subscribe Demo using Document-Literal Style  SUCCESS [1.218s]
[INFO] JAX-RS Spring Security Demo ........................... SUCCESS [2.863s]
[INFO] LogBrowser ............................................ SUCCESS [0.224s]
[INFO] WS-Notification Demo .................................. SUCCESS [0.139s]
[INFO] CXF STS Demo .......................................... SUCCESS [2.922s]
[INFO] Bank sample using JAX-WS API's to talk via CORBA/IIOP . SUCCESS [2.417s]
[INFO] Bank sample using JAX-WS API's to talk via CORBA/IIOP . SUCCESS [1.248s]
[INFO] hello-world sample using JAX-WS API's to talk via CORBA/IIOP  SUCCESS [1.131s]
[INFO] Apache CXF Distribution ............................... SUCCESS [5:49.101s]
[INFO] ------------------------------------------------------------------------
[INFO] ------------------------------------------------------------------------
[INFO] BUILD SUCCESSFUL
[INFO] ------------------------------------------------------------------------
[INFO] Total time: 28 minutes 52 seconds
[INFO] Finished at: Tue May 22 06:58:06 UTC 2012
[INFO] Final Memory: 380M/661M
[INFO] ------------------------------------------------------------------------
[locks-and-latches] Releasing all the locks
[locks-and-latches] All the locks released
ERROR: Maven JVM terminated unexpectedly with exit code 0


Mime
View raw message