cxf-notifications mailing list archives

Site index · List index
Message view « Date » · « Thread »
Top « Date » · « Thread »
From Apache Jenkins Server <jenk...@builds.apache.org>
Subject Build failed in Jenkins: CXF-2.5-deploy #72
Date Mon, 23 Apr 2012 06:58:54 GMT
See <https://builds.apache.org/job/CXF-2.5-deploy/72/changes>

Changes:

[ffang] Merged revisions 1329053 via svnmerge from 
https://svn.apache.org/repos/asf/cxf/trunk

........
  r1329053 | ffang | 2012-04-23 12:11:06 +0800 (δΈ€, 23  4 2012) | 1 line
  
  [CXF-4252]cxf:list-endpoints karaf command should also have a busid column
........

[sergeyb] Removing the empty rs package on 2.5.x

[sergeyb] Merged revisions 1328903 via svnmerge from 
https://svn.apache.org/repos/asf/cxf/trunk

........
  r1328903 | sergeyb | 2012-04-22 18:04:47 +0100 (Sun, 22 Apr 2012) | 1 line
  
  [CXF-4256] Reverting the temp test code 
........

[sergeyb] Merged revisions 1328894 via svnmerge from 
https://svn.apache.org/repos/asf/cxf/trunk

........
  r1328894 | sergeyb | 2012-04-22 17:28:17 +0100 (Sun, 22 Apr 2012) | 1 line
  
  [CXF-4256] Some updates to the code generating enum classes
........

[sergeyb] Merged revisions 1328502 via svnmerge from 
https://svn.apache.org/repos/asf/cxf/trunk

........
  r1328502 | sergeyb | 2012-04-20 22:10:33 +0100 (Fri, 20 Apr 2012) | 1 line
  
  [CXF-4256] Adding a simple test
........

[sergeyb] Merged revisions 1328436 via svnmerge from 
https://svn.apache.org/repos/asf/cxf/trunk

........
  r1328436 | sergeyb | 2012-04-20 17:27:28 +0100 (Fri, 20 Apr 2012) | 1 line
  
  [CXF-4256] Updating WADL generator to create better enum classes
........

[sergeyb] Merged revisions 1328322 via svnmerge from 
https://svn.apache.org/repos/asf/cxf/trunk

........
  r1328322 | sergeyb | 2012-04-20 12:11:13 +0100 (Fri, 20 Apr 2012) | 1 line
  
  Minor update to WADL generator to get enum classes generated properly
........

------------------------------------------
[...truncated 19640 lines...]
[WARNING] Parameter tasks is deprecated, use target instead
[INFO] Executing tasks

main:
[INFO] Executed tasks
[INFO] [remote-resources:process {execution: default}]
Apr 23, 2012 6:53:57 AM org.apache.velocity.runtime.log.JdkLogChute log
INFO: FileResourceLoader : adding path '.'
[INFO] [site:attach-descriptor {execution: default-attach-descriptor}]
[INFO] [source:jar-no-fork {execution: attach-sources}]
[INFO] [javadoc:jar {execution: attach-javadocs}]
[INFO] Not executing Javadoc as the project is not a Java classpath-capable package
[INFO] [dependency:unpack {execution: unpack-javadoc}]
[INFO] Configured Artifact: org.apache.cxf:cxf-api:javadoc:2.5.4-SNAPSHOT:jar
> isMarkerOlder:
  artifact1 = <https://builds.apache.org/job/CXF-2.5-deploy/ws/.repository/org/apache/cxf/cxf-api/2.5.4-SNAPSHOT/cxf-api-2.5.4-SNAPSHOT-javadoc.jar>
  marker    = <https://builds.apache.org/job/CXF-2.5-deploy/ws/cxf-2.5.x-fixes/distribution/target/dependency-maven-plugin-markers/org.apache.cxf-cxf-api-jar-javadoc-2.5.4-SNAPSHOT.marker>
    artifact1 lastModified: 1335162850000
    marker lastModified: 1334996482000
< true = marker older than artifact?
[INFO] Unpacking <https://builds.apache.org/job/CXF-2.5-deploy/ws/.repository/org/apache/cxf/cxf-api/2.5.4-SNAPSHOT/cxf-api-2.5.4-SNAPSHOT-javadoc.jar>
to <https://builds.apache.org/job/CXF-2.5-deploy/ws/cxf-2.5.x-fixes/distribution/target/javadoc>
with includes "" and excludes ""
[INFO] [assembly:single {execution: distribution-package-bin}]
[INFO] Reading assembly descriptor: src/main/assembly/bin.xml
[WARNING] Cannot include project artifact: org.apache.cxf:apache-cxf:pom:2.5.4-SNAPSHOT; it
doesn't have an associated file or directory.
[WARNING] Cannot include project artifact: org.apache.cxf:apache-cxf:pom:2.5.4-SNAPSHOT; it
doesn't have an associated file or directory.
[WARNING] Cannot include project artifact: org.apache.cxf:apache-cxf:pom:2.5.4-SNAPSHOT; it
doesn't have an associated file or directory.
[INFO] Copying files to <https://builds.apache.org/job/CXF-2.5-deploy/ws/cxf-2.5.x-fixes/distribution/target/apache-cxf-2.5.4-SNAPSHOT>
[WARNING] Assembly file: <https://builds.apache.org/job/CXF-2.5-deploy/ws/cxf-2.5.x-fixes/distribution/target/apache-cxf-2.5.4-SNAPSHOT>
is not a regular file (it may be a directory). It cannot be attached to the project build
for installation or deployment.
[WARNING] Cannot include project artifact: org.apache.cxf:apache-cxf:pom:2.5.4-SNAPSHOT; it
doesn't have an associated file or directory.
[WARNING] Cannot include project artifact: org.apache.cxf:apache-cxf:pom:2.5.4-SNAPSHOT; it
doesn't have an associated file or directory.
[WARNING] Cannot include project artifact: org.apache.cxf:apache-cxf:pom:2.5.4-SNAPSHOT; it
doesn't have an associated file or directory.
[INFO] Building tar: <https://builds.apache.org/job/CXF-2.5-deploy/ws/cxf-2.5.x-fixes/distribution/target/apache-cxf-2.5.4-SNAPSHOT.tar.gz>
[WARNING] Cannot include project artifact: org.apache.cxf:apache-cxf:pom:2.5.4-SNAPSHOT; it
doesn't have an associated file or directory.
[WARNING] Cannot include project artifact: org.apache.cxf:apache-cxf:pom:2.5.4-SNAPSHOT; it
doesn't have an associated file or directory.
[WARNING] Cannot include project artifact: org.apache.cxf:apache-cxf:pom:2.5.4-SNAPSHOT; it
doesn't have an associated file or directory.
[INFO] Building zip: <https://builds.apache.org/job/CXF-2.5-deploy/ws/cxf-2.5.x-fixes/distribution/target/apache-cxf-2.5.4-SNAPSHOT.zip>
[INFO] [assembly:single {execution: distribution-package-src}]
[INFO] Reading assembly descriptor: src/main/assembly/src.xml
[INFO] Building tar: <https://builds.apache.org/job/CXF-2.5-deploy/ws/cxf-2.5.x-fixes/distribution/target/apache-cxf-2.5.4-SNAPSHOT-src.tar.gz>
[INFO] Building zip: <https://builds.apache.org/job/CXF-2.5-deploy/ws/cxf-2.5.x-fixes/distribution/target/apache-cxf-2.5.4-SNAPSHOT-src.zip>
[INFO] [install:install {execution: default-install}]
[INFO] Installing <https://builds.apache.org/job/CXF-2.5-deploy/ws/cxf-2.5.x-fixes/distribution/pom.xml>
to <https://builds.apache.org/job/CXF-2.5-deploy/ws/.repository/org/apache/cxf/apache-cxf/2.5.4-SNAPSHOT/apache-cxf-2.5.4-SNAPSHOT.pom>
[INFO] Installing <https://builds.apache.org/job/CXF-2.5-deploy/ws/cxf-2.5.x-fixes/distribution/target/apache-cxf-2.5.4-SNAPSHOT.tar.gz>
to <https://builds.apache.org/job/CXF-2.5-deploy/ws/.repository/org/apache/cxf/apache-cxf/2.5.4-SNAPSHOT/apache-cxf-2.5.4-SNAPSHOT.tar.gz>
[INFO] Installing <https://builds.apache.org/job/CXF-2.5-deploy/ws/cxf-2.5.x-fixes/distribution/target/apache-cxf-2.5.4-SNAPSHOT.zip>
to <https://builds.apache.org/job/CXF-2.5-deploy/ws/.repository/org/apache/cxf/apache-cxf/2.5.4-SNAPSHOT/apache-cxf-2.5.4-SNAPSHOT.zip>
[INFO] Installing <https://builds.apache.org/job/CXF-2.5-deploy/ws/cxf-2.5.x-fixes/distribution/target/apache-cxf-2.5.4-SNAPSHOT-src.tar.gz>
to <https://builds.apache.org/job/CXF-2.5-deploy/ws/.repository/org/apache/cxf/apache-cxf/2.5.4-SNAPSHOT/apache-cxf-2.5.4-SNAPSHOT-src.tar.gz>
[INFO] Installing <https://builds.apache.org/job/CXF-2.5-deploy/ws/cxf-2.5.x-fixes/distribution/target/apache-cxf-2.5.4-SNAPSHOT-src.zip>
to <https://builds.apache.org/job/CXF-2.5-deploy/ws/.repository/org/apache/cxf/apache-cxf/2.5.4-SNAPSHOT/apache-cxf-2.5.4-SNAPSHOT-src.zip>
[INFO] [deploy:deploy {execution: default-deploy}]
[INFO] Retrieving previous build number from apache.snapshots.https
[WARNING] *** CHECKSUM FAILED - Checksum failed on download: local = 'd363062d09811d65202df2f66919a116722e4b73';
remote = '679f443120c99eea64eb153e9b2d69be98b0e59c' - RETRYING
[WARNING] *** CHECKSUM FAILED - Checksum failed on download: local = 'd363062d09811d65202df2f66919a116722e4b73';
remote = '679f443120c99eea64eb153e9b2d69be98b0e59c' - IGNORING
Uploading: https://repository.apache.org/content/repositories/snapshots/org/apache/cxf/apache-cxf/2.5.4-SNAPSHOT/apache-cxf-2.5.4-20120423.063320-6.pom
21K uploaded  (apache-cxf-2.5.4-20120423.063320-6.pom)
[INFO] Retrieving previous metadata from apache.snapshots.https
[WARNING] *** CHECKSUM FAILED - Checksum failed on download: local = 'd363062d09811d65202df2f66919a116722e4b73';
remote = '679f443120c99eea64eb153e9b2d69be98b0e59c' - RETRYING
[WARNING] *** CHECKSUM FAILED - Checksum failed on download: local = 'd363062d09811d65202df2f66919a116722e4b73';
remote = '679f443120c99eea64eb153e9b2d69be98b0e59c' - IGNORING
[INFO] Uploading repository metadata for: 'snapshot org.apache.cxf:apache-cxf:2.5.4-SNAPSHOT'
[INFO] Retrieving previous metadata from apache.snapshots.https
[INFO] Uploading repository metadata for: 'artifact org.apache.cxf:apache-cxf'
[INFO] Retrieving previous build number from apache.snapshots.https
Uploading: https://repository.apache.org/content/repositories/snapshots/org/apache/cxf/apache-cxf/2.5.4-SNAPSHOT/apache-cxf-2.5.4-20120423.063320-6.tar.gz
34263K uploaded  (apache-cxf-2.5.4-20120423.063320-6.tar.gz)
[INFO] Retrieving previous build number from apache.snapshots.https
Uploading: https://repository.apache.org/content/repositories/snapshots/org/apache/cxf/apache-cxf/2.5.4-SNAPSHOT/apache-cxf-2.5.4-20120423.063320-6.zip
36070K uploaded  (apache-cxf-2.5.4-20120423.063320-6.zip)
[INFO] Retrieving previous build number from apache.snapshots.https
Uploading: https://repository.apache.org/content/repositories/snapshots/org/apache/cxf/apache-cxf/2.5.4-SNAPSHOT/apache-cxf-2.5.4-20120423.063320-6-src.tar.gz
6305K uploaded  (apache-cxf-2.5.4-20120423.063320-6-src.tar.gz)
[INFO] Retrieving previous build number from apache.snapshots.https
Uploading: https://repository.apache.org/content/repositories/snapshots/org/apache/cxf/apache-cxf/2.5.4-SNAPSHOT/apache-cxf-2.5.4-20120423.063320-6-src.zip
14062K uploaded  (apache-cxf-2.5.4-20120423.063320-6-src.zip)
[INFO] 
[INFO] 
[INFO] ------------------------------------------------------------------------
[INFO] Reactor Summary:
[INFO] ------------------------------------------------------------------------
[INFO] Apache CXF ............................................ SUCCESS [12.127s]
[INFO] Apache CXF Parent ..................................... SUCCESS [3.531s]
[INFO] Apache CXF Common Utilities ........................... SUCCESS [15.747s]
[INFO] Apache CXF API ........................................ SUCCESS [27.832s]
[INFO] Apache CXF Woodstox/MSV Schema Validation ............. SUCCESS [6.253s]
[INFO] Apache CXF XML Schema Validation with Xerces .......... SUCCESS [6.313s]
[INFO] Apache CXF Common ..................................... SUCCESS [2.708s]
[INFO] Apache CXF Runtime Core ............................... SUCCESS [14.665s]
[INFO] Apache CXF Command Line Tools Common .................. SUCCESS [9.338s]
[INFO] Apache CXF Command Line Tools Validator ............... SUCCESS [6.472s]
[INFO] Apache CXF Command Line Tools WSDLTo Core ............. SUCCESS [8.438s]
[INFO] Apache CXF Command Line Tools WSDLTo JAXWS Frontend ... SUCCESS [8.088s]
[INFO] Apache CXF Runtime JAXB DataBinding ................... SUCCESS [7.869s]
[INFO] Apache CXF Runtime SOAP Binding ....................... SUCCESS [9.559s]
[INFO] Apache CXF Runtime JavaScript Client Generator Projects  SUCCESS [2.070s]
[INFO] Apache CXF Runtime JavaScript Client Generator ........ SUCCESS [9.300s]
[INFO] Apache CXF Command Line Tools WSDL to JavaScript Front End  SUCCESS [6.306s]
[INFO] Apache CXF Command Line Tools WSDLTo JAXB Databinding . SUCCESS [6.426s]
[INFO] Apache CXF Runtime Transport Common Used Classes ...... SUCCESS [5.772s]
[INFO] Apache CXF Maven Plugins .............................. SUCCESS [2.322s]
[INFO] Apache CXF WSDL Validator Maven2 Plugin ............... SUCCESS [7.419s]
[INFO] Apache CXF Code Generation Maven2 Plugins ............. SUCCESS [7.875s]
[INFO] Apache CXF Test Utilities ............................. SUCCESS [37.738s]
[INFO] Apache CXF Runtime Management ......................... SUCCESS [9.936s]
[INFO] Apache CXF Runtime JMS Transport ...................... SUCCESS [10.173s]
[INFO] Apache CXF Runtime XML Binding ........................ SUCCESS [7.589s]
[INFO] Apache CXF Runtime Local Transport .................... SUCCESS [6.320s]
[INFO] Apache CXF Runtime HTTP Transport ..................... SUCCESS [10.575s]
[INFO] Apache CXF Runtime HTTP Jetty Transport ............... SUCCESS [8.424s]
[INFO] Apache CXF Runtime Simple Frontend .................... SUCCESS [8.195s]
[INFO] Apache CXF Runtime WS Addressing ...................... SUCCESS [9.422s]
[INFO] Apache CXF Runtime JAX-WS Frontend .................... SUCCESS [15.510s]
[INFO] Apache CXF Runtime XmlBeans DataBinding ............... SUCCESS [11.107s]
[INFO] Apache CXF Command Line Tools WSDLTo Test ............. SUCCESS [5.880s]
[INFO] Apache CXF Command Line Tools WSDLTo Misctools ........ SUCCESS [8.059s]
[INFO] Apache CXF Command Line Tools ......................... SUCCESS [1.888s]
[INFO] Apache CXF Command Line Tools WSDLTo .................. SUCCESS [2.227s]
[INFO] Apache CXF Runtime Aegis Databinding .................. SUCCESS [12.217s]
[INFO] Apache CXF Command Line Tools JavaTo WS ............... SUCCESS [13.299s]
[INFO] Apache CXF Command Line Tools JavaTo .................. SUCCESS [2.165s]
[INFO] Apache CXF Runtime SDO DataBinding .................... SUCCESS [6.756s]
[INFO] Apache CXF Runtime JAX-RS Frontend .................... SUCCESS [15.202s]
[INFO] Apache CXF Command Line Tools WADLTo JAXRS Frontend ... SUCCESS [8.014s]
[INFO] Apache CXF Command Line Tools WADLTo .................. SUCCESS [1.794s]
[INFO] Apache CXF Runtime CORBA Binding ...................... SUCCESS [12.525s]
[INFO] Apache CXF Command Line Tools CORBA ................... SUCCESS [13.502s]
[INFO] Apache CXF Runtime JiBX DataBinding ................... SUCCESS [9.004s]
[INFO] Apache CXF Runtime HTTP Binding ....................... SUCCESS [6.917s]
[INFO] Apache CXF Runtime Object Binding ..................... SUCCESS [7.294s]
[INFO] Apache CXF Runtime Colocated Binding .................. SUCCESS [6.553s]
[INFO] Apache CXF Runtime .................................... SUCCESS [2.486s]
[INFO] Apache CXF Runtime Bindings ........................... SUCCESS [2.363s]
[INFO] Apache CXF Runtime JavaScript Frontend ................ SUCCESS [6.894s]
[INFO] Apache CXF Runtime WS Policy .......................... SUCCESS [12.065s]
[INFO] Apache CXF Runtime WS Reliable Messaging .............. SUCCESS [13.608s]
[INFO] Apache CXF Runtime WS MetadataExchange ................ SUCCESS [7.565s]
[INFO] Apache CXF Runtime WS Security ........................ SUCCESS [19.192s]
[INFO] Apache CXF RS XML Security ............................ SUCCESS [8.558s]
[INFO] Apache CXF Runtime RS Security OAuth Parent ........... SUCCESS [2.567s]
[INFO] Apache CXF Runtime OAuth 1.0a ......................... SUCCESS [10.746s]
[INFO] Apache CXF RS Cross-Origin Resource Sharing ........... SUCCESS [8.284s]
[INFO] Apache CXF Runtime Web Management ..................... SUCCESS [15.967s]
[INFO] Apache CXF Runtime JavaScript Client Generator Tests .. SUCCESS [4.888s]
[INFO] Apache CXF JCA Connection ............................. SUCCESS [9.199s]
[INFO] Apache CXF Integration ................................ SUCCESS [1.759s]
[INFO] Apache CXF Java2WS Maven2 Plugin ...................... SUCCESS [7.396s]
[INFO] Apache CXF WADL2Java Code Generation Maven2 Plugin .... SUCCESS [7.801s]
[INFO] Apache CXF CORBA Tools Maven2 Plugins ................. SUCCESS [7.320s]
[INFO] Apache CXF Archetype - Simple JAX-WS Java First ....... SUCCESS [5.609s]
[INFO] Apache CXF Archetype - Simple JAX-RS webapp ........... SUCCESS [3.726s]
[INFO] Apache CXF Maven Archetypes ........................... SUCCESS [2.046s]
[INFO] Apache CXF STS Core ................................... SUCCESS [12.965s]
[INFO] Apache CXF STS war deployment ......................... SUCCESS [12.122s]
[INFO] Apache CXF STS basic systests ......................... SUCCESS [10.796s]
[INFO] Apache CXF STS advanced systests ...................... SUCCESS [6.889s]
[INFO] Apache CXF Services ................................... SUCCESS [2.638s]
[INFO] Apache CXF STS service ................................ SUCCESS [4.717s]
[INFO] Apache CXF STS systests ............................... SUCCESS [2.586s]
[INFO] Apache CXF WSN API .................................... SUCCESS [15.607s]
[INFO] Apache CXF WSN Core ................................... SUCCESS [9.460s]
[INFO] Apache CXF WSN OSGi ................................... SUCCESS [7.016s]
[INFO] Apache CXF WSN service ................................ SUCCESS [2.396s]
[INFO] Apache CXF Karaf Parent ............................... SUCCESS [2.132s]
[INFO] Apache CXF Karaf Features ............................. SUCCESS [3.293s]
[INFO] Apache CXF Karaf Commands ............................. SUCCESS [6.522s]
[INFO] Apache CXF Bundle Parent .............................. SUCCESS [2.302s]
[INFO] Apache CXF Bundle Jar ................................. SUCCESS [2:24.472s]
[INFO] Apache CXF Minimal Bundle Jar ......................... SUCCESS [1:33.069s]
[INFO] Apache CXF JAX-RS Bundle Jar .......................... SUCCESS [53.329s]
[INFO] Apache CXF Container Integration System Tests ......... SUCCESS [2.943s]
[INFO] Apache CXF Container Integration Test Webapp .......... SUCCESS [8.771s]
[INFO] Apache CXF Uncategorized System Tests ................. SUCCESS [8.700s]
[INFO] Apache CXF Transport System Tests ..................... SUCCESS [8.224s]
[INFO] Apache CXF Transport System Tests JMS ................. SUCCESS [7.849s]
[INFO] Apache CXF JAX-WS System Tests ........................ SUCCESS [8.727s]
[INFO] Apache CXF Databinding System Tests ................... SUCCESS [13.179s]
[INFO] Apache CXF JAX-RS System Tests ........................ SUCCESS [10.976s]
[INFO] Apache CXF WS-* Specifications System Tests ........... SUCCESS [6.623s]
[INFO] Apache CXF WS-RM Specifications System Tests .......... SUCCESS [5.136s]
[INFO] Apache CXF WS-Security System Tests ................... SUCCESS [10.376s]
[INFO] Apache CXF WS-Security Interop System Tests ........... SUCCESS [10.432s]
[INFO] Apache CXF JAX-RS System Advanced Security Tests ...... SUCCESS [5.916s]
[INFO] Test for writing wsdl to repo ......................... SUCCESS [10.162s]
[INFO] Test for generating code from wsdl in repo ............ SUCCESS [39.660s]
[INFO] Apache CXF System Tests ............................... SUCCESS [2.524s]
[INFO] Apache CXF System Tests for Maven Plugins ............. SUCCESS [5.419s]
[INFO] Apache CXF Manifest Jar ............................... SUCCESS [5.900s]
[INFO] Apache CXF Samples .................................... SUCCESS [1.175s]
[INFO] Colocated Demo using Document/Literal Style ........... SUCCESS [1.947s]
[INFO] JavaScript Client Demo using Document/Literal Style ... SUCCESS [1.274s]
[INFO] Generated JavaScript Sample using JAX-WS and JSR-181 .. SUCCESS [0.232s]
[INFO] Java First demo service using the JAXWSFactoryBeans ... SUCCESS [0.170s]
[INFO] Java First demo using JAX-WS and JMS .................. SUCCESS [0.185s]
[INFO] JAX-RS Content Negotiation Demo ....................... SUCCESS [0.211s]
[INFO] JAX-RS Basic Demo With HTTPS communications ........... SUCCESS [0.155s]
[INFO] JAX-RS Basic Demo ..................................... SUCCESS [0.205s]
[INFO] CXF sample using a callbak object ..................... SUCCESS [3.638s]
[INFO] WSDL first demo using BARE Style in XML Binding (pure XML over HTTP)  SUCCESS [1.171s]
[INFO] JAX-WS Dispatch/Provider Demo ......................... SUCCESS [3.629s]
[INFO] WSDL first demo using Document/Literal Style and XMLBeans DataBinding  SUCCESS [1.187s]
[INFO] WSDL first demo using SOAP12 in Document/Literal Style  SUCCESS [0.909s]
[INFO] CXF Dynamic Client Sample ............................. SUCCESS [1.045s]
[INFO] JMS Transport Queue Demo using Document-Literal Style . SUCCESS [1.045s]
[INFO] WSDL first demo using the jms transport and jmsConfigFeature  SUCCESS [1.204s]
[INFO] RESTful Hello World Demo .............................. SUCCESS [0.194s]
[INFO] WSDL first demo using Document/Literal Style .......... SUCCESS [3.253s]
[INFO] CXF sample using the Aegis Binding without any webservice  SUCCESS [0.259s]
[INFO] Java First demo using JAX-WS APIs ..................... SUCCESS [2.145s]
[INFO] WS-RM Demo ............................................ SUCCESS [1.172s]
[INFO] CXF Sample of Stream GZIP Interceptor ................. SUCCESS [1.005s]
[INFO] Spring HTTP Sample .................................... SUCCESS [1.734s]
[INFO] Spring HTTP Servlet demo with ruby support ............ SUCCESS [3.833s]
[INFO] Spring HTTP Servlet demo with groovy support .......... SUCCESS [3.247s]
[INFO] Hello world javascript demo ........................... SUCCESS [2.349s]
[INFO] CXF WS-Security UT Demo ............................... SUCCESS [1.184s]
[INFO] WS-Security UT Sign Demo .............................. SUCCESS [0.990s]
[INFO] CXF WS-Security Sign Encoding Demo .................... SUCCESS [0.984s]
[INFO] WS-Security UT Policy Demo ............................ SUCCESS [1.184s]
[INFO] MTOM Demo for SWA and XOP ............................. SUCCESS [0.979s]
[INFO] JAX-WS Asynchronous Demo using Document/Literal Style . SUCCESS [0.932s]
[INFO] Java First POJO Sample ................................ SUCCESS [0.219s]
[INFO] WS-Policy Demo ........................................ SUCCESS [0.977s]
[INFO] Hello World Client Demo using JavaScript .............. SUCCESS [1.125s]
[INFO] WSDL first demo using HTTPS ........................... SUCCESS [1.065s]
[INFO] WS-Addressing Demo .................................... SUCCESS [0.978s]
[INFO] Sample using SOAP Headers ............................. SUCCESS [0.970s]
[INFO] SOAP/JMS Transport Specification Demo using Document-Literal Style  SUCCESS [1.121s]
[INFO] CXF sample using WRAPPED Style in XML Binding (pure XML over HTTP)  SUCCESS [0.999s]
[INFO] RESTful HTTP Binding Demo ............................. SUCCESS [0.189s]
[INFO] CXF sample using code first POJO's and the Aegis Binding  SUCCESS [0.598s]
[INFO] Sample of JAX-* Service Using an Aegis Client ......... SUCCESS [0.159s]
[INFO] JAX-WS Handler Demo ................................... SUCCESS [0.974s]
[INFO] WSDL first demo using RPC-Literal Style ............... SUCCESS [0.933s]
[INFO] JMS Transport Publish/Subscribe Demo using Document-Literal Style  SUCCESS [1.155s]
[INFO] JAX-RS Spring Security Demo ........................... SUCCESS [2.057s]
[INFO] LogBrowser ............................................ SUCCESS [0.134s]
[INFO] WS-Notification Demo .................................. SUCCESS [0.207s]
[INFO] CXF STS Demo .......................................... SUCCESS [2.765s]
[INFO] Bank sample using JAX-WS API's to talk via CORBA/IIOP . SUCCESS [0.968s]
[INFO] Bank sample using JAX-WS API's to talk via CORBA/IIOP . SUCCESS [1.185s]
[INFO] hello-world sample using JAX-WS API's to talk via CORBA/IIOP  SUCCESS [1.211s]
[INFO] Apache CXF Distribution ............................... SUCCESS [4:55.307s]
[INFO] ------------------------------------------------------------------------
[INFO] ------------------------------------------------------------------------
[INFO] BUILD SUCCESSFUL
[INFO] ------------------------------------------------------------------------
[INFO] Total time: 25 minutes 43 seconds
[INFO] Finished at: Mon Apr 23 06:58:51 UTC 2012
[INFO] Final Memory: 365M/918M
[INFO] ------------------------------------------------------------------------
[locks-and-latches] Releasing all the locks
[locks-and-latches] All the locks released
ERROR: Maven JVM terminated unexpectedly with exit code 0


Mime
View raw message