cxf-notifications mailing list archives

Site index · List index
Message view « Date » · « Thread »
Top « Date » · « Thread »
From Apache Jenkins Server <jenk...@builds.apache.org>
Subject Build failed in Jenkins: CXF-trunk-deploy #839
Date Fri, 06 Apr 2012 11:33:51 GMT
See <https://builds.apache.org/job/CXF-trunk-deploy/839/changes>

Changes:

[coheigea] Added in functionality to prevent the renewal of a token that is "overly" expired

[coheigea] Added in some realm tests for renewing tokens

[coheigea] Added in some Lifetime unit tests for renewing SAML tokens.

------------------------------------------
[...truncated 20068 lines...]
[INFO] [INFO] Tests are skipped.

[INFO] --- maven-surefire-plugin:2.7.2:test (default-test) @ jms_queue ---
[INFO] 
[INFO] --- maven-jar-plugin:2.3.1:jar (default-jar) @ jms_queue ---
[INFO] Building jar: <https://builds.apache.org/job/CXF-trunk-deploy/ws/trunk/distribution/src/main/release/samples/jms_queue/target/jms_queue-2.6.0-SNAPSHOT.jar>
[INFO] [INFO] Installing <https://builds.apache.org/job/CXF-trunk-deploy/ws/trunk/distribution/src/main/release/samples/jms_queue/target/jms_queue-2.6.0-SNAPSHOT.jar>
to /home/jenkins/jenkins-slave/maven-repositories/0/org/apache/cxf/samples/jms_queue/2.6.0-SNAPSHOT/jms_queue-2.6.0-SNAPSHOT.jar
[INFO] Installing <https://builds.apache.org/job/CXF-trunk-deploy/ws/trunk/distribution/src/main/release/samples/jms_queue/pom.xml>
to /home/jenkins/jenkins-slave/maven-repositories/0/org/apache/cxf/samples/jms_queue/2.6.0-SNAPSHOT/jms_queue-2.6.0-SNAPSHOT.pom

[INFO] --- maven-install-plugin:2.3.1:install (default-install) @ jms_queue ---
[INFO] [INFO] Skipping artifact deployment

[INFO] --- maven-deploy-plugin:2.5:deploy (default-deploy) @ jms_queue ---
[JENKINS] Archiving <https://builds.apache.org/job/CXF-trunk-deploy/ws/trunk/distribution/src/main/release/samples/jms_queue/pom.xml>
to /home/hudson/hudson/jobs/CXF-trunk-deploy/modules/org.apache.cxf.samples$jms_queue/builds/2012-04-06_11-11-44/archive/org.apache.cxf.samples/jms_queue/2.6.0-SNAPSHOT/jms_queue-2.6.0-SNAPSHOT.pom
[JENKINS] Archiving <https://builds.apache.org/job/CXF-trunk-deploy/ws/trunk/distribution/src/main/release/samples/jms_queue/target/jms_queue-2.6.0-SNAPSHOT.jar>
to /home/hudson/hudson/jobs/CXF-trunk-deploy/modules/org.apache.cxf.samples$jms_queue/builds/2012-04-06_11-11-44/archive/org.apache.cxf.samples/jms_queue/2.6.0-SNAPSHOT/jms_queue-2.6.0-SNAPSHOT.jar
[INFO]                                                                         
[INFO] ------------------------------------------------------------------------
[INFO] Building WSDL first demo using the jms transport and jmsConfigFeature 2.6.0-SNAPSHOT
[INFO] ------------------------------------------------------------------------
[WARNING] The POM for org.apache.cxf.xjc-utils:cxf-xjc-runtime:jar:2.4.1-SNAPSHOT is missing,
no dependency information available
[JENKINS] Archiving <https://builds.apache.org/job/CXF-trunk-deploy/ws/trunk/distribution/src/main/release/samples/jms_spring_config/pom.xml>
to /home/hudson/hudson/jobs/CXF-trunk-deploy/modules/org.apache.cxf.samples$jms_spring_config/builds/2012-04-06_11-11-44/archive/org.apache.cxf.samples/jms_spring_config/2.6.0-SNAPSHOT/jms_spring_config-2.6.0-SNAPSHOT.pom
[INFO] ------------------------------------------------------------------------
[INFO] Reactor Summary:
[INFO] 
[INFO] Apache CXF ........................................ SUCCESS [6.623s]
[INFO] Apache CXF Parent ................................. SUCCESS [1.626s]
[INFO] Apache CXF API .................................... SUCCESS [30.754s]
[INFO] Apache CXF Woodstox/MSV Schema Validation ......... SUCCESS [4.105s]
[INFO] Apache CXF XML Schema Validation with Xerces ...... SUCCESS [3.877s]
[INFO] Apache CXF Common ................................. SUCCESS [0.751s]
[INFO] Apache CXF Runtime Core ........................... SUCCESS [10.703s]
[INFO] Apache CXF Command Line Tools Common .............. SUCCESS [7.662s]
[INFO] Apache CXF Runtime JAXB DataBinding ............... SUCCESS [6.652s]
[INFO] Apache CXF Runtime SOAP Binding ................... SUCCESS [8.142s]
[INFO] Apache CXF Command Line Tools Validator ........... SUCCESS [5.744s]
[INFO] Apache CXF Command Line Tools WSDLTo Core ......... SUCCESS [6.093s]
[INFO] Apache CXF Command Line Tools WSDLTo JAXWS Frontend  SUCCESS [7.447s]
[INFO] Apache CXF Runtime JavaScript Client Generator Projects  SUCCESS [1.093s]
[INFO] Apache CXF Runtime JavaScript Client Generator .... SUCCESS [5.268s]
[INFO] Apache CXF Command Line Tools WSDL to JavaScript Front End  SUCCESS [4.667s]
[INFO] Apache CXF Command Line Tools WSDLTo JAXB Databinding  SUCCESS [4.784s]
[INFO] Apache CXF Maven Plugins .......................... SUCCESS [1.228s]
[INFO] Apache CXF WSDL Validator Maven2 Plugin ........... SUCCESS [4.258s]
[INFO] Apache CXF Code Generation Maven2 Plugins ......... SUCCESS [5.899s]
[INFO] Apache CXF Test Utilities ......................... SUCCESS [43.844s]
[INFO] Apache CXF Runtime Management ..................... SUCCESS [6.960s]
[INFO] Apache CXF Runtime JMS Transport .................. SUCCESS [9.342s]
[INFO] Apache CXF Runtime XML Binding .................... SUCCESS [5.706s]
[INFO] Apache CXF Runtime Local Transport ................ SUCCESS [4.527s]
[INFO] Apache CXF Runtime WS Policy ...................... SUCCESS [14.304s]
[INFO] Apache CXF Runtime HTTP Transport ................. SUCCESS [9.194s]
[INFO] Apache CXF Runtime HTTP Jetty Transport ........... SUCCESS [7.303s]
[INFO] Apache CXF Runtime Simple Frontend ................ SUCCESS [6.413s]
[INFO] Apache CXF Runtime WS Addressing .................. SUCCESS [6.210s]
[INFO] Apache CXF Runtime JAX-WS Frontend ................ SUCCESS [13.900s]
[INFO] Apache CXF Runtime XmlBeans DataBinding ........... SUCCESS [11.176s]
[INFO] Apache CXF Command Line Tools WSDLTo Test ......... SUCCESS [3.525s]
[INFO] Apache CXF Command Line Tools WSDLTo Misctools .... SUCCESS [5.391s]
[INFO] Apache CXF Command Line Tools ..................... SUCCESS [0.817s]
[INFO] Apache CXF Command Line Tools WSDLTo .............. SUCCESS [0.774s]
[INFO] Apache CXF Runtime Aegis Databinding .............. SUCCESS [12.394s]
[INFO] Apache CXF Command Line Tools JavaTo WS ........... SUCCESS [11.971s]
[INFO] Apache CXF Command Line Tools JavaTo .............. SUCCESS [1.189s]
[INFO] Apache CXF Runtime JAX-RS Frontend ................ SUCCESS [14.695s]
[INFO] Apache CXF Command Line Tools WADLTo JAXRS Frontend  SUCCESS [5.974s]
[INFO] Apache CXF Command Line Tools WADLTo .............. SUCCESS [0.765s]
[INFO] Apache CXF Runtime CORBA Binding .................. SUCCESS [10.573s]
[INFO] Apache CXF Command Line Tools CORBA ............... SUCCESS [12.459s]
[INFO] Apache CXF Runtime SDO DataBinding ................ SUCCESS [11.168s]
[INFO] Apache CXF Runtime JiBX DataBinding ............... SUCCESS [33.174s]
[INFO] Apache CXF Runtime Object Binding ................. SUCCESS [5.354s]
[INFO] Apache CXF Runtime Colocated Binding .............. SUCCESS [5.359s]
[INFO] Apache CXF Runtime ................................ SUCCESS [0.687s]
[INFO] Apache CXF Runtime Bindings ....................... SUCCESS [0.985s]
[INFO] Apache CXF Runtime Clustering ..................... SUCCESS [5.453s]
[INFO] Apache CXF Runtime JavaScript Frontend ............ SUCCESS [4.870s]
[INFO] Apache CXF Runtime WS Reliable Messaging .......... SUCCESS [12.784s]
[INFO] Apache CXF Runtime WS MetadataExchange ............ SUCCESS [5.769s]
[INFO] Apache CXF Runtime WS Security .................... SUCCESS [18.279s]
[INFO] Apache CXF JAX-RS Extensions: Providers ........... SUCCESS [7.309s]
[INFO] Apache CXF JAX-RS Extensions: Search .............. SUCCESS [6.488s]
[INFO] Apache CXF RS XML Security ........................ SUCCESS [7.248s]
[INFO] Apache CXF Runtime RS Security OAuth Parent ....... SUCCESS [1.218s]
[INFO] Apache CXF Runtime OAuth 1.0a ..................... SUCCESS [10.113s]
[INFO] Apache CXF Runtime OAuth 2.0 ...................... SUCCESS [6.638s]
[INFO] Apache CXF RS Cross-Origin Resource Sharing ....... SUCCESS [4.747s]
[INFO] Apache CXF Runtime Web Management ................. SUCCESS [37.642s]
[INFO] Apache CXF Runtime JavaScript Client Generator Tests  SUCCESS [3.643s]
[INFO] Apache CXF JCA Connection ......................... SUCCESS [7.844s]
[INFO] Apache CXF Integration ............................ SUCCESS [0.761s]
[INFO] Apache CXF Java2WS Maven2 Plugin .................. SUCCESS [4.663s]
[INFO] Apache CXF WADL2Java Code Generation Maven2 Plugin  SUCCESS [5.756s]
[INFO] Apache CXF CORBA Tools Maven2 Plugins ............. SUCCESS [4.887s]
[INFO] Apache CXF Archetype - Simple JAX-WS Java First ... SUCCESS [3.638s]
[INFO] Apache CXF Archetype - Simple JAX-RS webapp ....... SUCCESS [2.257s]
[INFO] Apache CXF Maven Archetypes ....................... SUCCESS [0.980s]
[INFO] Apache CXF STS Core ............................... SUCCESS [17.172s]
[INFO] Apache CXF STS war deployment ..................... SUCCESS [11.226s]
[INFO] Apache CXF STS basic systests ..................... SUCCESS [8.376s]
[INFO] Apache CXF STS advanced systests .................. SUCCESS [6.817s]
[INFO] Apache CXF Runtime ................................ SUCCESS [0.851s]
[INFO] Apache CXF STS service ............................ SUCCESS [2.251s]
[INFO] Apache CXF STS systests ........................... SUCCESS [0.747s]
[INFO] Apache CXF WSN API ................................ SUCCESS [19.280s]
[INFO] Apache CXF WSN Core ............................... SUCCESS [11.930s]
[INFO] Apache CXF WSN OSGi ............................... SUCCESS [8.269s]
[INFO] Apache CXF WSN service ............................ SUCCESS [0.756s]
[INFO] Apache CXF Karaf Parent ........................... SUCCESS [0.874s]
[INFO] Apache CXF Karaf Features ......................... SUCCESS [1.789s]
[INFO] Apache CXF Karaf Commands ......................... SUCCESS [7.792s]
[INFO] Apache CXF Bundle Parent .......................... SUCCESS [1.311s]
[INFO] Apache CXF Bundle Jar ............................. SUCCESS [1:47.815s]
[INFO] Apache CXF Minimal Bundle Jar ..................... SUCCESS [1:12.141s]
[INFO] Apache CXF JAX-RS Bundle Jar ...................... SUCCESS [38.518s]
[INFO] Apache CXF Compatibility Bundle Jar ............... SUCCESS [1:05.792s]
[INFO] Apache CXF Container Integration System Tests ..... SUCCESS [1.319s]
[INFO] Apache CXF Container Integration Test Webapp ...... SUCCESS [5.554s]
[INFO] Apache CXF Uncategorized System Tests ............. SUCCESS [17.904s]
[INFO] Apache CXF Transport System Tests ................. SUCCESS [6.025s]
[INFO] Apache CXF Transport System Tests JMS ............. SUCCESS [7.835s]
[INFO] Apache CXF JAX-WS System Tests .................... SUCCESS [9.534s]
[INFO] Apache CXF Databinding System Tests ............... SUCCESS [1:05.546s]
[INFO] Apache CXF JAX-RS System Tests .................... SUCCESS [15.859s]
[INFO] Apache CXF WS-* Specifications System Tests ....... SUCCESS [8.539s]
[INFO] Apache CXF WS-RM Specifications System Tests ...... SUCCESS [4.149s]
[INFO] Apache CXF WS-Security System Tests ............... SUCCESS [12.600s]
[INFO] Apache CXF WS-Security Interop System Tests ....... SUCCESS [9.479s]
[INFO] Apache CXF JAX-RS System Advanced Security Tests .. SUCCESS [6.472s]
[INFO] Test for writing wsdl to repo ..................... SUCCESS [7.015s]
[INFO] Test for generating code from wsdl in repo ........ SUCCESS [10.282s]
[INFO] Apache CXF System Tests ........................... SUCCESS [0.914s]
[INFO] Apache CXF System Tests for Maven Plugins ......... SUCCESS [1.141s]
[INFO] Apache CXF Manifest Jar ........................... SUCCESS [32.814s]
[INFO] Apache CXF Samples ................................ SUCCESS [0.213s]
[INFO] Colocated Demo using Document/Literal Style ....... SUCCESS [4.020s]
[INFO] JavaScript Client Demo using Document/Literal Style  SUCCESS [2.522s]
[INFO] Generated JavaScript Sample using JAX-WS and JSR-181  SUCCESS [1.286s]
[INFO] Java First demo service using the JAXWSFactoryBeans  SUCCESS [1.049s]
[INFO] Java First demo using JAX-WS and JMS .............. SUCCESS [1.261s]
[INFO] JAX-RS Content Negotiation Demo ................... SUCCESS [1.055s]
[INFO] JAX-RS Basic Demo With HTTPS communications ....... SUCCESS [1.176s]
[INFO] JAX-RS Basic Demo ................................. SUCCESS [1.209s]
[INFO] CXF sample using a callbak object ................. SUCCESS [3.596s]
[INFO] WSDL first demo using BARE Style in XML Binding (pure XML over HTTP)  SUCCESS [2.385s]
[INFO] JAX-WS Dispatch/Provider Demo ..................... SUCCESS [4.646s]
[INFO] WSDL first demo using Document/Literal Style and XMLBeans DataBinding  SUCCESS [4.343s]
[INFO] WSDL first demo using SOAP12 in Document/Literal Style  SUCCESS [2.318s]
[INFO] CXF Dynamic Client Sample ......................... SUCCESS [2.862s]
[INFO] JMS Transport Queue Demo using Document-Literal Style  SUCCESS [2.659s]
[INFO] WSDL first demo using the jms transport and jmsConfigFeature  FAILURE [0.059s]
[INFO] RESTful Hello World Demo .......................... SKIPPED
[INFO] WSDL first demo using Document/Literal Style ...... SKIPPED
[INFO] CXF sample using the Aegis Binding without any webservice  SKIPPED
[INFO] Java First demo using JAX-WS APIs ................. SKIPPED
[INFO] WS-RM Demo ........................................ SKIPPED
[INFO] CXF Sample of Stream GZIP Interceptor ............. SKIPPED
[INFO] Spring HTTP Sample ................................ SKIPPED
[INFO] Spring HTTP Servlet demo with ruby support ........ SKIPPED
[INFO] Spring HTTP Servlet demo with groovy support ...... SKIPPED
[INFO] Hello world javascript demo ....................... SKIPPED
[INFO] CXF WS-Security UT Demo ........................... SKIPPED
[INFO] WS-Security UT Sign Demo .......................... SKIPPED
[INFO] CXF WS-Security Sign Encoding Demo ................ SKIPPED
[INFO] WS-Security UT Policy Demo ........................ SKIPPED
[INFO] MTOM Demo for SWA and XOP ......................... SKIPPED
[INFO] JAX-WS Asynchronous Demo using Document/Literal Style  SKIPPED
[INFO] Java First POJO Sample ............................ SKIPPED
[INFO] WS-Policy Demo .................................... SKIPPED
[INFO] Hello World Client Demo using JavaScript .......... SKIPPED
[INFO] WSDL first demo using HTTPS ....................... SKIPPED
[INFO] WS-Addressing Demo ................................ SKIPPED
[INFO] Sample using SOAP Headers ......................... SKIPPED
[INFO] SOAP/JMS Transport Specification Demo using Document-Literal Style  SKIPPED
[INFO] CXF sample using WRAPPED Style in XML Binding (pure XML over HTTP)  SKIPPED
[INFO] CXF sample using code first POJO's and the Aegis Binding  SKIPPED
[INFO] Sample of JAX-* Service Using an Aegis Client ..... SKIPPED
[INFO] JAX-WS Handler Demo ............................... SKIPPED
[INFO] WSDL first demo using RPC-Literal Style ........... SKIPPED
[INFO] JMS Transport Publish/Subscribe Demo using Document-Literal Style  SKIPPED
[INFO] JAX-RS Spring Security Demo ....................... SKIPPED
[INFO] LogBrowser ........................................ SKIPPED
[INFO] WS-Notification Demo .............................. SKIPPED
[INFO] CXF STS Demo ...................................... SKIPPED
[INFO] Bank sample using JAX-WS API's to talk via CORBA/IIOP  SKIPPED
[INFO] Bank sample using JAX-WS API's to talk via CORBA/IIOP  SKIPPED
[INFO] hello-world sample using JAX-WS API's to talk via CORBA/IIOP  SKIPPED
[INFO] Apache CXF Distribution ........................... SKIPPED
[INFO] ------------------------------------------------------------------------
[INFO] BUILD FAILURE
[INFO] ------------------------------------------------------------------------
[INFO] Total time: 21:58.413s
[INFO] Finished at: Fri Apr 06 11:33:47 GMT 2012
[INFO] Final Memory: 167M/269M
[INFO] ------------------------------------------------------------------------
Waiting for Jenkins to finish collecting data
mavenExecutionResult exceptions not empty
message : Failed to execute goal on project jms_spring_config: Could not resolve dependencies
for project org.apache.cxf.samples:jms_spring_config:jar:2.6.0-SNAPSHOT: Could not find artifact
org.apache.cxf.xjc-utils:cxf-xjc-runtime:jar:2.4.1-SNAPSHOT
cause : Could not resolve dependencies for project org.apache.cxf.samples:jms_spring_config:jar:2.6.0-SNAPSHOT:
Could not find artifact org.apache.cxf.xjc-utils:cxf-xjc-runtime:jar:2.4.1-SNAPSHOT
Stack trace : 
org.apache.maven.lifecycle.LifecycleExecutionException: Failed to execute goal on project
jms_spring_config: Could not resolve dependencies for project org.apache.cxf.samples:jms_spring_config:jar:2.6.0-SNAPSHOT:
Could not find artifact org.apache.cxf.xjc-utils:cxf-xjc-runtime:jar:2.4.1-SNAPSHOT
	at org.apache.maven.lifecycle.internal.LifecycleDependencyResolver.getDependencies(LifecycleDependencyResolver.java:196)
	at org.apache.maven.lifecycle.internal.LifecycleDependencyResolver.resolveProjectDependencies(LifecycleDependencyResolver.java:108)
	at org.apache.maven.lifecycle.internal.MojoExecutor.ensureDependenciesAreResolved(MojoExecutor.java:258)
	at org.apache.maven.lifecycle.internal.MojoExecutor.execute(MojoExecutor.java:201)
	at org.apache.maven.lifecycle.internal.MojoExecutor.execute(MojoExecutor.java:153)
	at org.apache.maven.lifecycle.internal.MojoExecutor.execute(MojoExecutor.java:145)
	at org.apache.maven.lifecycle.internal.LifecycleModuleBuilder.buildProject(LifecycleModuleBuilder.java:84)
	at org.apache.maven.lifecycle.internal.LifecycleModuleBuilder.buildProject(LifecycleModuleBuilder.java:59)
	at org.apache.maven.lifecycle.internal.LifecycleStarter.singleThreadedBuild(LifecycleStarter.java:183)
	at org.apache.maven.lifecycle.internal.LifecycleStarter.execute(LifecycleStarter.java:161)
	at org.apache.maven.DefaultMaven.doExecute(DefaultMaven.java:319)
	at org.apache.maven.DefaultMaven.execute(DefaultMaven.java:156)
	at org.jvnet.hudson.maven3.launcher.Maven3Launcher.main(Maven3Launcher.java:79)
	at sun.reflect.NativeMethodAccessorImpl.invoke0(Native Method)
	at sun.reflect.NativeMethodAccessorImpl.invoke(NativeMethodAccessorImpl.java:39)
	at sun.reflect.DelegatingMethodAccessorImpl.invoke(DelegatingMethodAccessorImpl.java:25)
	at java.lang.reflect.Method.invoke(Method.java:592)
	at org.codehaus.plexus.classworlds.launcher.Launcher.launchStandard(Launcher.java:329)
	at org.codehaus.plexus.classworlds.launcher.Launcher.launch(Launcher.java:239)
	at org.jvnet.hudson.maven3.agent.Maven3Main.launch(Maven3Main.java:158)
	at hudson.maven.Maven3Builder.call(Maven3Builder.java:104)
	at hudson.maven.Maven3Builder.call(Maven3Builder.java:70)
	at hudson.remoting.UserRequest.perform(UserRequest.java:118)
	at hudson.remoting.UserRequest.perform(UserRequest.java:48)
	at hudson.remoting.Request$2.run(Request.java:287)
	at hudson.remoting.InterceptingExecutorService$1.call(InterceptingExecutorService.java:72)
	at java.util.concurrent.FutureTask$Sync.innerRun(FutureTask.java:269)
	at java.util.concurrent.FutureTask.run(FutureTask.java:123)
	at java.util.concurrent.ThreadPoolExecutor$Worker.runTask(ThreadPoolExecutor.java:651)
	at java.util.concurrent.ThreadPoolExecutor$Worker.run(ThreadPoolExecutor.java:676)
	at java.lang.Thread.run(Thread.java:595)
Caused by: org.apache.maven.project.DependencyResolutionException: Could not resolve dependencies
for project org.apache.cxf.samples:jms_spring_config:jar:2.6.0-SNAPSHOT: Could not find artifact
org.apache.cxf.xjc-utils:cxf-xjc-runtime:jar:2.4.1-SNAPSHOT
	at org.apache.maven.project.DefaultProjectDependenciesResolver.resolve(DefaultProjectDependenciesResolver.java:170)
	at org.apache.maven.lifecycle.internal.LifecycleDependencyResolver.getDependencies(LifecycleDependencyResolver.java:171)
	... 30 more
Caused by: org.sonatype.aether.resolution.DependencyResolutionException: Could not find artifact
org.apache.cxf.xjc-utils:cxf-xjc-runtime:jar:2.4.1-SNAPSHOT
	at org.sonatype.aether.impl.internal.DefaultRepositorySystem.resolveDependencies(DefaultRepositorySystem.java:412)
	at org.apache.maven.project.DefaultProjectDependenciesResolver.resolve(DefaultProjectDependenciesResolver.java:164)
	... 31 more
Caused by: org.sonatype.aether.resolution.ArtifactResolutionException: Could not find artifact
org.apache.cxf.xjc-utils:cxf-xjc-runtime:jar:2.4.1-SNAPSHOT
	at org.sonatype.aether.impl.internal.DefaultArtifactResolver.resolve(DefaultArtifactResolver.java:541)
	at org.sonatype.aether.impl.internal.DefaultArtifactResolver.resolveArtifacts(DefaultArtifactResolver.java:220)
	at org.sonatype.aether.impl.internal.DefaultRepositorySystem.resolveDependencies(DefaultRepositorySystem.java:395)
	... 32 more
Caused by: org.sonatype.aether.transfer.ArtifactNotFoundException: Could not find artifact
org.apache.cxf.xjc-utils:cxf-xjc-runtime:jar:2.4.1-SNAPSHOT
	at org.sonatype.aether.impl.internal.DefaultArtifactResolver.resolve(DefaultArtifactResolver.java:531)
	... 34 more
Sending e-mails to: notifications@cxf.apache.org
channel stopped

Mime
View raw message