cxf-notifications mailing list archives

Site index · List index
Message view « Date » · « Thread »
Top « Date » · « Thread »
From Apache Jenkins Server <jenk...@builds.apache.org>
Subject Build failed in Jenkins: CXF-2.5-deploy #63
Date Tue, 10 Apr 2012 07:13:37 GMT
See <https://builds.apache.org/job/CXF-2.5-deploy/63/changes>

Changes:

[dkulp] Blocking revisions 1310446,1310575,1310590,1310591,1310592,1310593,1311352,1311362
via  git from
https://svn.apache.org/repos/asf/cxf/trunk

........
  r1310446 | dkulp | 2012-04-06 12:21:14 -0400 (Fri, 06 Apr 2012) | 2 lines
  
  More cr/lf cleanups
  
........
........
  r1310575 | dkulp | 2012-04-06 16:36:41 -0400 (Fri, 06 Apr 2012) | 3 lines
  
  Allow supporting the HTTP Continuations when running with pax-web in
  OSGi where it's servlet 2.5, but using the Jetty requests
  
........
........
  r1310590 | gmazza | 2012-04-06 17:11:58 -0400 (Fri, 06 Apr 2012) | 2 lines
  
  Proofread README.
  
........
........
  r1310591 | dkulp | 2012-04-06 17:12:38 -0400 (Fri, 06 Apr 2012) | 2 lines
  
  Remove some emtpy directories
  
........
........
  r1310592 | dkulp | 2012-04-06 17:13:39 -0400 (Fri, 06 Apr 2012) | 2 lines
  
  Remove more empty directories
  
........
........
  r1310593 | dkulp | 2012-04-06 17:14:35 -0400 (Fri, 06 Apr 2012) | 2 lines
  
  2 more empty dirs
  
........
........
  r1311352 | sergeyb | 2012-04-09 13:36:33 -0400 (Mon, 09 Apr 2012) | 2 lines
  
  Updating the all-compatible bundle to require the jaxrs frontend with re-exports
  
........
........
  r1311362 | dkulp | 2012-04-09 14:11:45 -0400 (Mon, 09 Apr 2012) | 2 lines
  
  Fix versions in two poms
  
........

[dkulp] Recording revisions 1311258,1311408 via  git from
https://svn.apache.org/repos/asf/cxf/trunk

[dkulp] Merged revisions 1311408 via  git cherry-pick from
https://svn.apache.org/repos/asf/cxf/trunk

........
  r1311408 | dkulp | 2012-04-09 16:07:44 -0400 (Mon, 09 Apr 2012) | 2 lines

  [CXF-4127] Make sure the bus and such is reset on ApplicationRefresh

........

[dkulp] Merged revisions 1311258 via  git cherry-pick from
https://svn.apache.org/repos/asf/cxf/trunk

........
  r1311258 | dkulp | 2012-04-09 10:31:34 -0400 (Mon, 09 Apr 2012) | 2 lines

  Update to new Karaf

........

[sergeyb] Removing empty rs/security package from the jaxrs frontend

------------------------------------------
[...truncated 21275 lines...]

Downloading: http://repo1.maven.org/maven2/org/slf4j/slf4j-api/1.5.6/slf4j-api-1.5.6.pom

Downloading: http://repo1.maven.org/maven2/org/apache/maven/shared/maven-common-artifact-filters/1.4/maven-common-artifact-filters-1.4.pom

Downloading: http://repo1.maven.org/maven2/org/codehaus/plexus/plexus-container-default/1.5.5/plexus-container-default-1.5.5.pom

Downloading: http://repo1.maven.org/maven2/org/apache/maven/shared/maven-repository-builder/1.0-alpha-2/maven-repository-builder-1.0-alpha-2.pom

Downloading: http://repo1.maven.org/maven2/org/apache/maven/maven-artifact/2.0.4/maven-artifact-2.0.4.pom

Downloading: http://repo1.maven.org/maven2/org/apache/maven/maven-artifact-manager/2.0.4/maven-artifact-manager-2.0.4.pom

Downloading: http://repo1.maven.org/maven2/org/apache/maven/shared/maven-common-artifact-filters/1.0-alpha-1/maven-common-artifact-filters-1.0-alpha-1.pom

Downloading: http://repo1.maven.org/maven2/org/apache/maven/shared/maven-shared-components/6/maven-shared-components-6.pom

Downloading: http://repo1.maven.org/maven2/org/apache/maven/shared/maven-common-artifact-filters/1.4/maven-common-artifact-filters-1.4.jar

Downloading: http://repo1.maven.org/maven2/org/apache/maven/shared/maven-repository-builder/1.0-alpha-2/maven-repository-builder-1.0-alpha-2.jar

[INFO] [assembly:single {execution: distribution-package-bin}]
[INFO] Reading assembly descriptor: src/main/assembly/bin.xml
[WARNING] Cannot include project artifact: org.apache.cxf:apache-cxf:pom:2.5.3-SNAPSHOT; it
doesn't have an associated file or directory.
[WARNING] Cannot include project artifact: org.apache.cxf:apache-cxf:pom:2.5.3-SNAPSHOT; it
doesn't have an associated file or directory.
[WARNING] Cannot include project artifact: org.apache.cxf:apache-cxf:pom:2.5.3-SNAPSHOT; it
doesn't have an associated file or directory.
[INFO] Copying files to <https://builds.apache.org/job/CXF-2.5-deploy/ws/cxf-2.5.x-fixes/distribution/target/apache-cxf-2.5.3-SNAPSHOT>
[WARNING] Assembly file: <https://builds.apache.org/job/CXF-2.5-deploy/ws/cxf-2.5.x-fixes/distribution/target/apache-cxf-2.5.3-SNAPSHOT>
is not a regular file (it may be a directory). It cannot be attached to the project build
for installation or deployment.
[WARNING] Cannot include project artifact: org.apache.cxf:apache-cxf:pom:2.5.3-SNAPSHOT; it
doesn't have an associated file or directory.
[WARNING] Cannot include project artifact: org.apache.cxf:apache-cxf:pom:2.5.3-SNAPSHOT; it
doesn't have an associated file or directory.
[WARNING] Cannot include project artifact: org.apache.cxf:apache-cxf:pom:2.5.3-SNAPSHOT; it
doesn't have an associated file or directory.
[INFO] Building tar: <https://builds.apache.org/job/CXF-2.5-deploy/ws/cxf-2.5.x-fixes/distribution/target/apache-cxf-2.5.3-SNAPSHOT.tar.gz>
[WARNING] Cannot include project artifact: org.apache.cxf:apache-cxf:pom:2.5.3-SNAPSHOT; it
doesn't have an associated file or directory.
[WARNING] Cannot include project artifact: org.apache.cxf:apache-cxf:pom:2.5.3-SNAPSHOT; it
doesn't have an associated file or directory.
[WARNING] Cannot include project artifact: org.apache.cxf:apache-cxf:pom:2.5.3-SNAPSHOT; it
doesn't have an associated file or directory.
[INFO] Building zip: <https://builds.apache.org/job/CXF-2.5-deploy/ws/cxf-2.5.x-fixes/distribution/target/apache-cxf-2.5.3-SNAPSHOT.zip>
[INFO] [assembly:single {execution: distribution-package-src}]
[INFO] Reading assembly descriptor: src/main/assembly/src.xml
[INFO] Building tar: <https://builds.apache.org/job/CXF-2.5-deploy/ws/cxf-2.5.x-fixes/distribution/target/apache-cxf-2.5.3-SNAPSHOT-src.tar.gz>
[INFO] Building zip: <https://builds.apache.org/job/CXF-2.5-deploy/ws/cxf-2.5.x-fixes/distribution/target/apache-cxf-2.5.3-SNAPSHOT-src.zip>
[INFO] [install:install {execution: default-install}]
[INFO] Installing <https://builds.apache.org/job/CXF-2.5-deploy/ws/cxf-2.5.x-fixes/distribution/pom.xml>
to <https://builds.apache.org/job/CXF-2.5-deploy/ws/.repository/org/apache/cxf/apache-cxf/2.5.3-SNAPSHOT/apache-cxf-2.5.3-SNAPSHOT.pom>
[INFO] Installing <https://builds.apache.org/job/CXF-2.5-deploy/ws/cxf-2.5.x-fixes/distribution/target/apache-cxf-2.5.3-SNAPSHOT.tar.gz>
to <https://builds.apache.org/job/CXF-2.5-deploy/ws/.repository/org/apache/cxf/apache-cxf/2.5.3-SNAPSHOT/apache-cxf-2.5.3-SNAPSHOT.tar.gz>
[INFO] Installing <https://builds.apache.org/job/CXF-2.5-deploy/ws/cxf-2.5.x-fixes/distribution/target/apache-cxf-2.5.3-SNAPSHOT.zip>
to <https://builds.apache.org/job/CXF-2.5-deploy/ws/.repository/org/apache/cxf/apache-cxf/2.5.3-SNAPSHOT/apache-cxf-2.5.3-SNAPSHOT.zip>
[INFO] Installing <https://builds.apache.org/job/CXF-2.5-deploy/ws/cxf-2.5.x-fixes/distribution/target/apache-cxf-2.5.3-SNAPSHOT-src.tar.gz>
to <https://builds.apache.org/job/CXF-2.5-deploy/ws/.repository/org/apache/cxf/apache-cxf/2.5.3-SNAPSHOT/apache-cxf-2.5.3-SNAPSHOT-src.tar.gz>
[INFO] Installing <https://builds.apache.org/job/CXF-2.5-deploy/ws/cxf-2.5.x-fixes/distribution/target/apache-cxf-2.5.3-SNAPSHOT-src.zip>
to <https://builds.apache.org/job/CXF-2.5-deploy/ws/.repository/org/apache/cxf/apache-cxf/2.5.3-SNAPSHOT/apache-cxf-2.5.3-SNAPSHOT-src.zip>
[INFO] [deploy:deploy {execution: default-deploy}]
[INFO] Retrieving previous build number from apache.snapshots.https
[WARNING] *** CHECKSUM FAILED - Checksum failed on download: local = 'b47b97427cbaf5b3b595164f4fc1869ce8ebfc27';
remote = '82011d1d706c24798952acf7f9f63eaeb2d17495' - RETRYING
[WARNING] *** CHECKSUM FAILED - Checksum failed on download: local = 'b47b97427cbaf5b3b595164f4fc1869ce8ebfc27';
remote = '82011d1d706c24798952acf7f9f63eaeb2d17495' - IGNORING
Uploading: https://repository.apache.org/content/repositories/snapshots/org/apache/cxf/apache-cxf/2.5.3-SNAPSHOT/apache-cxf-2.5.3-20120410.063330-41.pom
21K uploaded  (apache-cxf-2.5.3-20120410.063330-41.pom)
[INFO] Retrieving previous metadata from apache.snapshots.https
[WARNING] *** CHECKSUM FAILED - Checksum failed on download: local = 'b47b97427cbaf5b3b595164f4fc1869ce8ebfc27';
remote = '82011d1d706c24798952acf7f9f63eaeb2d17495' - RETRYING
[WARNING] *** CHECKSUM FAILED - Checksum failed on download: local = 'b47b97427cbaf5b3b595164f4fc1869ce8ebfc27';
remote = '82011d1d706c24798952acf7f9f63eaeb2d17495' - IGNORING
[INFO] Uploading repository metadata for: 'snapshot org.apache.cxf:apache-cxf:2.5.3-SNAPSHOT'
[INFO] Retrieving previous metadata from apache.snapshots.https
[INFO] Uploading repository metadata for: 'artifact org.apache.cxf:apache-cxf'
[INFO] Retrieving previous build number from apache.snapshots.https
Uploading: https://repository.apache.org/content/repositories/snapshots/org/apache/cxf/apache-cxf/2.5.3-SNAPSHOT/apache-cxf-2.5.3-20120410.063330-41.tar.gz
34066K uploaded  (apache-cxf-2.5.3-20120410.063330-41.tar.gz)
[INFO] Retrieving previous build number from apache.snapshots.https
Uploading: https://repository.apache.org/content/repositories/snapshots/org/apache/cxf/apache-cxf/2.5.3-SNAPSHOT/apache-cxf-2.5.3-20120410.063330-41.zip
35871K uploaded  (apache-cxf-2.5.3-20120410.063330-41.zip)
[INFO] Retrieving previous build number from apache.snapshots.https
Uploading: https://repository.apache.org/content/repositories/snapshots/org/apache/cxf/apache-cxf/2.5.3-SNAPSHOT/apache-cxf-2.5.3-20120410.063330-41-src.tar.gz
6289K uploaded  (apache-cxf-2.5.3-20120410.063330-41-src.tar.gz)
[INFO] Retrieving previous build number from apache.snapshots.https
Uploading: https://repository.apache.org/content/repositories/snapshots/org/apache/cxf/apache-cxf/2.5.3-SNAPSHOT/apache-cxf-2.5.3-20120410.063330-41-src.zip
14043K uploaded  (apache-cxf-2.5.3-20120410.063330-41-src.zip)
[INFO] 
[INFO] 
[INFO] ------------------------------------------------------------------------
[INFO] Reactor Summary:
[INFO] ------------------------------------------------------------------------
[INFO] Apache CXF ............................................ SUCCESS [11.195s]
[INFO] Apache CXF Parent ..................................... SUCCESS [3.365s]
[INFO] Apache CXF Common Utilities ........................... SUCCESS [14.402s]
[INFO] Apache CXF API ........................................ SUCCESS [25.610s]
[INFO] Apache CXF Woodstox/MSV Schema Validation ............. SUCCESS [8.127s]
[INFO] Apache CXF XML Schema Validation with Xerces .......... SUCCESS [5.413s]
[INFO] Apache CXF Common ..................................... SUCCESS [2.287s]
[INFO] Apache CXF Runtime Core ............................... SUCCESS [14.301s]
[INFO] Apache CXF Command Line Tools Common .................. SUCCESS [9.698s]
[INFO] Apache CXF Command Line Tools Validator ............... SUCCESS [6.945s]
[INFO] Apache CXF Command Line Tools WSDLTo Core ............. SUCCESS [6.971s]
[INFO] Apache CXF Command Line Tools WSDLTo JAXWS Frontend ... SUCCESS [8.089s]
[INFO] Apache CXF Runtime JAXB DataBinding ................... SUCCESS [6.963s]
[INFO] Apache CXF Runtime SOAP Binding ....................... SUCCESS [9.458s]
[INFO] Apache CXF Runtime JavaScript Client Generator Projects  SUCCESS [1.995s]
[INFO] Apache CXF Runtime JavaScript Client Generator ........ SUCCESS [6.648s]
[INFO] Apache CXF Command Line Tools WSDL to JavaScript Front End  SUCCESS [5.703s]
[INFO] Apache CXF Command Line Tools WSDLTo JAXB Databinding . SUCCESS [5.811s]
[INFO] Apache CXF Runtime Transport Common Used Classes ...... SUCCESS [5.511s]
[INFO] Apache CXF Maven Plugins .............................. SUCCESS [2.981s]
[INFO] Apache CXF WSDL Validator Maven2 Plugin ............... SUCCESS [7.295s]
[INFO] Apache CXF Code Generation Maven2 Plugins ............. SUCCESS [8.316s]
[INFO] Apache CXF Test Utilities ............................. SUCCESS [37.008s]
[INFO] Apache CXF Runtime Management ......................... SUCCESS [7.432s]
[INFO] Apache CXF Runtime JMS Transport ...................... SUCCESS [9.736s]
[INFO] Apache CXF Runtime XML Binding ........................ SUCCESS [8.064s]
[INFO] Apache CXF Runtime Local Transport .................... SUCCESS [5.907s]
[INFO] Apache CXF Runtime HTTP Transport ..................... SUCCESS [10.333s]
[INFO] Apache CXF Runtime HTTP Jetty Transport ............... SUCCESS [8.126s]
[INFO] Apache CXF Runtime Simple Frontend .................... SUCCESS [8.453s]
[INFO] Apache CXF Runtime WS Addressing ...................... SUCCESS [7.529s]
[INFO] Apache CXF Runtime JAX-WS Frontend .................... SUCCESS [13.808s]
[INFO] Apache CXF Runtime XmlBeans DataBinding ............... SUCCESS [7.696s]
[INFO] Apache CXF Command Line Tools WSDLTo Test ............. SUCCESS [3.526s]
[INFO] Apache CXF Command Line Tools WSDLTo Misctools ........ SUCCESS [9.437s]
[INFO] Apache CXF Command Line Tools ......................... SUCCESS [1.895s]
[INFO] Apache CXF Command Line Tools WSDLTo .................. SUCCESS [2.132s]
[INFO] Apache CXF Runtime Aegis Databinding .................. SUCCESS [11.567s]
[INFO] Apache CXF Command Line Tools JavaTo WS ............... SUCCESS [10.001s]
[INFO] Apache CXF Command Line Tools JavaTo .................. SUCCESS [3.474s]
[INFO] Apache CXF Runtime SDO DataBinding .................... SUCCESS [7.162s]
[INFO] Apache CXF Runtime JAX-RS Frontend .................... SUCCESS [15.328s]
[INFO] Apache CXF Command Line Tools WADLTo JAXRS Frontend ... SUCCESS [6.604s]
[INFO] Apache CXF Command Line Tools WADLTo .................. SUCCESS [3.313s]
[INFO] Apache CXF Runtime CORBA Binding ...................... SUCCESS [11.783s]
[INFO] Apache CXF Command Line Tools CORBA ................... SUCCESS [12.082s]
[INFO] Apache CXF Runtime JiBX DataBinding ................... SUCCESS [6.641s]
[INFO] Apache CXF Runtime HTTP Binding ....................... SUCCESS [8.066s]
[INFO] Apache CXF Runtime Object Binding ..................... SUCCESS [9.152s]
[INFO] Apache CXF Runtime Colocated Binding .................. SUCCESS [8.289s]
[INFO] Apache CXF Runtime .................................... SUCCESS [2.623s]
[INFO] Apache CXF Runtime Bindings ........................... SUCCESS [2.258s]
[INFO] Apache CXF Runtime JavaScript Frontend ................ SUCCESS [8.877s]
[INFO] Apache CXF Runtime WS Policy .......................... SUCCESS [21.018s]
[INFO] Apache CXF Runtime WS Reliable Messaging .............. SUCCESS [21.201s]
[INFO] Apache CXF Runtime WS MetadataExchange ................ SUCCESS [7.830s]
[INFO] Apache CXF Runtime WS Security ........................ SUCCESS [54.597s]
[INFO] Apache CXF RS XML Security ............................ SUCCESS [11.767s]
[INFO] Apache CXF Runtime RS Security OAuth Parent ........... SUCCESS [3.316s]
[INFO] Apache CXF Runtime OAuth 1.0a ......................... SUCCESS [12.816s]
[INFO] Apache CXF RS Cross-Origin Resource Sharing ........... SUCCESS [6.807s]
[INFO] Apache CXF Runtime Web Management ..................... SUCCESS [1:33.478s]
[INFO] Apache CXF Runtime JavaScript Client Generator Tests .. SUCCESS [8.246s]
[INFO] Apache CXF JCA Connection ............................. SUCCESS [13.801s]
[INFO] Apache CXF Integration ................................ SUCCESS [3.019s]
[INFO] Apache CXF Java2WS Maven2 Plugin ...................... SUCCESS [7.749s]
[INFO] Apache CXF WADL2Java Code Generation Maven2 Plugin .... SUCCESS [9.373s]
[INFO] Apache CXF CORBA Tools Maven2 Plugins ................. SUCCESS [7.482s]
[INFO] Apache CXF Archetype - Simple JAX-WS Java First ....... SUCCESS [23.461s]
[INFO] Apache CXF Archetype - Simple JAX-RS webapp ........... SUCCESS [4.920s]
[INFO] Apache CXF Maven Archetypes ........................... SUCCESS [3.572s]
[INFO] Apache CXF STS Core ................................... SUCCESS [20.854s]
[INFO] Apache CXF STS war deployment ......................... SUCCESS [32.149s]
[INFO] Apache CXF STS basic systests ......................... SUCCESS [13.026s]
[INFO] Apache CXF STS advanced systests ...................... SUCCESS [10.139s]
[INFO] Apache CXF Runtime .................................... SUCCESS [3.131s]
[INFO] Apache CXF STS service ................................ SUCCESS [2.418s]
[INFO] Apache CXF STS systests ............................... SUCCESS [3.041s]
[INFO] Apache CXF WSN API .................................... SUCCESS [20.214s]
[INFO] Apache CXF WSN Core ................................... SUCCESS [20.664s]
[INFO] Apache CXF WSN OSGi ................................... SUCCESS [11.220s]
[INFO] Apache CXF WSN service ................................ SUCCESS [7.183s]
[INFO] Apache CXF Karaf Parent ............................... SUCCESS [2.508s]
[INFO] Apache CXF Karaf Features ............................. SUCCESS [33.833s]
[INFO] Apache CXF Karaf Commands ............................. SUCCESS [9.394s]
[INFO] Apache CXF Bundle Parent .............................. SUCCESS [6.070s]
[INFO] Apache CXF Bundle Jar ................................. SUCCESS [3:07.602s]
[INFO] Apache CXF Minimal Bundle Jar ......................... SUCCESS [1:41.955s]
[INFO] Apache CXF JAX-RS Bundle Jar .......................... SUCCESS [56.229s]
[INFO] Apache CXF Container Integration System Tests ......... SUCCESS [4.313s]
[INFO] Apache CXF Container Integration Test Webapp .......... SUCCESS [8.761s]
[INFO] Apache CXF Uncategorized System Tests ................. SUCCESS [1:41.716s]
[INFO] Apache CXF Transport System Tests ..................... SUCCESS [11.408s]
[INFO] Apache CXF Transport System Tests JMS ................. SUCCESS [14.340s]
[INFO] Apache CXF JAX-WS System Tests ........................ SUCCESS [13.367s]
[INFO] Apache CXF Databinding System Tests ................... SUCCESS [26.686s]
[INFO] Apache CXF JAX-RS System Tests ........................ SUCCESS [33.235s]
[INFO] Apache CXF WS-* Specifications System Tests ........... SUCCESS [11.614s]
[INFO] Apache CXF WS-RM Specifications System Tests .......... SUCCESS [6.390s]
[INFO] Apache CXF WS-Security System Tests ................... SUCCESS [17.909s]
[INFO] Apache CXF WS-Security Interop System Tests ........... SUCCESS [12.933s]
[INFO] Apache CXF JAX-RS System Advanced Security Tests ...... SUCCESS [7.242s]
[INFO] Test for writing wsdl to repo ......................... SUCCESS [11.698s]
[INFO] Test for generating code from wsdl in repo ............ SUCCESS [1:31.020s]
[INFO] Apache CXF System Tests ............................... SUCCESS [3.988s]
[INFO] Apache CXF System Tests for Maven Plugins ............. SUCCESS [7.540s]
[INFO] Apache CXF Manifest Jar ............................... SUCCESS [10.464s]
[INFO] Apache CXF Samples .................................... SUCCESS [12.307s]
[INFO] Colocated Demo using Document/Literal Style ........... SUCCESS [25.670s]
[INFO] JavaScript Client Demo using Document/Literal Style ... SUCCESS [3.268s]
[INFO] Generated JavaScript Sample using JAX-WS and JSR-181 .. SUCCESS [0.795s]
[INFO] Java First demo service using the JAXWSFactoryBeans ... SUCCESS [0.681s]
[INFO] Java First demo using JAX-WS and JMS .................. SUCCESS [4.946s]
[INFO] JAX-RS Content Negotiation Demo ....................... SUCCESS [0.503s]
[INFO] JAX-RS Basic Demo With HTTPS communications ........... SUCCESS [0.694s]
[INFO] JAX-RS Basic Demo ..................................... SUCCESS [0.591s]
[INFO] CXF sample using a callbak object ..................... SUCCESS [3.089s]
[INFO] WSDL first demo using BARE Style in XML Binding (pure XML over HTTP)  SUCCESS [1.716s]
[INFO] JAX-WS Dispatch/Provider Demo ......................... SUCCESS [4.427s]
[INFO] WSDL first demo using Document/Literal Style and XMLBeans DataBinding  SUCCESS [2.902s]
[INFO] WSDL first demo using SOAP12 in Document/Literal Style  SUCCESS [1.827s]
[INFO] CXF Dynamic Client Sample ............................. SUCCESS [3.732s]
[INFO] JMS Transport Queue Demo using Document-Literal Style . SUCCESS [2.235s]
[INFO] WSDL first demo using the jms transport and jmsConfigFeature  SUCCESS [6.093s]
[INFO] RESTful Hello World Demo .............................. SUCCESS [0.580s]
[INFO] WSDL first demo using Document/Literal Style .......... SUCCESS [6.468s]
[INFO] CXF sample using the Aegis Binding without any webservice  SUCCESS [2.528s]
[INFO] Java First demo using JAX-WS APIs ..................... SUCCESS [2.416s]
[INFO] WS-RM Demo ............................................ SUCCESS [2.125s]
[INFO] CXF Sample of Stream GZIP Interceptor ................. SUCCESS [2.511s]
[INFO] Spring HTTP Sample .................................... SUCCESS [2.057s]
[INFO] Spring HTTP Servlet demo with ruby support ............ SUCCESS [11.086s]
[INFO] Spring HTTP Servlet demo with groovy support .......... SUCCESS [8.578s]
[INFO] Hello world javascript demo ........................... SUCCESS [2.077s]
[INFO] CXF WS-Security UT Demo ............................... SUCCESS [2.811s]
[INFO] WS-Security UT Sign Demo .............................. SUCCESS [2.097s]
[INFO] CXF WS-Security Sign Encoding Demo .................... SUCCESS [2.338s]
[INFO] WS-Security UT Policy Demo ............................ SUCCESS [1.880s]
[INFO] MTOM Demo for SWA and XOP ............................. SUCCESS [1.838s]
[INFO] JAX-WS Asynchronous Demo using Document/Literal Style . SUCCESS [1.764s]
[INFO] Java First POJO Sample ................................ SUCCESS [0.418s]
[INFO] WS-Policy Demo ........................................ SUCCESS [2.537s]
[INFO] Hello World Client Demo using JavaScript .............. SUCCESS [2.053s]
[INFO] WSDL first demo using HTTPS ........................... SUCCESS [1.840s]
[INFO] WS-Addressing Demo .................................... SUCCESS [1.844s]
[INFO] Sample using SOAP Headers ............................. SUCCESS [2.357s]
[INFO] SOAP/JMS Transport Specification Demo using Document-Literal Style  SUCCESS [1.973s]
[INFO] CXF sample using WRAPPED Style in XML Binding (pure XML over HTTP)  SUCCESS [1.942s]
[INFO] RESTful HTTP Binding Demo ............................. SUCCESS [0.617s]
[INFO] CXF sample using code first POJO's and the Aegis Binding  SUCCESS [8.448s]
[INFO] Sample of JAX-* Service Using an Aegis Client ......... SUCCESS [0.492s]
[INFO] JAX-WS Handler Demo ................................... SUCCESS [1.925s]
[INFO] WSDL first demo using RPC-Literal Style ............... SUCCESS [2.033s]
[INFO] JMS Transport Publish/Subscribe Demo using Document-Literal Style  SUCCESS [1.988s]
[INFO] JAX-RS Spring Security Demo ........................... SUCCESS [3.177s]
[INFO] LogBrowser ............................................ SUCCESS [0.740s]
[INFO] WS-Notification Demo .................................. SUCCESS [0.478s]
[INFO] CXF STS Demo .......................................... SUCCESS [21.838s]
[INFO] Bank sample using JAX-WS API's to talk via CORBA/IIOP . SUCCESS [2.128s]
[INFO] Bank sample using JAX-WS API's to talk via CORBA/IIOP . SUCCESS [6.247s]
[INFO] hello-world sample using JAX-WS API's to talk via CORBA/IIOP  SUCCESS [2.883s]
[INFO] Apache CXF Distribution ............................... SUCCESS [8:38.586s]
[INFO] ------------------------------------------------------------------------
[INFO] ------------------------------------------------------------------------
[INFO] BUILD SUCCESSFUL
[INFO] ------------------------------------------------------------------------
[INFO] Total time: 40 minutes 15 seconds
[INFO] Finished at: Tue Apr 10 07:13:34 UTC 2012
[INFO] Final Memory: 371M/960M
[INFO] ------------------------------------------------------------------------
[locks-and-latches] Releasing all the locks
[locks-and-latches] All the locks released
ERROR: Maven JVM terminated unexpectedly with exit code 0


Mime
View raw message