cxf-notifications mailing list archives

Site index · List index
Message view « Date » · « Thread »
Top « Date » · « Thread »
From Apache Jenkins Server <jenk...@builds.apache.org>
Subject Build failed in Jenkins: CXF-2.5-deploy #54
Date Tue, 27 Mar 2012 06:51:47 GMT
See <https://builds.apache.org/job/CXF-2.5-deploy/54/changes>

Changes:

[ningjiang] Fixed the corba bank pom version issue

[ningjiang] Merged revisions 1305388 via svnmerge from 
https://svn.apache.org/repos/asf/cxf/trunk

........
  r1305388 | ningjiang | 2012-03-26 23:09:33 +0800 (Mon, 26 Mar 2012) | 1 line
  
  CXF-4203 reapply the patch, we still need it
........

------------------------------------------
[...truncated 5647 lines...]
[INFO] [deploy:deploy {execution: default-deploy}]
[INFO] Retrieving previous build number from apache.snapshots.https
[WARNING] *** CHECKSUM FAILED - Checksum failed on download: local = 'fe4b4666ec385acf4ee1ebce6d093eff155098eb';
remote = '2880cebf3eda48986f54691020c366cea93d916c' - RETRYING
[WARNING] *** CHECKSUM FAILED - Checksum failed on download: local = 'fe4b4666ec385acf4ee1ebce6d093eff155098eb';
remote = '2880cebf3eda48986f54691020c366cea93d916c' - IGNORING
Uploading: https://repository.apache.org/content/repositories/snapshots/org/apache/cxf/cxf-rt-bindings-coloc/2.5.3-SNAPSHOT/cxf-rt-bindings-coloc-2.5.3-20120327.063541-41.jar
32K uploaded  (cxf-rt-bindings-coloc-2.5.3-20120327.063541-41.jar)
[INFO] Retrieving previous metadata from apache.snapshots.https
[INFO] Uploading repository metadata for: 'artifact org.apache.cxf:cxf-rt-bindings-coloc'
[INFO] Uploading project information for cxf-rt-bindings-coloc 2.5.3-20120327.063541-41
[INFO] Retrieving previous metadata from apache.snapshots.https
[WARNING] *** CHECKSUM FAILED - Checksum failed on download: local = 'fe4b4666ec385acf4ee1ebce6d093eff155098eb';
remote = '2880cebf3eda48986f54691020c366cea93d916c' - RETRYING
[WARNING] *** CHECKSUM FAILED - Checksum failed on download: local = 'fe4b4666ec385acf4ee1ebce6d093eff155098eb';
remote = '2880cebf3eda48986f54691020c366cea93d916c' - IGNORING
[INFO] Uploading repository metadata for: 'snapshot org.apache.cxf:cxf-rt-bindings-coloc:2.5.3-SNAPSHOT'
[INFO] Retrieving previous build number from apache.snapshots.https
Uploading: https://repository.apache.org/content/repositories/snapshots/org/apache/cxf/cxf-rt-bindings-coloc/2.5.3-SNAPSHOT/cxf-rt-bindings-coloc-2.5.3-20120327.063541-41-sources.jar
25K uploaded  (cxf-rt-bindings-coloc-2.5.3-20120327.063541-41-sources.jar)
[INFO] Retrieving previous build number from apache.snapshots.https
Uploading: https://repository.apache.org/content/repositories/snapshots/org/apache/cxf/cxf-rt-bindings-coloc/2.5.3-SNAPSHOT/cxf-rt-bindings-coloc-2.5.3-20120327.063541-41-javadoc.jar
85K uploaded  (cxf-rt-bindings-coloc-2.5.3-20120327.063541-41-javadoc.jar)
[JENKINS] Archiving <https://builds.apache.org/job/CXF-2.5-deploy/ws/cxf-2.5.x-fixes/rt/bindings/coloc/pom.xml>
to /home/hudson/hudson/jobs/CXF-2.5-deploy/modules/org.apache.cxf$cxf-rt-bindings-coloc/builds/2012-03-27_06-34-50/archive/org.apache.cxf/cxf-rt-bindings-coloc/2.5.3-SNAPSHOT/cxf-rt-bindings-coloc-2.5.3-SNAPSHOT.pom
[JENKINS] Archiving <https://builds.apache.org/job/CXF-2.5-deploy/ws/cxf-2.5.x-fixes/rt/bindings/coloc/target/cxf-rt-bindings-coloc-2.5.3-SNAPSHOT.jar>
to /home/hudson/hudson/jobs/CXF-2.5-deploy/modules/org.apache.cxf$cxf-rt-bindings-coloc/builds/2012-03-27_06-34-50/archive/org.apache.cxf/cxf-rt-bindings-coloc/2.5.3-20120327.063541-41/cxf-rt-bindings-coloc-2.5.3-20120327.063541-41.jar
[JENKINS] Archiving <https://builds.apache.org/job/CXF-2.5-deploy/ws/cxf-2.5.x-fixes/rt/bindings/coloc/target/cxf-rt-bindings-coloc-2.5.3-SNAPSHOT-sources.jar>
to /home/hudson/hudson/jobs/CXF-2.5-deploy/modules/org.apache.cxf$cxf-rt-bindings-coloc/builds/2012-03-27_06-34-50/archive/org.apache.cxf/cxf-rt-bindings-coloc/2.5.3-20120327.063541-41/cxf-rt-bindings-coloc-2.5.3-20120327.063541-41-sources.jar
[JENKINS] Archiving <https://builds.apache.org/job/CXF-2.5-deploy/ws/cxf-2.5.x-fixes/rt/bindings/coloc/target/cxf-rt-bindings-coloc-2.5.3-SNAPSHOT-javadoc.jar>
to /home/hudson/hudson/jobs/CXF-2.5-deploy/modules/org.apache.cxf$cxf-rt-bindings-coloc/builds/2012-03-27_06-34-50/archive/org.apache.cxf/cxf-rt-bindings-coloc/2.5.3-20120327.063541-41/cxf-rt-bindings-coloc-2.5.3-20120327.063541-41-javadoc.jar
[INFO] ------------------------------------------------------------------------
[INFO] Building Apache CXF Runtime
[INFO]    task-segment: [clean, deploy]
[INFO] ------------------------------------------------------------------------
[INFO] [clean:clean {execution: default-clean}]
[INFO] [site:attach-descriptor {execution: default-attach-descriptor}]
[INFO] [source:jar-no-fork {execution: attach-sources}]
[INFO] [javadoc:jar {execution: attach-javadocs}]
[INFO] Not executing Javadoc as the project is not a Java classpath-capable package
[INFO] [install:install {execution: default-install}]
[INFO] Installing <https://builds.apache.org/job/CXF-2.5-deploy/ws/cxf-2.5.x-fixes/rt/pom.xml>
to <https://builds.apache.org/job/CXF-2.5-deploy/ws/.repository/org/apache/cxf/cxf-rt/2.5.3-SNAPSHOT/cxf-rt-2.5.3-SNAPSHOT.pom>
[INFO] [deploy:deploy {execution: default-deploy}]
[INFO] Retrieving previous build number from apache.snapshots.https
[WARNING] *** CHECKSUM FAILED - Checksum failed on download: local = 'f19e63358aae416095aed9241103f0d9f4aa07d5';
remote = 'e07be8d1c3d45123f6a5606b622bd3128ba42198' - RETRYING
[WARNING] *** CHECKSUM FAILED - Checksum failed on download: local = 'f19e63358aae416095aed9241103f0d9f4aa07d5';
remote = 'e07be8d1c3d45123f6a5606b622bd3128ba42198' - IGNORING
Uploading: https://repository.apache.org/content/repositories/snapshots/org/apache/cxf/cxf-rt/2.5.3-SNAPSHOT/cxf-rt-2.5.3-20120327.063541-41.pom
2K uploaded  (cxf-rt-2.5.3-20120327.063541-41.pom)
[INFO] Retrieving previous metadata from apache.snapshots.https
[WARNING] *** CHECKSUM FAILED - Checksum failed on download: local = 'f19e63358aae416095aed9241103f0d9f4aa07d5';
remote = 'e07be8d1c3d45123f6a5606b622bd3128ba42198' - RETRYING
[WARNING] *** CHECKSUM FAILED - Checksum failed on download: local = 'f19e63358aae416095aed9241103f0d9f4aa07d5';
remote = 'e07be8d1c3d45123f6a5606b622bd3128ba42198' - IGNORING
[INFO] Uploading repository metadata for: 'snapshot org.apache.cxf:cxf-rt:2.5.3-SNAPSHOT'
[INFO] Retrieving previous metadata from apache.snapshots.https
[INFO] Uploading repository metadata for: 'artifact org.apache.cxf:cxf-rt'
[JENKINS] Archiving <https://builds.apache.org/job/CXF-2.5-deploy/ws/cxf-2.5.x-fixes/rt/pom.xml>
to /home/hudson/hudson/jobs/CXF-2.5-deploy/modules/org.apache.cxf$cxf-rt/builds/2012-03-27_06-34-49/archive/org.apache.cxf/cxf-rt/2.5.3-SNAPSHOT/cxf-rt-2.5.3-SNAPSHOT.pom
[JENKINS] Archiving <https://builds.apache.org/job/CXF-2.5-deploy/ws/.repository/org/apache/cxf/cxf-rt/2.5.3-SNAPSHOT/cxf-rt-2.5.3-SNAPSHOT.pom>
to /home/hudson/hudson/jobs/CXF-2.5-deploy/modules/org.apache.cxf$cxf-rt/builds/2012-03-27_06-34-49/archive/org.apache.cxf/cxf-rt/2.5.3-20120327.063541-41/cxf-rt-2.5.3-20120327.063541-41.pom
[INFO] ------------------------------------------------------------------------
[INFO] Building Apache CXF Runtime Bindings
[INFO]    task-segment: [clean, deploy]
[INFO] ------------------------------------------------------------------------
[INFO] [clean:clean {execution: default-clean}]
[INFO] [site:attach-descriptor {execution: default-attach-descriptor}]
[INFO] [source:jar-no-fork {execution: attach-sources}]
[INFO] [javadoc:jar {execution: attach-javadocs}]
[INFO] Not executing Javadoc as the project is not a Java classpath-capable package
[INFO] [install:install {execution: default-install}]
[INFO] Installing <https://builds.apache.org/job/CXF-2.5-deploy/ws/cxf-2.5.x-fixes/rt/bindings/pom.xml>
to <https://builds.apache.org/job/CXF-2.5-deploy/ws/.repository/org/apache/cxf/cxf-rt-bindings/2.5.3-SNAPSHOT/cxf-rt-bindings-2.5.3-SNAPSHOT.pom>
[INFO] [deploy:deploy {execution: default-deploy}]
[INFO] Retrieving previous build number from apache.snapshots.https
[WARNING] *** CHECKSUM FAILED - Checksum failed on download: local = '07c521591eb83dee6176969eff8aaff069b85cbd';
remote = '93858c8cb00e3d0098a15e6fc669fc40090eabd7' - RETRYING
[WARNING] *** CHECKSUM FAILED - Checksum failed on download: local = '07c521591eb83dee6176969eff8aaff069b85cbd';
remote = '93858c8cb00e3d0098a15e6fc669fc40090eabd7' - IGNORING
Uploading: https://repository.apache.org/content/repositories/snapshots/org/apache/cxf/cxf-rt-bindings/2.5.3-SNAPSHOT/cxf-rt-bindings-2.5.3-20120327.063541-41.pom
1K uploaded  (cxf-rt-bindings-2.5.3-20120327.063541-41.pom)
[INFO] Retrieving previous metadata from apache.snapshots.https
[WARNING] *** CHECKSUM FAILED - Checksum failed on download: local = '07c521591eb83dee6176969eff8aaff069b85cbd';
remote = '93858c8cb00e3d0098a15e6fc669fc40090eabd7' - RETRYING
[WARNING] *** CHECKSUM FAILED - Checksum failed on download: local = '07c521591eb83dee6176969eff8aaff069b85cbd';
remote = '93858c8cb00e3d0098a15e6fc669fc40090eabd7' - IGNORING
[INFO] Uploading repository metadata for: 'snapshot org.apache.cxf:cxf-rt-bindings:2.5.3-SNAPSHOT'
[INFO] Retrieving previous metadata from apache.snapshots.https
[INFO] Uploading repository metadata for: 'artifact org.apache.cxf:cxf-rt-bindings'
[JENKINS] Archiving <https://builds.apache.org/job/CXF-2.5-deploy/ws/cxf-2.5.x-fixes/rt/bindings/pom.xml>
to /home/hudson/hudson/jobs/CXF-2.5-deploy/modules/org.apache.cxf$cxf-rt-bindings/builds/2012-03-27_06-34-49/archive/org.apache.cxf/cxf-rt-bindings/2.5.3-SNAPSHOT/cxf-rt-bindings-2.5.3-SNAPSHOT.pom
[JENKINS] Archiving <https://builds.apache.org/job/CXF-2.5-deploy/ws/.repository/org/apache/cxf/cxf-rt-bindings/2.5.3-SNAPSHOT/cxf-rt-bindings-2.5.3-SNAPSHOT.pom>
to /home/hudson/hudson/jobs/CXF-2.5-deploy/modules/org.apache.cxf$cxf-rt-bindings/builds/2012-03-27_06-34-49/archive/org.apache.cxf/cxf-rt-bindings/2.5.3-20120327.063541-41/cxf-rt-bindings-2.5.3-20120327.063541-41.pom
[INFO] ------------------------------------------------------------------------
[INFO] Building Apache CXF Runtime JavaScript Frontend
[INFO]    task-segment: [clean, deploy]
[INFO] ------------------------------------------------------------------------
[INFO] [clean:clean {execution: default-clean}]
[INFO] Deleting <https://builds.apache.org/job/CXF-2.5-deploy/ws/cxf-2.5.x-fixes/rt/frontend/js/target>
[INFO] [cxf-xml2fastinfoset:xml2fastinfoset {execution: xml2fastinfoset}]
[INFO] [remote-resources:process {execution: default}]
[debug] execute contextualize
[INFO] [resources:resources {execution: default-resources}]
[INFO] Using 'UTF-8' encoding to copy filtered resources.
[INFO] Copying 0 resource
[INFO] skip non existing resourceDirectory <https://builds.apache.org/job/CXF-2.5-deploy/ws/cxf-2.5.x-fixes/rt/frontend/js/src/main/resources>
[INFO] skip non existing resourceDirectory <https://builds.apache.org/job/CXF-2.5-deploy/ws/cxf-2.5.x-fixes/rt/frontend/js/src/main/resources-filtered>
[INFO] skip non existing resourceDirectory <https://builds.apache.org/job/CXF-2.5-deploy/ws/cxf-2.5.x-fixes/rt/frontend/js/target/generated/src/main/resources>
[INFO] Copying 3 resources
[INFO] [compiler:compile {execution: default-compile}]
[INFO] Compiling 6 source files to <https://builds.apache.org/job/CXF-2.5-deploy/ws/cxf-2.5.x-fixes/rt/frontend/js/target/classes>
[debug] execute contextualize
[INFO] [resources:testResources {execution: default-testResources}]
[INFO] Using 'UTF-8' encoding to copy filtered resources.
[INFO] Copying 0 resource
[INFO] Copying 12 resources
[INFO] skip non existing resourceDirectory <https://builds.apache.org/job/CXF-2.5-deploy/ws/cxf-2.5.x-fixes/rt/frontend/js/target/generated/src/test/resources>
[INFO] Copying 3 resources
[INFO] [compiler:testCompile {execution: default-testCompile}]
[INFO] Compiling 3 source files to <https://builds.apache.org/job/CXF-2.5-deploy/ws/cxf-2.5.x-fixes/rt/frontend/js/target/test-classes>
[INFO] [surefire:test {execution: default-test}]
[INFO] Tests are skipped.
[JENKINS] Recording test results
[INFO] [jar:jar {execution: default-jar}]
[INFO] Building jar: <https://builds.apache.org/job/CXF-2.5-deploy/ws/cxf-2.5.x-fixes/rt/frontend/js/target/cxf-rt-frontend-js-2.5.3-SNAPSHOT.jar>
[INFO] [source:jar-no-fork {execution: attach-sources}]
[INFO] org already added, skipping
[INFO] org/apache already added, skipping
[INFO] org/apache/cxf already added, skipping
[INFO] org/apache/cxf/js already added, skipping
[INFO] org/apache/cxf/js/rhino already added, skipping
[INFO] META-INF already added, skipping
[INFO] META-INF/NOTICE already added, skipping
[INFO] META-INF/DEPENDENCIES already added, skipping
[INFO] META-INF/LICENSE already added, skipping
[INFO] Building jar: <https://builds.apache.org/job/CXF-2.5-deploy/ws/cxf-2.5.x-fixes/rt/frontend/js/target/cxf-rt-frontend-js-2.5.3-SNAPSHOT-sources.jar>
[INFO] org already added, skipping
[INFO] org/apache already added, skipping
[INFO] org/apache/cxf already added, skipping
[INFO] org/apache/cxf/js already added, skipping
[INFO] org/apache/cxf/js/rhino already added, skipping
[INFO] META-INF already added, skipping
[INFO] META-INF/NOTICE already added, skipping
[INFO] META-INF/DEPENDENCIES already added, skipping
[INFO] META-INF/LICENSE already added, skipping
[INFO] [javadoc:jar {execution: attach-javadocs}]
[INFO] Building jar: <https://builds.apache.org/job/CXF-2.5-deploy/ws/cxf-2.5.x-fixes/rt/frontend/js/target/cxf-rt-frontend-js-2.5.3-SNAPSHOT-javadoc.jar>
[INFO] [install:install {execution: default-install}]
[INFO] Installing <https://builds.apache.org/job/CXF-2.5-deploy/ws/cxf-2.5.x-fixes/rt/frontend/js/target/cxf-rt-frontend-js-2.5.3-SNAPSHOT.jar>
to <https://builds.apache.org/job/CXF-2.5-deploy/ws/.repository/org/apache/cxf/cxf-rt-frontend-js/2.5.3-SNAPSHOT/cxf-rt-frontend-js-2.5.3-SNAPSHOT.jar>
[INFO] Installing <https://builds.apache.org/job/CXF-2.5-deploy/ws/cxf-2.5.x-fixes/rt/frontend/js/target/cxf-rt-frontend-js-2.5.3-SNAPSHOT-sources.jar>
to <https://builds.apache.org/job/CXF-2.5-deploy/ws/.repository/org/apache/cxf/cxf-rt-frontend-js/2.5.3-SNAPSHOT/cxf-rt-frontend-js-2.5.3-SNAPSHOT-sources.jar>
[INFO] Installing <https://builds.apache.org/job/CXF-2.5-deploy/ws/cxf-2.5.x-fixes/rt/frontend/js/target/cxf-rt-frontend-js-2.5.3-SNAPSHOT-javadoc.jar>
to <https://builds.apache.org/job/CXF-2.5-deploy/ws/.repository/org/apache/cxf/cxf-rt-frontend-js/2.5.3-SNAPSHOT/cxf-rt-frontend-js-2.5.3-SNAPSHOT-javadoc.jar>
[INFO] [deploy:deploy {execution: default-deploy}]
[INFO] Retrieving previous build number from apache.snapshots.https
[WARNING] *** CHECKSUM FAILED - Checksum failed on download: local = '6116ff2fc6593934332691e10c959c13c2710c41';
remote = 'fbfab994027c2aabe57dd38d5ca6df27254a8e59' - RETRYING
[WARNING] *** CHECKSUM FAILED - Checksum failed on download: local = '6116ff2fc6593934332691e10c959c13c2710c41';
remote = 'fbfab994027c2aabe57dd38d5ca6df27254a8e59' - IGNORING
Uploading: https://repository.apache.org/content/repositories/snapshots/org/apache/cxf/cxf-rt-frontend-js/2.5.3-SNAPSHOT/cxf-rt-frontend-js-2.5.3-20120327.063541-41.jar
21K uploaded  (cxf-rt-frontend-js-2.5.3-20120327.063541-41.jar)
[INFO] Uploading project information for cxf-rt-frontend-js 2.5.3-20120327.063541-41
[INFO] Retrieving previous metadata from apache.snapshots.https
[WARNING] *** CHECKSUM FAILED - Checksum failed on download: local = '6116ff2fc6593934332691e10c959c13c2710c41';
remote = 'fbfab994027c2aabe57dd38d5ca6df27254a8e59' - RETRYING
[WARNING] *** CHECKSUM FAILED - Checksum failed on download: local = '6116ff2fc6593934332691e10c959c13c2710c41';
remote = 'fbfab994027c2aabe57dd38d5ca6df27254a8e59' - IGNORING
[INFO] Uploading repository metadata for: 'snapshot org.apache.cxf:cxf-rt-frontend-js:2.5.3-SNAPSHOT'
[INFO] Retrieving previous metadata from apache.snapshots.https
[INFO] Uploading repository metadata for: 'artifact org.apache.cxf:cxf-rt-frontend-js'
[INFO] Retrieving previous build number from apache.snapshots.https
Uploading: https://repository.apache.org/content/repositories/snapshots/org/apache/cxf/cxf-rt-frontend-js/2.5.3-SNAPSHOT/cxf-rt-frontend-js-2.5.3-20120327.063541-41-sources.jar
15K uploaded  (cxf-rt-frontend-js-2.5.3-20120327.063541-41-sources.jar)
[INFO] Retrieving previous build number from apache.snapshots.https
Uploading: https://repository.apache.org/content/repositories/snapshots/org/apache/cxf/cxf-rt-frontend-js/2.5.3-SNAPSHOT/cxf-rt-frontend-js-2.5.3-20120327.063541-41-javadoc.jar
55K uploaded  (cxf-rt-frontend-js-2.5.3-20120327.063541-41-javadoc.jar)
[JENKINS] Archiving <https://builds.apache.org/job/CXF-2.5-deploy/ws/cxf-2.5.x-fixes/rt/frontend/js/pom.xml>
to /home/hudson/hudson/jobs/CXF-2.5-deploy/modules/org.apache.cxf$cxf-rt-frontend-js/builds/2012-03-27_06-34-50/archive/org.apache.cxf/cxf-rt-frontend-js/2.5.3-SNAPSHOT/cxf-rt-frontend-js-2.5.3-SNAPSHOT.pom
[JENKINS] Archiving <https://builds.apache.org/job/CXF-2.5-deploy/ws/cxf-2.5.x-fixes/rt/frontend/js/target/cxf-rt-frontend-js-2.5.3-SNAPSHOT.jar>
to /home/hudson/hudson/jobs/CXF-2.5-deploy/modules/org.apache.cxf$cxf-rt-frontend-js/builds/2012-03-27_06-34-50/archive/org.apache.cxf/cxf-rt-frontend-js/2.5.3-20120327.063541-41/cxf-rt-frontend-js-2.5.3-20120327.063541-41.jar
[JENKINS] Archiving <https://builds.apache.org/job/CXF-2.5-deploy/ws/cxf-2.5.x-fixes/rt/frontend/js/target/cxf-rt-frontend-js-2.5.3-SNAPSHOT-sources.jar>
to /home/hudson/hudson/jobs/CXF-2.5-deploy/modules/org.apache.cxf$cxf-rt-frontend-js/builds/2012-03-27_06-34-50/archive/org.apache.cxf/cxf-rt-frontend-js/2.5.3-20120327.063541-41/cxf-rt-frontend-js-2.5.3-20120327.063541-41-sources.jar
[JENKINS] Archiving <https://builds.apache.org/job/CXF-2.5-deploy/ws/cxf-2.5.x-fixes/rt/frontend/js/target/cxf-rt-frontend-js-2.5.3-SNAPSHOT-javadoc.jar>
to /home/hudson/hudson/jobs/CXF-2.5-deploy/modules/org.apache.cxf$cxf-rt-frontend-js/builds/2012-03-27_06-34-50/archive/org.apache.cxf/cxf-rt-frontend-js/2.5.3-20120327.063541-41/cxf-rt-frontend-js-2.5.3-20120327.063541-41-javadoc.jar
[INFO] ------------------------------------------------------------------------
[INFO] Building Apache CXF Runtime WS Policy
[INFO]    task-segment: [clean, deploy]
[INFO] ------------------------------------------------------------------------
[INFO] [clean:clean {execution: default-clean}]
[INFO] Deleting <https://builds.apache.org/job/CXF-2.5-deploy/ws/cxf-2.5.x-fixes/rt/ws/policy/target>
[INFO] [cxf-xml2fastinfoset:xml2fastinfoset {execution: xml2fastinfoset}]
[INFO] [cxf-xjc:xsdtojava {execution: generate-sources}]
[INFO] [remote-resources:process {execution: default}]
[debug] execute contextualize
[INFO] [resources:resources {execution: default-resources}]
[INFO] Using 'UTF-8' encoding to copy filtered resources.
[INFO] Copying 4 resources
[INFO] Copying 19 resources
[INFO] skip non existing resourceDirectory <https://builds.apache.org/job/CXF-2.5-deploy/ws/cxf-2.5.x-fixes/rt/ws/policy/src/main/resources-filtered>
[INFO] Copying 1 resource
[INFO] Copying 3 resources
[INFO] [compiler:compile {execution: default-compile}]
[INFO] Compiling 70 source files to <https://builds.apache.org/job/CXF-2.5-deploy/ws/cxf-2.5.x-fixes/rt/ws/policy/target/classes>
[INFO] [cxf-codegen:wsdl2java {execution: generate-test-sources}]
[INFO] Running code generation in fork mode...
[INFO] Building jar: /tmp/cxf-tmp-881989/cxf-codegen6172868443726069895.jar
[debug] execute contextualize
[INFO] [resources:testResources {execution: default-testResources}]
[INFO] Using 'UTF-8' encoding to copy filtered resources.
[INFO] Copying 22 resources
[INFO] Copying 90 resources
[INFO] skip non existing resourceDirectory <https://builds.apache.org/job/CXF-2.5-deploy/ws/cxf-2.5.x-fixes/rt/ws/policy/target/generated/src/test/resources>
[INFO] Copying 3 resources
[INFO] [compiler:testCompile {execution: default-testCompile}]
[INFO] Compiling 35 source files to <https://builds.apache.org/job/CXF-2.5-deploy/ws/cxf-2.5.x-fixes/rt/ws/policy/target/test-classes>
[INFO] [surefire:test {execution: default-test}]
[INFO] Tests are skipped.
[JENKINS] Recording test results
Mar 27, 2012 6:51:42 AM hudson.remoting.Channel$ReaderThread run
SEVERE: I/O error in channel channel
java.io.StreamCorruptedException
	at java.io.ObjectInputStream.readObject0(ObjectInputStream.java:1332)
	at java.io.ObjectInputStream.readObject(ObjectInputStream.java:348)
	at hudson.remoting.Channel$ReaderThread.run(Channel.java:1127)
channel stopped
[INFO] ------------------------------------------------------------------------
[ERROR] FATAL ERROR
[INFO] ------------------------------------------------------------------------
[INFO] null
[INFO] ------------------------------------------------------------------------
[INFO] Trace
java.lang.reflect.UndeclaredThrowableException
	at $Proxy2.isArchivingDisabled(Unknown Source)
	at hudson.maven.MavenBuildProxy$Filter.isArchivingDisabled(MavenBuildProxy.java:227)
	at hudson.maven.reporters.MavenArtifact.archive(MavenArtifact.java:223)
	at hudson.maven.reporters.MavenArtifactArchiver.postBuild(MavenArtifactArchiver.java:106)
	at hudson.maven.Maven2Builder.postModule(Maven2Builder.java:127)
	at hudson.maven.MavenBuilder$Adapter.fireLeaveModule(MavenBuilder.java:327)
	at hudson.maven.MavenBuilder$Adapter.postBuild(MavenBuilder.java:285)
	at org.apache.maven.lifecycle.LifecycleExecutorInterceptor.execute(LifecycleExecutorInterceptor.java:68)
	at org.apache.maven.DefaultMaven.doExecute(DefaultMaven.java:328)
	at org.apache.maven.DefaultMaven.execute(DefaultMaven.java:138)
	at org.apache.maven.cli.MavenCli.main(MavenCli.java:362)
	at sun.reflect.NativeMethodAccessorImpl.invoke0(Native Method)
	at sun.reflect.NativeMethodAccessorImpl.invoke(NativeMethodAccessorImpl.java:39)
	at sun.reflect.DelegatingMethodAccessorImpl.invoke(DelegatingMethodAccessorImpl.java:25)
	at java.lang.reflect.Method.invoke(Method.java:592)
	at org.codehaus.classworlds.Launcher.launchEnhanced(Launcher.java:315)
	at org.codehaus.classworlds.Launcher.launch(Launcher.java:255)
	at hudson.maven.agent.Main.launch(Main.java:185)
	at hudson.maven.MavenBuilder.call(MavenBuilder.java:151)
	at hudson.maven.Maven2Builder.call(Maven2Builder.java:77)
	at hudson.maven.Maven2Builder.call(Maven2Builder.java:53)
	at hudson.remoting.UserRequest.perform(UserRequest.java:118)
	at hudson.remoting.UserRequest.perform(UserRequest.java:48)
	at hudson.remoting.Request$2.run(Request.java:287)
	at hudson.remoting.InterceptingExecutorService$1.call(InterceptingExecutorService.java:72)
	at java.util.concurrent.FutureTask$Sync.innerRun(FutureTask.java:269)
	at java.util.concurrent.FutureTask.run(FutureTask.java:123)
	at java.util.concurrent.ThreadPoolExecutor$Worker.runTask(ThreadPoolExecutor.java:651)
	at java.util.concurrent.ThreadPoolExecutor$Worker.run(ThreadPoolExecutor.java:676)
	at java.lang.Thread.run(Thread.java:595)
Caused by: hudson.remoting.ChannelClosedException: channel is already closed
	at hudson.remoting.Channel.send(Channel.java:499)
	at hudson.remoting.Request.call(Request.java:110)
	at hudson.remoting.Channel.call(Channel.java:681)
	at hudson.remoting.RemoteInvocationHandler.invoke(RemoteInvocationHandler.java:158)
	... 30 more
Caused by: java.io.StreamCorruptedException
	at java.io.ObjectInputStream.readObject0(ObjectInputStream.java:1332)
	at java.io.ObjectInputStream.readObject(ObjectInputStream.java:348)
	at hudson.remoting.Channel$ReaderThread.run(Channel.java:1127)
[INFO] ------------------------------------------------------------------------
[INFO] Total time: 16 minutes 23 seconds
[INFO] Finished at: Tue Mar 27 06:51:42 UTC 2012
[locks-and-latches] Releasing all the locks
[locks-and-latches] All the locks released
ERROR: Maven JVM terminated unexpectedly with exit code 0


Mime
View raw message