cxf-notifications mailing list archives

Site index · List index
Message view « Date » · « Thread »
Top « Date » · « Thread »
From Apache Jenkins Server <jenk...@builds.apache.org>
Subject Build failed in Jenkins: CXF-trunk-deploy » Apache CXF Runtime HTTP Transport #814
Date Thu, 15 Mar 2012 19:07:34 GMT
See <https://builds.apache.org/job/CXF-trunk-deploy/org.apache.cxf$cxf-rt-transports-http/814/changes>

Changes:

[dkulp] Update the HTTPTransportActivator stuff to not have to sync on ALL the
matchers, just on each one individually.   Also, apply the regex stuff
first, then the specific address based and name based last.

------------------------------------------
[INFO] ------------------------------------------------------------------------
[INFO] Building Apache CXF Runtime HTTP Transport
[INFO]    task-segment: [clean, deploy]
[INFO] ------------------------------------------------------------------------
[INFO] [clean:clean {execution: default-clean}]
[INFO] Deleting <https://builds.apache.org/job/CXF-trunk-deploy/org.apache.cxf$cxf-rt-transports-http/ws/target>
[INFO] [bundle:cleanVersions {execution: versions}]
[INFO] [cxf-xml2fastinfoset:xml2fastinfoset {execution: xml2fastinfoset}]
[INFO] [cxf-xjc:xsdtojava {execution: generate-sources}]
[INFO] [remote-resources:process {execution: default}]
Downloading: http://repo1.maven.org/maven2/org/springframework/spring-web/3.0.7.RELEASE/spring-web-3.0.7.RELEASE.pom

Downloading: http://repo1.maven.org/maven2/org/springframework/spring-web/3.0.7.RELEASE/spring-web-3.0.7.RELEASE.jar

[debug] execute contextualize
[INFO] [resources:resources {execution: default-resources}]
[INFO] Using 'UTF-8' encoding to copy filtered resources.
[INFO] Copying 5 resources
[INFO] Copying 12 resources
[INFO] skip non existing resourceDirectory <https://builds.apache.org/job/CXF-trunk-deploy/org.apache.cxf$cxf-rt-transports-http/ws/src/main/resources-filtered>
[INFO] Copying 2 resources
[INFO] Copying 3 resources
[INFO] [compiler:compile {execution: default-compile}]
[INFO] Compiling 74 source files to <https://builds.apache.org/job/CXF-trunk-deploy/org.apache.cxf$cxf-rt-transports-http/ws/target/classes>
[INFO] -------------------------------------------------------------
[ERROR] COMPILATION ERROR : 
[INFO] -------------------------------------------------------------
[ERROR] <https://builds.apache.org/job/CXF-trunk-deploy/org.apache.cxf$cxf-rt-transports-http/ws/src/main/java/org/apache/cxf/transport/http/osgi/HTTPTransportActivator.java>:[105,9]
method does not override a method from its superclass
[INFO] 1 error
[INFO] -------------------------------------------------------------
[JENKINS] Archiving <https://builds.apache.org/job/CXF-trunk-deploy/org.apache.cxf$cxf-rt-transports-http/ws/pom.xml>
to /home/hudson/hudson/jobs/CXF-trunk-deploy/modules/org.apache.cxf$cxf-rt-transports-http/builds/2012-03-15_18-57-32/archive/org.apache.cxf/cxf-rt-transports-http/2.6.0-SNAPSHOT/cxf-rt-transports-http-2.6.0-SNAPSHOT.pom
[INFO] ------------------------------------------------------------------------
[ERROR] BUILD FAILURE
[INFO] ------------------------------------------------------------------------
[INFO] Compilation failure
<https://builds.apache.org/job/CXF-trunk-deploy/org.apache.cxf$cxf-rt-transports-http/ws/src/main/java/org/apache/cxf/transport/http/osgi/HTTPTransportActivator.java>:[105,9]
method does not override a method from its superclass

[INFO] ------------------------------------------------------------------------
[INFO] Trace
org.apache.maven.BuildFailureException: Compilation failure
<https://builds.apache.org/job/CXF-trunk-deploy/org.apache.cxf$cxf-rt-transports-http/ws/src/main/java/org/apache/cxf/transport/http/osgi/HTTPTransportActivator.java>:[105,9]
method does not override a method from its superclass

	at org.apache.maven.lifecycle.DefaultLifecycleExecutor.executeGoals(DefaultLifecycleExecutor.java:715)
	at org.apache.maven.lifecycle.DefaultLifecycleExecutor.executeGoalWithLifecycle(DefaultLifecycleExecutor.java:556)
	at org.apache.maven.lifecycle.DefaultLifecycleExecutor.executeGoal(DefaultLifecycleExecutor.java:535)
	at org.apache.maven.lifecycle.DefaultLifecycleExecutor.executeGoalAndHandleFailures(DefaultLifecycleExecutor.java:387)
	at org.apache.maven.lifecycle.DefaultLifecycleExecutor.executeTaskSegments(DefaultLifecycleExecutor.java:348)
	at org.apache.maven.lifecycle.DefaultLifecycleExecutor.execute(DefaultLifecycleExecutor.java:180)
	at org.apache.maven.lifecycle.LifecycleExecutorInterceptor.execute(LifecycleExecutorInterceptor.java:65)
	at org.apache.maven.DefaultMaven.doExecute(DefaultMaven.java:328)
	at org.apache.maven.DefaultMaven.execute(DefaultMaven.java:138)
	at org.apache.maven.cli.MavenCli.main(MavenCli.java:362)
	at sun.reflect.NativeMethodAccessorImpl.invoke0(Native Method)
	at sun.reflect.NativeMethodAccessorImpl.invoke(NativeMethodAccessorImpl.java:39)
	at sun.reflect.DelegatingMethodAccessorImpl.invoke(DelegatingMethodAccessorImpl.java:25)
	at java.lang.reflect.Method.invoke(Method.java:592)
	at org.codehaus.classworlds.Launcher.launchEnhanced(Launcher.java:315)
	at org.codehaus.classworlds.Launcher.launch(Launcher.java:255)
	at hudson.maven.agent.Main.launch(Main.java:185)
	at hudson.maven.MavenBuilder.call(MavenBuilder.java:151)
	at hudson.maven.Maven2Builder.call(Maven2Builder.java:77)
	at hudson.maven.Maven2Builder.call(Maven2Builder.java:53)
	at hudson.remoting.UserRequest.perform(UserRequest.java:118)
	at hudson.remoting.UserRequest.perform(UserRequest.java:48)
	at hudson.remoting.Request$2.run(Request.java:287)
	at hudson.remoting.InterceptingExecutorService$1.call(InterceptingExecutorService.java:72)
	at java.util.concurrent.FutureTask$Sync.innerRun(FutureTask.java:269)
	at java.util.concurrent.FutureTask.run(FutureTask.java:123)
	at java.util.concurrent.ThreadPoolExecutor$Worker.runTask(ThreadPoolExecutor.java:651)
	at java.util.concurrent.ThreadPoolExecutor$Worker.run(ThreadPoolExecutor.java:676)
	at java.lang.Thread.run(Thread.java:595)
Caused by: org.apache.maven.plugin.CompilationFailureException: Compilation failure
<https://builds.apache.org/job/CXF-trunk-deploy/org.apache.cxf$cxf-rt-transports-http/ws/src/main/java/org/apache/cxf/transport/http/osgi/HTTPTransportActivator.java>:[105,9]
method does not override a method from its superclass

	at org.apache.maven.plugin.AbstractCompilerMojo.execute(AbstractCompilerMojo.java:656)
	at org.apache.maven.plugin.CompilerMojo.execute(CompilerMojo.java:128)
	at org.apache.maven.plugin.DefaultPluginManager.executeMojo(DefaultPluginManager.java:490)
	at hudson.maven.agent.PluginManagerInterceptor.executeMojo(PluginManagerInterceptor.java:182)
	at org.apache.maven.lifecycle.DefaultLifecycleExecutor.executeGoals(DefaultLifecycleExecutor.java:694)
	... 28 more
[INFO] ------------------------------------------------------------------------
[INFO] Total time: 9 minutes 26 seconds
[INFO] Finished at: Thu Mar 15 19:07:31 UTC 2012
[INFO] Final Memory: 174M/226M
[INFO] ------------------------------------------------------------------------

Mime
View raw message