cxf-notifications mailing list archives

Site index · List index
Message view « Date » · « Thread »
Top « Date » · « Thread »
From Apache Jenkins Server <jenk...@builds.apache.org>
Subject Build failed in Jenkins: CXF-trunk-deploy #802
Date Sat, 03 Mar 2012 06:31:21 GMT
See <https://builds.apache.org/job/CXF-trunk-deploy/802/changes>

Changes:

[dkulp] [CXF-4130] Fix problems with Providers writing bodies into headers
Patch from Seumas Soltysik applied

[dkulp] [CXF-4131] Make sure the conduit is only added as a listener once

[dkulp] [CXF-4136] Handle wsdls not as a dependency
Patch from Owen Farrell applied

[dkulp] [CXF-4143] Make the ending interceptor public so the name can easily be
accessed.

[coheigea] Do not set passwords to the empty String if they are null.
 - This is causing the keystore.private.password property of WSS4J to not work

[sergeyb] [CXF-4153] Adding the missing test file

[sergeyb] [CXF-4153] Fixing Beanspector wrongly getting the property names in case of 'is'

[sergeyb] [CXF-4142] Checking contextual properties for non-root parts

[sergeyb] Minor fix to the oauth10 module

[coheigea] [CXF-4049] - Check external CryptoProvider from message context properties in Wss4jInInterceptor
 - Patch applied, thanks.
 - I made some changes as per my comments in the JIRA.

------------------------------------------
[...truncated 8372 lines...]
[INFO] org/apache/cxf already added, skipping
[INFO] org/apache/cxf/sts already added, skipping
[INFO] org/apache/cxf/sts/interceptor already added, skipping
[INFO] org/apache/cxf/sts/token already added, skipping
[INFO] org/apache/cxf/sts/token/validator already added, skipping
[INFO] org/apache/cxf/sts/token/realm already added, skipping
[INFO] org/apache/cxf/sts/token/provider already added, skipping
[INFO] org/apache/cxf/sts/token/canceller already added, skipping
[INFO] org/apache/cxf/sts/request already added, skipping
[INFO] org/apache/cxf/sts/service already added, skipping
[INFO] org/apache/cxf/sts/claims already added, skipping
[INFO] org/apache/cxf/sts/operation already added, skipping
[INFO] org/apache/cxf/sts/cache already added, skipping
[INFO] META-INF already added, skipping
[INFO] META-INF/NOTICE already added, skipping
[INFO] META-INF/DEPENDENCIES already added, skipping
[INFO] META-INF/LICENSE already added, skipping
[INFO] Building jar: <https://builds.apache.org/job/CXF-trunk-deploy/ws/trunk/services/sts/sts-core/target/cxf-services-sts-core-2.6.0-SNAPSHOT-sources.jar>
[INFO] org already added, skipping
[INFO] org/apache already added, skipping
[INFO] org/apache/cxf already added, skipping
[INFO] org/apache/cxf/sts already added, skipping
[INFO] org/apache/cxf/sts/interceptor already added, skipping
[INFO] org/apache/cxf/sts/token already added, skipping
[INFO] org/apache/cxf/sts/token/validator already added, skipping
[INFO] org/apache/cxf/sts/token/realm already added, skipping
[INFO] org/apache/cxf/sts/token/provider already added, skipping
[INFO] org/apache/cxf/sts/token/canceller already added, skipping
[INFO] org/apache/cxf/sts/request already added, skipping
[INFO] org/apache/cxf/sts/service already added, skipping
[INFO] org/apache/cxf/sts/claims already added, skipping
[INFO] org/apache/cxf/sts/operation already added, skipping
[INFO] org/apache/cxf/sts/cache already added, skipping
[INFO] META-INF already added, skipping
[INFO] META-INF/NOTICE already added, skipping
[INFO] META-INF/DEPENDENCIES already added, skipping
[INFO] META-INF/LICENSE already added, skipping
[INFO] [javadoc:jar {execution: attach-javadocs}]
[INFO] 
5 warnings
[WARNING] Javadoc Warnings
[WARNING] <https://builds.apache.org/job/CXF-trunk-deploy/ws/trunk/services/sts/sts-core/src/main/java/org/apache/cxf/sts/token/provider/DefaultConditionsProvider.java>:51:
warning - @param argument "default" is not a parameter name.
[WARNING] <https://builds.apache.org/job/CXF-trunk-deploy/ws/trunk/services/sts/sts-core/src/main/java/org/apache/cxf/sts/token/provider/DefaultConditionsProvider.java>:68:
warning - @param argument "maximum" is not a parameter name.
[WARNING] <https://builds.apache.org/job/CXF-trunk-deploy/ws/trunk/services/sts/sts-core/src/main/java/org/apache/cxf/sts/token/provider/TokenProviderResponse.java>:134:
warning - @param argument "attachtedReference" is not a parameter name.
[WARNING] <https://builds.apache.org/job/CXF-trunk-deploy/ws/trunk/services/sts/sts-core/src/main/java/org/apache/cxf/sts/token/provider/TokenProviderResponse.java>:150:
warning - @param argument "unAttachedReference" is not a parameter name.
[WARNING] <https://builds.apache.org/job/CXF-trunk-deploy/ws/trunk/services/sts/sts-core/src/main/java/org/apache/cxf/sts/StaticSTSProperties.java>:184:
warning - @param argument "signaturePropertiesFile" is not a parameter name.
[INFO] Building jar: <https://builds.apache.org/job/CXF-trunk-deploy/ws/trunk/services/sts/sts-core/target/cxf-services-sts-core-2.6.0-SNAPSHOT-javadoc.jar>
[INFO] [install:install {execution: default-install}]
[INFO] Installing <https://builds.apache.org/job/CXF-trunk-deploy/ws/trunk/services/sts/sts-core/target/cxf-services-sts-core-2.6.0-SNAPSHOT.jar>
to /home/jenkins/jenkins-slave/maven-repositories/1/org/apache/cxf/services/sts/cxf-services-sts-core/2.6.0-SNAPSHOT/cxf-services-sts-core-2.6.0-SNAPSHOT.jar
[INFO] Installing <https://builds.apache.org/job/CXF-trunk-deploy/ws/trunk/services/sts/sts-core/target/cxf-services-sts-core-2.6.0-SNAPSHOT-sources.jar>
to /home/jenkins/jenkins-slave/maven-repositories/1/org/apache/cxf/services/sts/cxf-services-sts-core/2.6.0-SNAPSHOT/cxf-services-sts-core-2.6.0-SNAPSHOT-sources.jar
[INFO] Installing <https://builds.apache.org/job/CXF-trunk-deploy/ws/trunk/services/sts/sts-core/target/cxf-services-sts-core-2.6.0-SNAPSHOT-javadoc.jar>
to /home/jenkins/jenkins-slave/maven-repositories/1/org/apache/cxf/services/sts/cxf-services-sts-core/2.6.0-SNAPSHOT/cxf-services-sts-core-2.6.0-SNAPSHOT-javadoc.jar
[INFO] [bundle:install {execution: default-install}]
[INFO] Installing org/apache/cxf/services/sts/cxf-services-sts-core/2.6.0-SNAPSHOT/cxf-services-sts-core-2.6.0-SNAPSHOT.jar
[INFO] Writing OBR metadata
[INFO] [deploy:deploy {execution: default-deploy}]
[INFO] Retrieving previous build number from apache.snapshots.https
[WARNING] *** CHECKSUM FAILED - Checksum failed on download: local = 'd1863c71433469071cd099386161fbbc449b44f2';
remote = 'f3b79752bfab906c0fd2bf49ca09ecd10e6330c3' - RETRYING
[WARNING] *** CHECKSUM FAILED - Checksum failed on download: local = 'd1863c71433469071cd099386161fbbc449b44f2';
remote = 'f3b79752bfab906c0fd2bf49ca09ecd10e6330c3' - IGNORING
Uploading: https://repository.apache.org/content/repositories/snapshots/org/apache/cxf/services/sts/cxf-services-sts-core/2.6.0-SNAPSHOT/cxf-services-sts-core-2.6.0-20120303.060709-40.jar
134K uploaded  (cxf-services-sts-core-2.6.0-20120303.060709-40.jar)
[INFO] Retrieving previous metadata from apache.snapshots.https
[INFO] Uploading repository metadata for: 'artifact org.apache.cxf.services.sts:cxf-services-sts-core'
[INFO] Retrieving previous metadata from apache.snapshots.https
[WARNING] *** CHECKSUM FAILED - Checksum failed on download: local = 'd1863c71433469071cd099386161fbbc449b44f2';
remote = 'f3b79752bfab906c0fd2bf49ca09ecd10e6330c3' - RETRYING
[WARNING] *** CHECKSUM FAILED - Checksum failed on download: local = 'd1863c71433469071cd099386161fbbc449b44f2';
remote = 'f3b79752bfab906c0fd2bf49ca09ecd10e6330c3' - IGNORING
[INFO] Uploading repository metadata for: 'snapshot org.apache.cxf.services.sts:cxf-services-sts-core:2.6.0-SNAPSHOT'
[INFO] Uploading project information for cxf-services-sts-core 2.6.0-20120303.060709-40
[INFO] Retrieving previous build number from apache.snapshots.https
Uploading: https://repository.apache.org/content/repositories/snapshots/org/apache/cxf/services/sts/cxf-services-sts-core/2.6.0-SNAPSHOT/cxf-services-sts-core-2.6.0-20120303.060709-40-sources.jar
111K uploaded  (cxf-services-sts-core-2.6.0-20120303.060709-40-sources.jar)
[INFO] Retrieving previous build number from apache.snapshots.https
Uploading: https://repository.apache.org/content/repositories/snapshots/org/apache/cxf/services/sts/cxf-services-sts-core/2.6.0-SNAPSHOT/cxf-services-sts-core-2.6.0-20120303.060709-40-javadoc.jar
405K uploaded  (cxf-services-sts-core-2.6.0-20120303.060709-40-javadoc.jar)
[INFO] [bundle:deploy {execution: default-deploy}]
[INFO] Remote OBR update disabled (enable with -DremoteOBR)
[JENKINS] Archiving <https://builds.apache.org/job/CXF-trunk-deploy/ws/trunk/services/sts/sts-core/pom.xml>
to /home/hudson/hudson/jobs/CXF-trunk-deploy/modules/org.apache.cxf.services.sts$cxf-services-sts-core/builds/2012-03-03_06-06-15/archive/org.apache.cxf.services.sts/cxf-services-sts-core/2.6.0-SNAPSHOT/cxf-services-sts-core-2.6.0-SNAPSHOT.pom
[JENKINS] Archiving <https://builds.apache.org/job/CXF-trunk-deploy/ws/trunk/services/sts/sts-core/target/cxf-services-sts-core-2.6.0-SNAPSHOT.jar>
to /home/hudson/hudson/jobs/CXF-trunk-deploy/modules/org.apache.cxf.services.sts$cxf-services-sts-core/builds/2012-03-03_06-06-15/archive/org.apache.cxf.services.sts/cxf-services-sts-core/2.6.0-20120303.060709-40/cxf-services-sts-core-2.6.0-20120303.060709-40.jar
[JENKINS] Archiving <https://builds.apache.org/job/CXF-trunk-deploy/ws/trunk/services/sts/sts-core/target/cxf-services-sts-core-2.6.0-SNAPSHOT-sources.jar>
to /home/hudson/hudson/jobs/CXF-trunk-deploy/modules/org.apache.cxf.services.sts$cxf-services-sts-core/builds/2012-03-03_06-06-15/archive/org.apache.cxf.services.sts/cxf-services-sts-core/2.6.0-20120303.060709-40/cxf-services-sts-core-2.6.0-20120303.060709-40-sources.jar
[JENKINS] Archiving <https://builds.apache.org/job/CXF-trunk-deploy/ws/trunk/services/sts/sts-core/target/cxf-services-sts-core-2.6.0-SNAPSHOT-javadoc.jar>
to /home/hudson/hudson/jobs/CXF-trunk-deploy/modules/org.apache.cxf.services.sts$cxf-services-sts-core/builds/2012-03-03_06-06-15/archive/org.apache.cxf.services.sts/cxf-services-sts-core/2.6.0-20120303.060709-40/cxf-services-sts-core-2.6.0-20120303.060709-40-javadoc.jar
[INFO] ------------------------------------------------------------------------
[INFO] Building Apache CXF STS war deployment
[INFO]    task-segment: [clean, deploy]
[INFO] ------------------------------------------------------------------------
[INFO] [clean:clean {execution: default-clean}]
[INFO] Deleting <https://builds.apache.org/job/CXF-trunk-deploy/ws/trunk/services/sts/sts-war/target>
Downloading: http://repo1.maven.org/maven2/org/apache/maven/plugins/maven-war-plugin/2.1-alpha-2/maven-war-plugin-2.1-alpha-2.pom

Downloading: http://repo1.maven.org/maven2/org/apache/maven/plugins/maven-war-plugin/2.1-alpha-2/maven-war-plugin-2.1-alpha-2.jar

[INFO] [bundle:cleanVersions {execution: versions}]
[INFO] [cxf-xml2fastinfoset:xml2fastinfoset {execution: xml2fastinfoset}]
[INFO] [remote-resources:process {execution: default}]
[INFO] snapshot org.apache.cxf.services.sts:cxf-services-sts-core:2.6.0-SNAPSHOT: checking
for updates from apache.snapshots
[debug] execute contextualize
[INFO] [resources:resources {execution: default-resources}]
[INFO] Using 'UTF-8' encoding to copy filtered resources.
[INFO] Copying 0 resource
[INFO] Copying 5 resources
[INFO] skip non existing resourceDirectory <https://builds.apache.org/job/CXF-trunk-deploy/ws/trunk/services/sts/sts-war/src/main/resources-filtered>
[INFO] skip non existing resourceDirectory <https://builds.apache.org/job/CXF-trunk-deploy/ws/trunk/services/sts/sts-war/target/generated/src/main/resources>
[INFO] Copying 3 resources
[INFO] [compiler:compile {execution: default-compile}]
[INFO] Compiling 1 source file to <https://builds.apache.org/job/CXF-trunk-deploy/ws/trunk/services/sts/sts-war/target/classes>
[INFO] snapshot org.apache.cxf:cxf-rt-ws-security:2.6.0-SNAPSHOT: checking for updates from
apache.snapshots
[INFO] snapshot org.apache.cxf:cxf-rt-ws-addr:2.6.0-SNAPSHOT: checking for updates from apache.snapshots
[INFO] [bundle:manifest {execution: bundle-manifest}]
[WARNING] Ignoring project type war - supportedProjectTypes = [jar, bundle]
[debug] execute contextualize
[INFO] [resources:testResources {execution: default-testResources}]
[INFO] Using 'UTF-8' encoding to copy filtered resources.
[INFO] skip non existing resourceDirectory <https://builds.apache.org/job/CXF-trunk-deploy/ws/trunk/services/sts/sts-war/src/test/java>
[INFO] skip non existing resourceDirectory <https://builds.apache.org/job/CXF-trunk-deploy/ws/trunk/services/sts/sts-war/src/test/resources>
[INFO] skip non existing resourceDirectory <https://builds.apache.org/job/CXF-trunk-deploy/ws/trunk/services/sts/sts-war/target/generated/src/test/resources>
[INFO] Copying 3 resources
[INFO] [compiler:testCompile {execution: default-testCompile}]
[INFO] No sources to compile
[INFO] [surefire:test {execution: default-test}]
[INFO] Tests are skipped.
[JENKINS] Recording test results
Downloading: http://repo1.maven.org/maven2/com/thoughtworks/xstream/xstream/1.2.2/xstream-1.2.2.pom

Downloading: http://repo1.maven.org/maven2/com/thoughtworks/xstream/xstream-parent/1.2.2/xstream-parent-1.2.2.pom

Downloading: http://repository.codehaus.org/xpp3/xpp3_min/1.1.3.4.O/xpp3_min-1.1.3.4.O.pom
[INFO] Unable to find resource 'xpp3:xpp3_min:pom:1.1.3.4.O' in repository codehaus-repository
(http://repository.codehaus.org)
Downloading: http://repo1.maven.org/maven2/xpp3/xpp3_min/1.1.3.4.O/xpp3_min-1.1.3.4.O.pom

Downloading: http://repo1.maven.org/maven2/org/apache/maven/shared/maven-filtering/1.0-beta-1/maven-filtering-1.0-beta-1.pom

Downloading: http://repo1.maven.org/maven2/com/thoughtworks/xstream/xstream/1.2.2/xstream-1.2.2.jar
Downloading: http://repo1.maven.org/maven2/org/apache/maven/shared/maven-filtering/1.0-beta-1/maven-filtering-1.0-beta-1.jar
Downloading: http://repository.codehaus.org/xpp3/xpp3_min/1.1.3.4.O/xpp3_min-1.1.3.4.O.jar
[INFO] Unable to find resource 'xpp3:xpp3_min:jar:1.1.3.4.O' in repository codehaus-repository
(http://repository.codehaus.org)
Downloading: http://repo1.maven.org/maven2/xpp3/xpp3_min/1.1.3.4.O/xpp3_min-1.1.3.4.O.jar



[INFO] [war:war {execution: default-war}]
[INFO] Packaging webapp
[INFO] Assembling webapp[cxf-services-sts-war] in [<https://builds.apache.org/job/CXF-trunk-deploy/ws/trunk/services/sts/sts-war/target/SecurityTokenService]>
[INFO] Processing war project
[INFO] Copying webapp resources[<https://builds.apache.org/job/CXF-trunk-deploy/ws/trunk/services/sts/sts-war/src/main/webapp]>
[INFO] Webapp assembled in[244 msecs]
[INFO] Building war: <https://builds.apache.org/job/CXF-trunk-deploy/ws/trunk/services/sts/sts-war/target/SecurityTokenService.war>
[INFO] [source:jar-no-fork {execution: attach-sources}]
[INFO] org already added, skipping
[INFO] org/apache already added, skipping
[INFO] org/apache/cxf already added, skipping
[INFO] org/apache/cxf/sts already added, skipping
[INFO] org/apache/cxf/sts/war already added, skipping
[INFO] META-INF already added, skipping
[INFO] META-INF/NOTICE already added, skipping
[INFO] META-INF/DEPENDENCIES already added, skipping
[INFO] META-INF/LICENSE already added, skipping
[INFO] Building jar: <https://builds.apache.org/job/CXF-trunk-deploy/ws/trunk/services/sts/sts-war/target/SecurityTokenService-sources.jar>
[INFO] org already added, skipping
[INFO] org/apache already added, skipping
[INFO] org/apache/cxf already added, skipping
[INFO] org/apache/cxf/sts already added, skipping
[INFO] org/apache/cxf/sts/war already added, skipping
[INFO] META-INF already added, skipping
[INFO] META-INF/NOTICE already added, skipping
[INFO] META-INF/DEPENDENCIES already added, skipping
[INFO] META-INF/LICENSE already added, skipping
[INFO] [javadoc:jar {execution: attach-javadocs}]
[INFO] Building jar: <https://builds.apache.org/job/CXF-trunk-deploy/ws/trunk/services/sts/sts-war/target/SecurityTokenService-javadoc.jar>
[INFO] [install:install {execution: default-install}]
[INFO] Installing <https://builds.apache.org/job/CXF-trunk-deploy/ws/trunk/services/sts/sts-war/target/SecurityTokenService.war>
to /home/jenkins/jenkins-slave/maven-repositories/1/org/apache/cxf/services/sts/cxf-services-sts-war/2.6.0-SNAPSHOT/cxf-services-sts-war-2.6.0-SNAPSHOT.war
[INFO] Installing <https://builds.apache.org/job/CXF-trunk-deploy/ws/trunk/services/sts/sts-war/target/SecurityTokenService-sources.jar>
to /home/jenkins/jenkins-slave/maven-repositories/1/org/apache/cxf/services/sts/cxf-services-sts-war/2.6.0-SNAPSHOT/cxf-services-sts-war-2.6.0-SNAPSHOT-sources.jar
[INFO] Installing <https://builds.apache.org/job/CXF-trunk-deploy/ws/trunk/services/sts/sts-war/target/SecurityTokenService-javadoc.jar>
to /home/jenkins/jenkins-slave/maven-repositories/1/org/apache/cxf/services/sts/cxf-services-sts-war/2.6.0-SNAPSHOT/cxf-services-sts-war-2.6.0-SNAPSHOT-javadoc.jar
[INFO] [deploy:deploy {execution: default-deploy}]
[INFO] Retrieving previous build number from apache.snapshots.https
[WARNING] *** CHECKSUM FAILED - Checksum failed on download: local = '1ac9e6044ebe33dc6152a16a8a407f7afed5e141';
remote = '7dd7e39ac9ed4839c85bba7b031abe2fc66f7e80' - RETRYING
[WARNING] *** CHECKSUM FAILED - Checksum failed on download: local = '1ac9e6044ebe33dc6152a16a8a407f7afed5e141';
remote = '7dd7e39ac9ed4839c85bba7b031abe2fc66f7e80' - IGNORING
Uploading: https://repository.apache.org/content/repositories/snapshots/org/apache/cxf/services/sts/cxf-services-sts-war/2.6.0-SNAPSHOT/cxf-services-sts-war-2.6.0-20120303.060709-40.war
16762K uploaded  (cxf-services-sts-war-2.6.0-20120303.060709-40.war)
[INFO] Retrieving previous metadata from apache.snapshots.https
[INFO] Uploading repository metadata for: 'artifact org.apache.cxf.services.sts:cxf-services-sts-war'
[INFO] Uploading project information for cxf-services-sts-war 2.6.0-20120303.060709-40
[INFO] Retrieving previous metadata from apache.snapshots.https
[WARNING] *** CHECKSUM FAILED - Checksum failed on download: local = '1ac9e6044ebe33dc6152a16a8a407f7afed5e141';
remote = '7dd7e39ac9ed4839c85bba7b031abe2fc66f7e80' - RETRYING
[WARNING] *** CHECKSUM FAILED - Checksum failed on download: local = '1ac9e6044ebe33dc6152a16a8a407f7afed5e141';
remote = '7dd7e39ac9ed4839c85bba7b031abe2fc66f7e80' - IGNORING
[INFO] Uploading repository metadata for: 'snapshot org.apache.cxf.services.sts:cxf-services-sts-war:2.6.0-SNAPSHOT'
[INFO] Retrieving previous build number from apache.snapshots.https
Uploading: https://repository.apache.org/content/repositories/snapshots/org/apache/cxf/services/sts/cxf-services-sts-war/2.6.0-SNAPSHOT/cxf-services-sts-war-2.6.0-20120303.060709-40-sources.jar
14K uploaded  (cxf-services-sts-war-2.6.0-20120303.060709-40-sources.jar)
[INFO] Retrieving previous build number from apache.snapshots.https
Uploading: https://repository.apache.org/content/repositories/snapshots/org/apache/cxf/services/sts/cxf-services-sts-war/2.6.0-SNAPSHOT/cxf-services-sts-war-2.6.0-20120303.060709-40-javadoc.jar
26K uploaded  (cxf-services-sts-war-2.6.0-20120303.060709-40-javadoc.jar)
Mar 3, 2012 6:31:15 AM hudson.remoting.Channel$ReaderThread run
SEVERE: I/O error in channel channel
java.io.StreamCorruptedException
	at java.io.ObjectInputStream.readObject0(ObjectInputStream.java:1332)
	at java.io.ObjectInputStream.readObject(ObjectInputStream.java:348)
	at hudson.remoting.Channel$ReaderThread.run(Channel.java:1127)
channel stopped
[INFO] ------------------------------------------------------------------------
[ERROR] FATAL ERROR
[INFO] ------------------------------------------------------------------------
[INFO] null
[INFO] ------------------------------------------------------------------------
[INFO] Trace
java.lang.reflect.UndeclaredThrowableException
	at $Proxy2.isArchivingDisabled(Unknown Source)
	at hudson.maven.MavenBuildProxy$Filter.isArchivingDisabled(MavenBuildProxy.java:227)
	at hudson.maven.reporters.MavenArtifact.archive(MavenArtifact.java:223)
	at hudson.maven.reporters.MavenArtifactArchiver.postBuild(MavenArtifactArchiver.java:106)
	at hudson.maven.Maven2Builder.postModule(Maven2Builder.java:127)
	at hudson.maven.MavenBuilder$Adapter.fireLeaveModule(MavenBuilder.java:327)
	at hudson.maven.MavenBuilder$Adapter.postBuild(MavenBuilder.java:285)
	at org.apache.maven.lifecycle.LifecycleExecutorInterceptor.execute(LifecycleExecutorInterceptor.java:68)
	at org.apache.maven.DefaultMaven.doExecute(DefaultMaven.java:328)
	at org.apache.maven.DefaultMaven.execute(DefaultMaven.java:138)
	at org.apache.maven.cli.MavenCli.main(MavenCli.java:362)
	at sun.reflect.NativeMethodAccessorImpl.invoke0(Native Method)
	at sun.reflect.NativeMethodAccessorImpl.invoke(NativeMethodAccessorImpl.java:39)
	at sun.reflect.DelegatingMethodAccessorImpl.invoke(DelegatingMethodAccessorImpl.java:25)
	at java.lang.reflect.Method.invoke(Method.java:592)
	at org.codehaus.classworlds.Launcher.launchEnhanced(Launcher.java:315)
	at org.codehaus.classworlds.Launcher.launch(Launcher.java:255)
	at hudson.maven.agent.Main.launch(Main.java:185)
	at hudson.maven.MavenBuilder.call(MavenBuilder.java:151)
	at hudson.maven.Maven2Builder.call(Maven2Builder.java:77)
	at hudson.maven.Maven2Builder.call(Maven2Builder.java:53)
	at hudson.remoting.UserRequest.perform(UserRequest.java:118)
	at hudson.remoting.UserRequest.perform(UserRequest.java:48)
	at hudson.remoting.Request$2.run(Request.java:287)
	at hudson.remoting.InterceptingExecutorService$1.call(InterceptingExecutorService.java:72)
	at java.util.concurrent.FutureTask$Sync.innerRun(FutureTask.java:269)
	at java.util.concurrent.FutureTask.run(FutureTask.java:123)
	at java.util.concurrent.ThreadPoolExecutor$Worker.runTask(ThreadPoolExecutor.java:651)
	at java.util.concurrent.ThreadPoolExecutor$Worker.run(ThreadPoolExecutor.java:676)
	at java.lang.Thread.run(Thread.java:595)
Caused by: hudson.remoting.ChannelClosedException: channel is already closed
	at hudson.remoting.Channel.send(Channel.java:499)
	at hudson.remoting.Request.call(Request.java:110)
	at hudson.remoting.Channel.call(Channel.java:681)
	at hudson.remoting.RemoteInvocationHandler.invoke(RemoteInvocationHandler.java:158)
	... 30 more
Caused by: java.io.StreamCorruptedException
	at java.io.ObjectInputStream.readObject0(ObjectInputStream.java:1332)
	at java.io.ObjectInputStream.readObject(ObjectInputStream.java:348)
	at hudson.remoting.Channel$ReaderThread.run(Channel.java:1127)
[INFO] ------------------------------------------------------------------------
[INFO] Total time: 24 minutes 34 seconds
[INFO] Finished at: Sat Mar 03 06:31:15 UTC 2012
Sending e-mails to: notifications@cxf.apache.org
ERROR: Maven JVM terminated unexpectedly with exit code 0



Mime
View raw message