cxf-notifications mailing list archives

Site index · List index
Message view « Date » · « Thread »
Top « Date » · « Thread »
From Apache Jenkins Server <jenk...@builds.apache.org>
Subject Build failed in Jenkins: CXF-trunk-deploy #784
Date Wed, 15 Feb 2012 16:23:58 GMT
See <https://builds.apache.org/job/CXF-trunk-deploy/784/changes>

Changes:

[gmazza] Added @Provider annotation to DataSourceProvider

[dkulp] Change how cherry-pick is called and print the running command in a form that allows
copy/paste for testing

[dkulp] Don't need the +1 as cur contains the right value now

[dkulp] Fix compile failure with non-eclipse compiler

[dkulp] Minor updates to work better with git and svn

[coheigea] Don't insist on an AlgorithmSuite for WS-SP 1.1

[coheigea] Fixing incorrect HttpsToken assertions in STS wsdls

[coheigea] Adding stricter SecurityPolicy parsing

[sergeyb] [CXF-3380] Enabling DataSourceProvider by default

[dkulp] New version of DoMerges that no longer needs svnmerge.py as it handles
it all internally.   Also works within a git clone instead of svn
checkout.

[dkulp] remove props that I accedentally put here

[dkulp] Blocking revisions 1241942 via  git from
https://svn.apache.org/repos/asf/cxf/trunk

........
  r1241942 | cschneider | 2012-02-08 10:40:07 -0500 (Wed, 08 Feb 2012) | 2 lines
  
  CXF-4090 Depending on http-whiteboard feature instead of the pax web bundles. this fixes
issues when karaf uses a different pax web version
  
........

[dkulp] Recording revisions 1244146 via  git from
https://svn.apache.org/repos/asf/cxf/trunk

........
  r1244146 | dkulp | 2012-02-14 13:23:23 -0500 (Tue, 14 Feb 2012) | 3 lines
  
  [CXF-4110] Fix problems of description not being set in servicemodel
  which is leading to @Policy annotations not working.
  
........

[dkulp] [CXF-4110] Fix problems of description not being set in servicemodel
which is leading to @Policy annotations not working.

[dkulp] The serversocket lock doesn't seem to be 100% reliable.  Stick with a
randomo starting point

[sergeyb] [CXf-4109] Removing a reference to URI.getHost()

[sergeyb] [CXF-4107] Defaulting to 'callback' padding if no custom value is provided

[ningjiang] CXF-4105 fixed the mapping issue of Slf4jLogger

------------------------------------------
[...truncated 2446 lines...]
[INFO] Installing <https://builds.apache.org/job/CXF-trunk-deploy/ws/trunk/maven-plugins/codegen-plugin/target/cxf-codegen-plugin-2.6.0-SNAPSHOT.jar>
to <https://builds.apache.org/job/CXF-trunk-deploy/ws/.repository/org/apache/cxf/cxf-codegen-plugin/2.6.0-SNAPSHOT/cxf-codegen-plugin-2.6.0-SNAPSHOT.jar>
[INFO] Installing <https://builds.apache.org/job/CXF-trunk-deploy/ws/trunk/maven-plugins/codegen-plugin/target/cxf-codegen-plugin-2.6.0-SNAPSHOT-sources.jar>
to <https://builds.apache.org/job/CXF-trunk-deploy/ws/.repository/org/apache/cxf/cxf-codegen-plugin/2.6.0-SNAPSHOT/cxf-codegen-plugin-2.6.0-SNAPSHOT-sources.jar>
[INFO] Installing <https://builds.apache.org/job/CXF-trunk-deploy/ws/trunk/maven-plugins/codegen-plugin/target/cxf-codegen-plugin-2.6.0-SNAPSHOT-javadoc.jar>
to <https://builds.apache.org/job/CXF-trunk-deploy/ws/.repository/org/apache/cxf/cxf-codegen-plugin/2.6.0-SNAPSHOT/cxf-codegen-plugin-2.6.0-SNAPSHOT-javadoc.jar>
[INFO] [deploy:deploy {execution: default-deploy}]
[INFO] Retrieving previous build number from apache.snapshots.https
[WARNING] *** CHECKSUM FAILED - Checksum failed on download: local = '1d368347effc67602ff44e40a93aef3225292237';
remote = '691cb94083877e700af0bf68af1a1a39b8bcceb4' - RETRYING
[WARNING] *** CHECKSUM FAILED - Checksum failed on download: local = '1d368347effc67602ff44e40a93aef3225292237';
remote = '691cb94083877e700af0bf68af1a1a39b8bcceb4' - IGNORING
Uploading: https://repository.apache.org/content/repositories/snapshots/org/apache/cxf/cxf-codegen-plugin/2.6.0-SNAPSHOT/cxf-codegen-plugin-2.6.0-20120215.161933-31.jar
53K uploaded  (cxf-codegen-plugin-2.6.0-20120215.161933-31.jar)
[INFO] Retrieving previous metadata from apache.snapshots.https
[INFO] Uploading repository metadata for: 'org.apache.cxf'
[INFO] Retrieving previous metadata from apache.snapshots.https
[WARNING] *** CHECKSUM FAILED - Checksum failed on download: local = '1d368347effc67602ff44e40a93aef3225292237';
remote = '691cb94083877e700af0bf68af1a1a39b8bcceb4' - RETRYING
[WARNING] *** CHECKSUM FAILED - Checksum failed on download: local = '1d368347effc67602ff44e40a93aef3225292237';
remote = '691cb94083877e700af0bf68af1a1a39b8bcceb4' - IGNORING
[INFO] Uploading repository metadata for: 'snapshot org.apache.cxf:cxf-codegen-plugin:2.6.0-SNAPSHOT'
[INFO] Uploading project information for cxf-codegen-plugin 2.6.0-20120215.161933-31
[INFO] Retrieving previous metadata from apache.snapshots.https
[WARNING] *** CHECKSUM FAILED - Checksum failed on download: local = '6cec53226730bade713d92b416a29dd215d685a6';
remote = '6c52f1801defd3c33ea594cd592fc385c76585f4' - RETRYING
[WARNING] *** CHECKSUM FAILED - Checksum failed on download: local = '6cec53226730bade713d92b416a29dd215d685a6';
remote = '6c52f1801defd3c33ea594cd592fc385c76585f4' - IGNORING
[INFO] Uploading repository metadata for: 'artifact org.apache.cxf:cxf-codegen-plugin'
[INFO] Retrieving previous build number from apache.snapshots.https
Uploading: https://repository.apache.org/content/repositories/snapshots/org/apache/cxf/cxf-codegen-plugin/2.6.0-SNAPSHOT/cxf-codegen-plugin-2.6.0-20120215.161933-31-sources.jar
39K uploaded  (cxf-codegen-plugin-2.6.0-20120215.161933-31-sources.jar)
[INFO] Retrieving previous build number from apache.snapshots.https
Uploading: https://repository.apache.org/content/repositories/snapshots/org/apache/cxf/cxf-codegen-plugin/2.6.0-SNAPSHOT/cxf-codegen-plugin-2.6.0-20120215.161933-31-javadoc.jar
127K uploaded  (cxf-codegen-plugin-2.6.0-20120215.161933-31-javadoc.jar)
[JENKINS] Archiving <https://builds.apache.org/job/CXF-trunk-deploy/ws/trunk/maven-plugins/codegen-plugin/pom.xml>
to /home/hudson/hudson/jobs/CXF-trunk-deploy/modules/org.apache.cxf$cxf-codegen-plugin/builds/2012-02-15_16-18-42/archive/org.apache.cxf/cxf-codegen-plugin/2.6.0-SNAPSHOT/cxf-codegen-plugin-2.6.0-SNAPSHOT.pom
[JENKINS] Archiving <https://builds.apache.org/job/CXF-trunk-deploy/ws/trunk/maven-plugins/codegen-plugin/target/cxf-codegen-plugin-2.6.0-SNAPSHOT.jar>
to /home/hudson/hudson/jobs/CXF-trunk-deploy/modules/org.apache.cxf$cxf-codegen-plugin/builds/2012-02-15_16-18-42/archive/org.apache.cxf/cxf-codegen-plugin/2.6.0-20120215.161933-31/cxf-codegen-plugin-2.6.0-20120215.161933-31.jar
[JENKINS] Archiving <https://builds.apache.org/job/CXF-trunk-deploy/ws/trunk/maven-plugins/codegen-plugin/target/cxf-codegen-plugin-2.6.0-SNAPSHOT-sources.jar>
to /home/hudson/hudson/jobs/CXF-trunk-deploy/modules/org.apache.cxf$cxf-codegen-plugin/builds/2012-02-15_16-18-42/archive/org.apache.cxf/cxf-codegen-plugin/2.6.0-20120215.161933-31/cxf-codegen-plugin-2.6.0-20120215.161933-31-sources.jar
[JENKINS] Archiving <https://builds.apache.org/job/CXF-trunk-deploy/ws/trunk/maven-plugins/codegen-plugin/target/cxf-codegen-plugin-2.6.0-SNAPSHOT-javadoc.jar>
to /home/hudson/hudson/jobs/CXF-trunk-deploy/modules/org.apache.cxf$cxf-codegen-plugin/builds/2012-02-15_16-18-42/archive/org.apache.cxf/cxf-codegen-plugin/2.6.0-20120215.161933-31/cxf-codegen-plugin-2.6.0-20120215.161933-31-javadoc.jar
[INFO] ------------------------------------------------------------------------
[INFO] Building Apache CXF Test Utilities
[INFO]    task-segment: [clean, deploy]
[INFO] ------------------------------------------------------------------------
[INFO] [clean:clean {execution: default-clean}]
[INFO] Deleting <https://builds.apache.org/job/CXF-trunk-deploy/ws/trunk/testutils/target>
[INFO] [bundle:cleanVersions {execution: versions}]
[WARNING] DEPRECATED [sourceRoot]: Use the build-helper-maven-plugin to bind source directories
[WARNING] DEPRECATED [tasks]: Use target instead
[INFO] [antrun:run {execution: validate}]
[WARNING] Parameter tasks is deprecated, use target instead
[INFO] Executing tasks

main:
    [mkdir] Created dir: <https://builds.apache.org/job/CXF-trunk-deploy/ws/trunk/testutils/target/generated/src/main/resources/wsdl/type_test>
     [xslt] Processing <https://builds.apache.org/job/CXF-trunk-deploy/ws/trunk/testutils/src/main/resources/wsdl/type_test/type_test.xsd>
to <https://builds.apache.org/job/CXF-trunk-deploy/ws/trunk/testutils/target/generated/src/main/resources/wsdl/type_test/type_test_1.xsd>
     [xslt] Loading stylesheet <https://builds.apache.org/job/CXF-trunk-deploy/ws/trunk/testutils/src/main/resources/wsdl/type_test/type_test_ID_xsd.xsl>
     [xslt] Processing <https://builds.apache.org/job/CXF-trunk-deploy/ws/trunk/testutils/src/main/resources/wsdl/type_test/type_test.xsd>
to <https://builds.apache.org/job/CXF-trunk-deploy/ws/trunk/testutils/target/generated/src/main/resources/wsdl/type_test/type_test_2.xsd>
     [xslt] Loading stylesheet <https://builds.apache.org/job/CXF-trunk-deploy/ws/trunk/testutils/src/main/resources/wsdl/type_test/type_test_ID_xsd.xsl>
     [xslt] Processing <https://builds.apache.org/job/CXF-trunk-deploy/ws/trunk/testutils/src/main/resources/wsdl/type_test/type_test.xsd>
to <https://builds.apache.org/job/CXF-trunk-deploy/ws/trunk/testutils/target/generated/src/main/resources/wsdl/type_test/type_test_3.xsd>
     [xslt] Loading stylesheet <https://builds.apache.org/job/CXF-trunk-deploy/ws/trunk/testutils/src/main/resources/wsdl/type_test/type_test_ID_xsd.xsl>
     [xslt] Processing <https://builds.apache.org/job/CXF-trunk-deploy/ws/trunk/testutils/src/main/resources/wsdl/type_test/type_test.xsd>
to <https://builds.apache.org/job/CXF-trunk-deploy/ws/trunk/testutils/target/generated/src/main/resources/wsdl/type_test/type_test_doclit.wsdl>
     [xslt] Loading stylesheet <https://builds.apache.org/job/CXF-trunk-deploy/ws/trunk/testutils/src/main/resources/wsdl/type_test/type_test_wsdl.xsl>
     [xslt] Processing <https://builds.apache.org/job/CXF-trunk-deploy/ws/trunk/testutils/src/main/resources/wsdl/type_test/type_test.xsd>
to <https://builds.apache.org/job/CXF-trunk-deploy/ws/trunk/testutils/target/generated/src/main/resources/wsdl/type_test/type_test_rpclit.wsdl>
     [xslt] Loading stylesheet <https://builds.apache.org/job/CXF-trunk-deploy/ws/trunk/testutils/src/main/resources/wsdl/type_test/type_test_wsdl.xsl>
     [xslt] Processing <https://builds.apache.org/job/CXF-trunk-deploy/ws/trunk/testutils/src/main/resources/wsdl/type_test/type_test.xsd>
to <https://builds.apache.org/job/CXF-trunk-deploy/ws/trunk/testutils/target/generated/src/main/resources/wsdl/type_test/type_test_xml_inc.wsdl>
     [xslt] Loading stylesheet <https://builds.apache.org/job/CXF-trunk-deploy/ws/trunk/testutils/src/main/resources/wsdl/type_test/type_test_wsdl.xsl>
     [xslt] Processing <https://builds.apache.org/job/CXF-trunk-deploy/ws/trunk/testutils/src/main/resources/wsdl/type_test/type_test.xsd>
to <https://builds.apache.org/job/CXF-trunk-deploy/ws/trunk/testutils/target/generated/src/main/resources/wsdl/type_test/type_test_xml.wsdl>
     [xslt] Loading stylesheet <https://builds.apache.org/job/CXF-trunk-deploy/ws/trunk/testutils/src/main/resources/wsdl/type_test/type_test_xml_wsdl.xsl>
     [xslt] Processing <https://builds.apache.org/job/CXF-trunk-deploy/ws/trunk/testutils/src/main/resources/wsdl/type_test/type_test.xsd>
to <https://builds.apache.org/job/CXF-trunk-deploy/ws/trunk/testutils/target/generated/src/main/resources/wsdl/type_test/type_test_doclit_soap.wsdl>
     [xslt] Loading stylesheet <https://builds.apache.org/job/CXF-trunk-deploy/ws/trunk/testutils/src/main/resources/wsdl/type_test/type_test_soap_wsdl.xsl>
     [xslt] Processing <https://builds.apache.org/job/CXF-trunk-deploy/ws/trunk/testutils/src/main/resources/wsdl/type_test/type_test.xsd>
to <https://builds.apache.org/job/CXF-trunk-deploy/ws/trunk/testutils/target/generated/src/main/resources/wsdl/type_test/type_test_rpclit_soap.wsdl>
     [xslt] Loading stylesheet <https://builds.apache.org/job/CXF-trunk-deploy/ws/trunk/testutils/src/main/resources/wsdl/type_test/type_test_soap_wsdl.xsl>
    [mkdir] Created dir: <https://builds.apache.org/job/CXF-trunk-deploy/ws/trunk/testutils/target/generated/src/main/java/org/apache/cxf/systest/type_test>
     [xslt] Processing <https://builds.apache.org/job/CXF-trunk-deploy/ws/trunk/testutils/src/main/resources/wsdl/type_test/type_test.xsd>
to <https://builds.apache.org/job/CXF-trunk-deploy/ws/trunk/testutils/target/generated/src/main/java/org/apache/cxf/systest/type_test/TypeTestImpl.java>
     [xslt] Loading stylesheet <https://builds.apache.org/job/CXF-trunk-deploy/ws/trunk/testutils/src/main/resources/wsdl/type_test/type_test_impl_java.xsl>
     [xslt] Processing <https://builds.apache.org/job/CXF-trunk-deploy/ws/trunk/testutils/src/main/resources/wsdl/type_test/type_test.xsd>
to <https://builds.apache.org/job/CXF-trunk-deploy/ws/trunk/testutils/target/generated/src/main/java/org/apache/cxf/systest/type_test/TypeTestTester.java>
     [xslt] Loading stylesheet <https://builds.apache.org/job/CXF-trunk-deploy/ws/trunk/testutils/src/main/resources/wsdl/type_test/type_test_tester_java.xsl>
[INFO] Executed tasks
[INFO] Registering compile source root <https://builds.apache.org/job/CXF-trunk-deploy/ws/trunk/testutils/target/generated/src/main/java>
[INFO] [cxf-xml2fastinfoset:xml2fastinfoset {execution: xml2fastinfoset}]
[INFO] [cxf-codegen:wsdl2java {execution: generate-sources}]
[INFO] Running code generation in fork mode...
[INFO] Building jar: /tmp/cxf-tmp-46526/cxf-codegen3331153710563845338.jar
[INFO] 
Loading FrontEnd jaxws ...
Loading DataBinding jaxb ...
wsdl2java -d <https://builds.apache.org/job/CXF-trunk-deploy/ws/trunk/testutils/target/generated/src/main/java>
-mark-generated -faultSerialVersionUID 1 -verbose <https://builds.apache.org/job/CXF-trunk-deploy/ws/trunk/testutils/target/generated/src/main/resources/wsdl/type_test/type_test_xml.wsdl>
wsdl2java - Apache CXF 2.6.0-SNAPSHOT
[JENKINS] Archiving <https://builds.apache.org/job/CXF-trunk-deploy/ws/trunk/testutils/pom.xml>
to /home/hudson/hudson/jobs/CXF-trunk-deploy/modules/org.apache.cxf$cxf-testutils/builds/2012-02-15_16-18-42/archive/org.apache.cxf/cxf-testutils/2.6.0-SNAPSHOT/cxf-testutils-2.6.0-SNAPSHOT.pom
[INFO] ------------------------------------------------------------------------
[ERROR] BUILD ERROR
[INFO] ------------------------------------------------------------------------
[INFO] 
Exit code: 1 - Exception in thread "main" org.apache.cxf.tools.common.ToolException: java.lang.reflect.UndeclaredThrowableException
	at org.apache.cxf.tools.wsdlto.WSDLToJavaContainer.execute(WSDLToJavaContainer.java:293)
	at org.apache.cxf.tools.common.toolspec.ToolRunner.runTool(ToolRunner.java:103)
	at org.apache.cxf.tools.wsdlto.WSDLToJava.run(WSDLToJava.java:113)
	at org.apache.cxf.tools.wsdlto.WSDLToJava.run(WSDLToJava.java:86)
	at org.apache.cxf.maven_plugin.wsdl2java.ForkOnceWSDL2Java.main(ForkOnceWSDL2Java.java:50)
Caused by: java.lang.reflect.UndeclaredThrowableException
	at $Proxy40.required(Unknown Source)
	at com.sun.tools.xjc.generator.bean.field.AbstractField.annotateReference(AbstractField.java:192)
	at com.sun.tools.xjc.generator.bean.field.AbstractField.annotate(AbstractField.java:161)
	at com.sun.tools.xjc.generator.bean.field.AbstractFieldWithVar.createField(AbstractFieldWithVar.java:80)
	at com.sun.tools.xjc.generator.bean.field.SingleField.<init>(SingleField.java:94)
	at com.sun.tools.xjc.generator.bean.field.SingleField.<init>(SingleField.java:81)
	at sun.reflect.GeneratedConstructorAccessor9.newInstance(Unknown Source)
	at sun.reflect.DelegatingConstructorAccessorImpl.newInstance(DelegatingConstructorAccessorImpl.java:27)
	at java.lang.reflect.Constructor.newInstance(Constructor.java:513)
	at com.sun.tools.xjc.generator.bean.field.GenericFieldRenderer.generate(GenericFieldRenderer.java:69)
	at com.sun.tools.xjc.generator.bean.field.DefaultFieldRenderer.generate(DefaultFieldRenderer.java:82)
	at com.sun.tools.xjc.generator.bean.BeanGenerator.generateFieldDecl(BeanGenerator.java:774)
	at com.sun.tools.xjc.generator.bean.BeanGenerator.generateClassBody(BeanGenerator.java:555)
	at com.sun.tools.xjc.generator.bean.BeanGenerator.<init>(BeanGenerator.java:258)
	at com.sun.tools.xjc.generator.bean.BeanGenerator.generate(BeanGenerator.java:166)
	at com.sun.tools.xjc.model.Model.generateCode(Model.java:290)
	at com.sun.tools.xjc.api.impl.s2j.SchemaCompilerImpl.bind(SchemaCompilerImpl.java:283)
	at com.sun.tools.xjc.api.impl.s2j.SchemaCompilerImpl.bind(SchemaCompilerImpl.java:94)
	at org.apache.cxf.tools.wsdlto.databinding.jaxb.JAXBDataBinding.initialize(JAXBDataBinding.java:391)
	at org.apache.cxf.tools.wsdlto.WSDLToJavaContainer.generateTypes(WSDLToJavaContainer.java:588)
	at org.apache.cxf.tools.wsdlto.WSDLToJavaContainer.processWsdl(WSDLToJavaContainer.java:242)
	at org.apache.cxf.tools.wsdlto.WSDLToJavaContainer.execute(WSDLToJavaContainer.java:139)
	at org.apache.cxf.tools.wsdlto.WSDLToJavaContainer.execute(WSDLToJavaContainer.java:285)
	... 4 more
Caused by: java.lang.NoSuchMethodException: javax.xml.bind.annotation.XmlElementRef.required()
	at java.lang.Class.getDeclaredMethod(Class.java:1937)
	at com.sun.codemodel.TypedAnnotationWriter.invoke(TypedAnnotationWriter.java:112)
	... 27 more

Command line was: /home/jenkins/tools/java/jdk1.6.0_27-32/jre/bin/java -jar /tmp/cxf-tmp-46526/cxf-codegen3331153710563845338.jar
/tmp/cxf-tmp-46526/cxf-w2j6275498695118819355args


[INFO] ------------------------------------------------------------------------
[INFO] Trace
org.apache.maven.lifecycle.LifecycleExecutionException: 
Exit code: 1 - Exception in thread "main" org.apache.cxf.tools.common.ToolException: java.lang.reflect.UndeclaredThrowableException
	at org.apache.cxf.tools.wsdlto.WSDLToJavaContainer.execute(WSDLToJavaContainer.java:293)
	at org.apache.cxf.tools.common.toolspec.ToolRunner.runTool(ToolRunner.java:103)
	at org.apache.cxf.tools.wsdlto.WSDLToJava.run(WSDLToJava.java:113)
	at org.apache.cxf.tools.wsdlto.WSDLToJava.run(WSDLToJava.java:86)
	at org.apache.cxf.maven_plugin.wsdl2java.ForkOnceWSDL2Java.main(ForkOnceWSDL2Java.java:50)
Caused by: java.lang.reflect.UndeclaredThrowableException
	at $Proxy40.required(Unknown Source)
	at com.sun.tools.xjc.generator.bean.field.AbstractField.annotateReference(AbstractField.java:192)
	at com.sun.tools.xjc.generator.bean.field.AbstractField.annotate(AbstractField.java:161)
	at com.sun.tools.xjc.generator.bean.field.AbstractFieldWithVar.createField(AbstractFieldWithVar.java:80)
	at com.sun.tools.xjc.generator.bean.field.SingleField.<init>(SingleField.java:94)
	at com.sun.tools.xjc.generator.bean.field.SingleField.<init>(SingleField.java:81)
	at sun.reflect.GeneratedConstructorAccessor9.newInstance(Unknown Source)
	at sun.reflect.DelegatingConstructorAccessorImpl.newInstance(DelegatingConstructorAccessorImpl.java:27)
	at java.lang.reflect.Constructor.newInstance(Constructor.java:513)
	at com.sun.tools.xjc.generator.bean.field.GenericFieldRenderer.generate(GenericFieldRenderer.java:69)
	at com.sun.tools.xjc.generator.bean.field.DefaultFieldRenderer.generate(DefaultFieldRenderer.java:82)
	at com.sun.tools.xjc.generator.bean.BeanGenerator.generateFieldDecl(BeanGenerator.java:774)
	at com.sun.tools.xjc.generator.bean.BeanGenerator.generateClassBody(BeanGenerator.java:555)
	at com.sun.tools.xjc.generator.bean.BeanGenerator.<init>(BeanGenerator.java:258)
	at com.sun.tools.xjc.generator.bean.BeanGenerator.generate(BeanGenerator.java:166)
	at com.sun.tools.xjc.model.Model.generateCode(Model.java:290)
	at com.sun.tools.xjc.api.impl.s2j.SchemaCompilerImpl.bind(SchemaCompilerImpl.java:283)
	at com.sun.tools.xjc.api.impl.s2j.SchemaCompilerImpl.bind(SchemaCompilerImpl.java:94)
	at org.apache.cxf.tools.wsdlto.databinding.jaxb.JAXBDataBinding.initialize(JAXBDataBinding.java:391)
	at org.apache.cxf.tools.wsdlto.WSDLToJavaContainer.generateTypes(WSDLToJavaContainer.java:588)
	at org.apache.cxf.tools.wsdlto.WSDLToJavaContainer.processWsdl(WSDLToJavaContainer.java:242)
	at org.apache.cxf.tools.wsdlto.WSDLToJavaContainer.execute(WSDLToJavaContainer.java:139)
	at org.apache.cxf.tools.wsdlto.WSDLToJavaContainer.execute(WSDLToJavaContainer.java:285)
	... 4 more
Caused by: java.lang.NoSuchMethodException: javax.xml.bind.annotation.XmlElementRef.required()
	at java.lang.Class.getDeclaredMethod(Class.java:1937)
	at com.sun.codemodel.TypedAnnotationWriter.invoke(TypedAnnotationWriter.java:112)
	... 27 more

Command line was: /home/jenkins/tools/java/jdk1.6.0_27-32/jre/bin/java -jar /tmp/cxf-tmp-46526/cxf-codegen3331153710563845338.jar
/tmp/cxf-tmp-46526/cxf-w2j6275498695118819355args


	at org.apache.maven.lifecycle.DefaultLifecycleExecutor.executeGoals(DefaultLifecycleExecutor.java:719)
	at org.apache.maven.lifecycle.DefaultLifecycleExecutor.executeGoalWithLifecycle(DefaultLifecycleExecutor.java:556)
	at org.apache.maven.lifecycle.DefaultLifecycleExecutor.executeGoal(DefaultLifecycleExecutor.java:535)
	at org.apache.maven.lifecycle.DefaultLifecycleExecutor.executeGoalAndHandleFailures(DefaultLifecycleExecutor.java:387)
	at org.apache.maven.lifecycle.DefaultLifecycleExecutor.executeTaskSegments(DefaultLifecycleExecutor.java:348)
	at org.apache.maven.lifecycle.DefaultLifecycleExecutor.execute(DefaultLifecycleExecutor.java:180)
	at org.apache.maven.lifecycle.LifecycleExecutorInterceptor.execute(LifecycleExecutorInterceptor.java:65)
	at org.apache.maven.DefaultMaven.doExecute(DefaultMaven.java:328)
	at org.apache.maven.DefaultMaven.execute(DefaultMaven.java:138)
	at org.apache.maven.cli.MavenCli.main(MavenCli.java:362)
	at sun.reflect.NativeMethodAccessorImpl.invoke0(Native Method)
	at sun.reflect.NativeMethodAccessorImpl.invoke(NativeMethodAccessorImpl.java:39)
	at sun.reflect.DelegatingMethodAccessorImpl.invoke(DelegatingMethodAccessorImpl.java:25)
	at java.lang.reflect.Method.invoke(Method.java:597)
	at org.codehaus.classworlds.Launcher.launchEnhanced(Launcher.java:315)
	at org.codehaus.classworlds.Launcher.launch(Launcher.java:255)
	at hudson.maven.agent.Main.launch(Main.java:185)
	at hudson.maven.MavenBuilder.call(MavenBuilder.java:151)
	at hudson.maven.Maven2Builder.call(Maven2Builder.java:77)
	at hudson.maven.Maven2Builder.call(Maven2Builder.java:53)
	at hudson.remoting.UserRequest.perform(UserRequest.java:118)
	at hudson.remoting.UserRequest.perform(UserRequest.java:48)
	at hudson.remoting.Request$2.run(Request.java:287)
	at hudson.remoting.InterceptingExecutorService$1.call(InterceptingExecutorService.java:72)
	at java.util.concurrent.FutureTask$Sync.innerRun(FutureTask.java:303)
	at java.util.concurrent.FutureTask.run(FutureTask.java:138)
	at java.util.concurrent.ThreadPoolExecutor$Worker.runTask(ThreadPoolExecutor.java:886)
	at java.util.concurrent.ThreadPoolExecutor$Worker.run(ThreadPoolExecutor.java:908)
	at java.lang.Thread.run(Thread.java:662)
Caused by: org.apache.maven.plugin.MojoExecutionException: 
Exit code: 1 - Exception in thread "main" org.apache.cxf.tools.common.ToolException: java.lang.reflect.UndeclaredThrowableException
	at org.apache.cxf.tools.wsdlto.WSDLToJavaContainer.execute(WSDLToJavaContainer.java:293)
	at org.apache.cxf.tools.common.toolspec.ToolRunner.runTool(ToolRunner.java:103)
	at org.apache.cxf.tools.wsdlto.WSDLToJava.run(WSDLToJava.java:113)
	at org.apache.cxf.tools.wsdlto.WSDLToJava.run(WSDLToJava.java:86)
	at org.apache.cxf.maven_plugin.wsdl2java.ForkOnceWSDL2Java.main(ForkOnceWSDL2Java.java:50)
Caused by: java.lang.reflect.UndeclaredThrowableException
	at $Proxy40.required(Unknown Source)
	at com.sun.tools.xjc.generator.bean.field.AbstractField.annotateReference(AbstractField.java:192)
	at com.sun.tools.xjc.generator.bean.field.AbstractField.annotate(AbstractField.java:161)
	at com.sun.tools.xjc.generator.bean.field.AbstractFieldWithVar.createField(AbstractFieldWithVar.java:80)
	at com.sun.tools.xjc.generator.bean.field.SingleField.<init>(SingleField.java:94)
	at com.sun.tools.xjc.generator.bean.field.SingleField.<init>(SingleField.java:81)
	at sun.reflect.GeneratedConstructorAccessor9.newInstance(Unknown Source)
	at sun.reflect.DelegatingConstructorAccessorImpl.newInstance(DelegatingConstructorAccessorImpl.java:27)
	at java.lang.reflect.Constructor.newInstance(Constructor.java:513)
	at com.sun.tools.xjc.generator.bean.field.GenericFieldRenderer.generate(GenericFieldRenderer.java:69)
	at com.sun.tools.xjc.generator.bean.field.DefaultFieldRenderer.generate(DefaultFieldRenderer.java:82)
	at com.sun.tools.xjc.generator.bean.BeanGenerator.generateFieldDecl(BeanGenerator.java:774)
	at com.sun.tools.xjc.generator.bean.BeanGenerator.generateClassBody(BeanGenerator.java:555)
	at com.sun.tools.xjc.generator.bean.BeanGenerator.<init>(BeanGenerator.java:258)
	at com.sun.tools.xjc.generator.bean.BeanGenerator.generate(BeanGenerator.java:166)
	at com.sun.tools.xjc.model.Model.generateCode(Model.java:290)
	at com.sun.tools.xjc.api.impl.s2j.SchemaCompilerImpl.bind(SchemaCompilerImpl.java:283)
	at com.sun.tools.xjc.api.impl.s2j.SchemaCompilerImpl.bind(SchemaCompilerImpl.java:94)
	at org.apache.cxf.tools.wsdlto.databinding.jaxb.JAXBDataBinding.initialize(JAXBDataBinding.java:391)
	at org.apache.cxf.tools.wsdlto.WSDLToJavaContainer.generateTypes(WSDLToJavaContainer.java:588)
	at org.apache.cxf.tools.wsdlto.WSDLToJavaContainer.processWsdl(WSDLToJavaContainer.java:242)
	at org.apache.cxf.tools.wsdlto.WSDLToJavaContainer.execute(WSDLToJavaContainer.java:139)
	at org.apache.cxf.tools.wsdlto.WSDLToJavaContainer.execute(WSDLToJavaContainer.java:285)
	... 4 more
Caused by: java.lang.NoSuchMethodException: javax.xml.bind.annotation.XmlElementRef.required()
	at java.lang.Class.getDeclaredMethod(Class.java:1937)
	at com.sun.codemodel.TypedAnnotationWriter.invoke(TypedAnnotationWriter.java:112)
	... 27 more

Command line was: /home/jenkins/tools/java/jdk1.6.0_27-32/jre/bin/java -jar /tmp/cxf-tmp-46526/cxf-codegen3331153710563845338.jar
/tmp/cxf-tmp-46526/cxf-w2j6275498695118819355args


	at org.apache.cxf.maven_plugin.AbstractCodegenMoho.runForked(AbstractCodegenMoho.java:482)
	at org.apache.cxf.maven_plugin.AbstractCodegenMoho.forkOnce(AbstractCodegenMoho.java:359)
	at org.apache.cxf.maven_plugin.AbstractCodegenMoho.execute(AbstractCodegenMoho.java:213)
	at org.apache.cxf.maven_plugin.wsdl2java.WSDL2JavaMojo.execute(WSDL2JavaMojo.java:289)
	at org.apache.maven.plugin.DefaultPluginManager.executeMojo(DefaultPluginManager.java:490)
	at hudson.maven.agent.PluginManagerInterceptor.executeMojo(PluginManagerInterceptor.java:182)
	at org.apache.maven.lifecycle.DefaultLifecycleExecutor.executeGoals(DefaultLifecycleExecutor.java:694)
	... 28 more
[INFO] ------------------------------------------------------------------------
[INFO] Total time: 4 minutes 46 seconds
[INFO] Finished at: Wed Feb 15 16:23:54 UTC 2012
[INFO] Final Memory: 218M/444M
[INFO] ------------------------------------------------------------------------
Sending e-mails to: notifications@cxf.apache.org
channel stopped


Mime
View raw message