cxf-notifications mailing list archives

Site index · List index
Message view « Date » · « Thread »
Top « Date » · « Thread »
From Apache Jenkins Server <jenk...@builds.apache.org>
Subject Build failed in Jenkins: CXF-2.5-deploy #24
Date Fri, 17 Feb 2012 06:19:10 GMT
See <https://builds.apache.org/job/CXF-2.5-deploy/24/changes>

Changes:

[coheigea] [CXF-4099] - SignedParts, EncryptedParts policy assertions are silently ignored
on the client side if specified alone
 - Patch applied, thanks.
 - I also added in SignedElements, EncryptedElements and ContentEncryptedElements.


Conflicts:

	rt/ws/security/pom.xml

[dkulp] Recording revisions 1244563 via  git from
https://svn.apache.org/repos/asf/cxf/trunk

........
  r1244563 | gmazza | 2012-02-15 11:12:50 -0500 (Wed, 15 Feb 2012) | 2 lines
  
  Added @Provider annotation to DataSourceProvider
  
........

[dkulp] Merged revisions ﶓ via  git cherry-pick from
https://svn.apache.org/repos/asf/cxf/trunk

........
  r1244563 | gmazza | 2012-02-15 11:12:50 -0500 (Wed, 15 Feb 2012) | 2 lines

  Added @Provider annotation to DataSourceProvider

........

[sergeyb] Merged revisions 1244821 via svnmerge from 
https://svn.apache.org/repos/asf/cxf/trunk

........
  r1244821 | dkulp | 2012-02-16 01:50:59 +0000 (Thu, 16 Feb 2012) | 1 line
  
  Fix failing test
........

[dkulp] Recording revisions 1245072 via  git from
https://svn.apache.org/repos/asf/cxf/trunk

........
  r1245072 | dkulp | 2012-02-16 11:42:05 -0500 (Thu, 16 Feb 2012) | 3 lines
  
  [CXF-4115] Make sure operation name given to provider either matches the
  payload or is null.
  
........

[dkulp] Merged revisions ミ via  git cherry-pick from
https://svn.apache.org/repos/asf/cxf/trunk

........
  r1245072 | dkulp | 2012-02-16 11:42:05 -0500 (Thu, 16 Feb 2012) | 3 lines

  [CXF-4115] Make sure operation name given to provider either matches the
  payload or is null.

........

[sergeyb] Merged revisions 1245070 via svnmerge from 
https://svn.apache.org/repos/asf/cxf/trunk

........
  r1245070 | sergeyb | 2012-02-16 16:31:15 +0000 (Thu, 16 Feb 2012) | 1 line
  
  [CXF-4116] Comparing Pattern string representations as the last step
........

[ay] Merged revisions 1244939 via svnmerge from 
https://svn.apache.org/repos/asf/cxf/trunk

........
  r1244939 | ay | 2012-02-16 12:31:11 +0100 (Thu, 16 Feb 2012) | 1 line
  
  improve the test cases for CXF-4096
........

------------------------------------------
[...truncated 254 lines...]
[INFO]   Apache CXF WS-Security System Tests
[INFO]   Apache CXF WS-Security Interop System Tests
[INFO]   Apache CXF JAX-RS System Advanced Security Tests
[INFO]   Test for writing wsdl to repo
[INFO]   Test for generating code from wsdl in repo
[INFO]   Apache CXF System Tests
[INFO]   Apache CXF System Tests for Maven Plugins
[INFO]   Apache CXF Manifest Jar
[INFO]   Apache CXF Samples
[INFO]   Colocated Demo using Document/Literal Style
[INFO]   JavaScript Client Demo using Document/Literal Style
[INFO]   Generated JavaScript Sample using JAX-WS and JSR-181
[INFO]   Java First demo service using the JAXWSFactoryBeans
[INFO]   Java First demo using JAX-WS and JMS
[INFO]   JAX-RS Content Negotiation Demo
[INFO]   JAX-RS Basic Demo With HTTPS communications
[INFO]   JAX-RS Basic Demo
[INFO]   CXF sample using a callbak object
[INFO]   WSDL first demo using BARE Style in XML Binding (pure XML over HTTP)
[INFO]   JAX-WS Dispatch/Provider Demo
[INFO]   WSDL first demo using Document/Literal Style and XMLBeans DataBinding
[INFO]   WSDL first demo using SOAP12 in Document/Literal Style
[INFO]   CXF Dynamic Client Sample
[INFO]   JMS Transport Queue Demo using Document-Literal Style
[INFO]   WSDL first demo using the jms transport and jmsConfigFeature
[INFO]   RESTful Hello World Demo
[INFO]   WSDL first demo using Document/Literal Style
[INFO]   CXF sample using the Aegis Binding without any webservice
[INFO]   Java First demo using JAX-WS APIs
[INFO]   WS-RM Demo
[INFO]   CXF Sample of Stream GZIP Interceptor
[INFO]   Spring HTTP Sample
[INFO]   Spring HTTP Servlet demo with ruby support
[INFO]   Spring HTTP Servlet demo with groovy support
[INFO]   Hello world javascript demo
[INFO]   CXF WS-Security UT Demo
[INFO]   WS-Security UT Sign Demo
[INFO]   CXF WS-Security Sign Encoding Demo
[INFO]   WS-Security UT Policy Demo
[INFO]   MTOM Demo for SWA and XOP
[INFO]   JAX-WS Asynchronous Demo using Document/Literal Style
[INFO]   Java First POJO Sample
[INFO]   WS-Policy Demo
[INFO]   Hello World Client Demo using JavaScript
[INFO]   WSDL first demo using HTTPS
[INFO]   WS-Addressing Demo
[INFO]   Sample using SOAP Headers
[INFO]   SOAP/JMS Transport Specification Demo using Document-Literal Style
[INFO]   CXF sample using WRAPPED Style in XML Binding (pure XML over HTTP)
[INFO]   RESTful HTTP Binding Demo
[INFO]   CXF sample using code first POJO's and the Aegis Binding
[INFO]   Sample of JAX-* Service Using an Aegis Client
[INFO]   JAX-WS Handler Demo
[INFO]   WSDL first demo using RPC-Literal Style
[INFO]   JMS Transport Publish/Subscribe Demo using Document-Literal Style
[INFO]   JAX-RS Spring Security Demo
[INFO]   LogBrowser
[INFO]   WS-Notification Demo
[INFO]   CXF STS Demo
[INFO]   Apache CXF Distribution
[WARNING] POM for 'biz.aQute:bndlib:pom:1.50.0:runtime' is invalid.

Its dependencies (if any) will NOT be available to the current build.
[INFO] ------------------------------------------------------------------------
[INFO] Building Apache CXF
[INFO]    task-segment: [clean, deploy]
[INFO] ------------------------------------------------------------------------
[INFO] [clean:clean {execution: default-clean}]
[INFO] Deleting <https://builds.apache.org/job/CXF-2.5-deploy/ws/cxf-2.5.x-fixes/target>
log4j:WARN No appenders could be found for logger (org.apache.commons.beanutils.converters.BooleanConverter).
log4j:WARN Please initialize the log4j system properly.
[INFO] [site:attach-descriptor {execution: default-attach-descriptor}]
[INFO] [source:jar-no-fork {execution: attach-sources}]
[INFO] [javadoc:jar {execution: attach-javadocs}]
[INFO] Not executing Javadoc as the project is not a Java classpath-capable package
[INFO] [install:install {execution: default-install}]
[INFO] Installing <https://builds.apache.org/job/CXF-2.5-deploy/ws/cxf-2.5.x-fixes/pom.xml>
to <https://builds.apache.org/job/CXF-2.5-deploy/ws/.repository/org/apache/cxf/cxf/2.5.3-SNAPSHOT/cxf-2.5.3-SNAPSHOT.pom>
[INFO] Installing <https://builds.apache.org/job/CXF-2.5-deploy/ws/cxf-2.5.x-fixes/target/cxf-2.5.3-SNAPSHOT-site.xml>
to <https://builds.apache.org/job/CXF-2.5-deploy/ws/.repository/org/apache/cxf/cxf/2.5.3-SNAPSHOT/cxf-2.5.3-SNAPSHOT-site.xml>
[INFO] [deploy:deploy {execution: default-deploy}]
[INFO] Retrieving previous build number from apache.snapshots.https
[WARNING] *** CHECKSUM FAILED - Checksum failed on download: local = '3832b20bf0aa1b4ca921c0199e71cde7d118122f';
remote = 'd8bfff6c86079d0cedb87b1b7935158798593252' - RETRYING
[WARNING] *** CHECKSUM FAILED - Checksum failed on download: local = '3832b20bf0aa1b4ca921c0199e71cde7d118122f';
remote = 'd8bfff6c86079d0cedb87b1b7935158798593252' - IGNORING
Uploading: https://repository.apache.org/content/repositories/snapshots/org/apache/cxf/cxf/2.5.3-SNAPSHOT/cxf-2.5.3-20120217.061813-19.pom
35K uploaded  (cxf-2.5.3-20120217.061813-19.pom)
[INFO] Retrieving previous metadata from apache.snapshots.https
[INFO] Uploading repository metadata for: 'artifact org.apache.cxf:cxf'
[INFO] Retrieving previous metadata from apache.snapshots.https
[WARNING] *** CHECKSUM FAILED - Checksum failed on download: local = '3832b20bf0aa1b4ca921c0199e71cde7d118122f';
remote = 'd8bfff6c86079d0cedb87b1b7935158798593252' - RETRYING
[WARNING] *** CHECKSUM FAILED - Checksum failed on download: local = '3832b20bf0aa1b4ca921c0199e71cde7d118122f';
remote = 'd8bfff6c86079d0cedb87b1b7935158798593252' - IGNORING
[INFO] Uploading repository metadata for: 'snapshot org.apache.cxf:cxf:2.5.3-SNAPSHOT'
[INFO] Retrieving previous build number from apache.snapshots.https
Uploading: https://repository.apache.org/content/repositories/snapshots/org/apache/cxf/cxf/2.5.3-SNAPSHOT/cxf-2.5.3-20120217.061813-19-site.xml
1K uploaded  (cxf-2.5.3-20120217.061813-19-site.xml)
[JENKINS] Archiving <https://builds.apache.org/job/CXF-2.5-deploy/ws/cxf-2.5.x-fixes/pom.xml>
to /home/hudson/hudson/jobs/CXF-2.5-deploy/modules/org.apache.cxf$cxf/builds/2012-02-17_06-17-28/archive/org.apache.cxf/cxf/2.5.3-SNAPSHOT/cxf-2.5.3-SNAPSHOT.pom
[JENKINS] Archiving <https://builds.apache.org/job/CXF-2.5-deploy/ws/.repository/org/apache/cxf/cxf/2.5.3-SNAPSHOT/cxf-2.5.3-SNAPSHOT.pom>
to /home/hudson/hudson/jobs/CXF-2.5-deploy/modules/org.apache.cxf$cxf/builds/2012-02-17_06-17-28/archive/org.apache.cxf/cxf/2.5.3-20120217.061813-19/cxf-2.5.3-20120217.061813-19.pom
[JENKINS] Archiving <https://builds.apache.org/job/CXF-2.5-deploy/ws/cxf-2.5.x-fixes/target/cxf-2.5.3-SNAPSHOT-site.xml>
to /home/hudson/hudson/jobs/CXF-2.5-deploy/modules/org.apache.cxf$cxf/builds/2012-02-17_06-17-28/archive/org.apache.cxf/cxf/2.5.3-20120217.061813-19/cxf-2.5.3-20120217.061813-19-site.xml
[INFO] ------------------------------------------------------------------------
[INFO] Building Apache CXF Parent
[INFO]    task-segment: [clean, deploy]
[INFO] ------------------------------------------------------------------------
[INFO] [clean:clean {execution: default-clean}]
[INFO] Deleting <https://builds.apache.org/job/CXF-2.5-deploy/ws/cxf-2.5.x-fixes/parent/target>
[INFO] [cxf-xml2fastinfoset:xml2fastinfoset {execution: xml2fastinfoset}]
[INFO] [remote-resources:process {execution: default}]
[INFO] [site:attach-descriptor {execution: default-attach-descriptor}]
[INFO] [source:jar-no-fork {execution: attach-sources}]
[INFO] [javadoc:jar {execution: attach-javadocs}]
[INFO] Not executing Javadoc as the project is not a Java classpath-capable package
[INFO] [install:install {execution: default-install}]
[INFO] Installing <https://builds.apache.org/job/CXF-2.5-deploy/ws/cxf-2.5.x-fixes/parent/pom.xml>
to <https://builds.apache.org/job/CXF-2.5-deploy/ws/.repository/org/apache/cxf/cxf-parent/2.5.3-SNAPSHOT/cxf-parent-2.5.3-SNAPSHOT.pom>
[INFO] [deploy:deploy {execution: default-deploy}]
[INFO] Retrieving previous build number from apache.snapshots.https
[WARNING] *** CHECKSUM FAILED - Checksum failed on download: local = '1ce6c3deb7b9437a182cd743a139124efff587cb';
remote = '61e346de35339299ceb338086b06d8b3b8de7c6a' - RETRYING
[WARNING] *** CHECKSUM FAILED - Checksum failed on download: local = '1ce6c3deb7b9437a182cd743a139124efff587cb';
remote = '61e346de35339299ceb338086b06d8b3b8de7c6a' - IGNORING
Uploading: https://repository.apache.org/content/repositories/snapshots/org/apache/cxf/cxf-parent/2.5.3-SNAPSHOT/cxf-parent-2.5.3-20120217.061813-19.pom
73K uploaded  (cxf-parent-2.5.3-20120217.061813-19.pom)
[INFO] Retrieving previous metadata from apache.snapshots.https
[INFO] Uploading repository metadata for: 'artifact org.apache.cxf:cxf-parent'
[INFO] Retrieving previous metadata from apache.snapshots.https
[WARNING] *** CHECKSUM FAILED - Checksum failed on download: local = '1ce6c3deb7b9437a182cd743a139124efff587cb';
remote = '61e346de35339299ceb338086b06d8b3b8de7c6a' - RETRYING
[WARNING] *** CHECKSUM FAILED - Checksum failed on download: local = '1ce6c3deb7b9437a182cd743a139124efff587cb';
remote = '61e346de35339299ceb338086b06d8b3b8de7c6a' - IGNORING
[INFO] Uploading repository metadata for: 'snapshot org.apache.cxf:cxf-parent:2.5.3-SNAPSHOT'
[JENKINS] Archiving <https://builds.apache.org/job/CXF-2.5-deploy/ws/cxf-2.5.x-fixes/parent/pom.xml>
to /home/hudson/hudson/jobs/CXF-2.5-deploy/modules/org.apache.cxf$cxf-parent/builds/2012-02-17_06-17-28/archive/org.apache.cxf/cxf-parent/2.5.3-SNAPSHOT/cxf-parent-2.5.3-SNAPSHOT.pom
[JENKINS] Archiving <https://builds.apache.org/job/CXF-2.5-deploy/ws/.repository/org/apache/cxf/cxf-parent/2.5.3-SNAPSHOT/cxf-parent-2.5.3-SNAPSHOT.pom>
to /home/hudson/hudson/jobs/CXF-2.5-deploy/modules/org.apache.cxf$cxf-parent/builds/2012-02-17_06-17-28/archive/org.apache.cxf/cxf-parent/2.5.3-20120217.061813-19/cxf-parent-2.5.3-20120217.061813-19.pom
[INFO] ------------------------------------------------------------------------
[INFO] Building Apache CXF Common Utilities
[INFO]    task-segment: [clean, deploy]
[INFO] ------------------------------------------------------------------------
[INFO] [clean:clean {execution: default-clean}]
[INFO] Deleting <https://builds.apache.org/job/CXF-2.5-deploy/ws/cxf-2.5.x-fixes/common/common/target>
Downloading: http://repo1.maven.org/maven2/org/apache/maven/plugins/maven-surefire-plugin/2.12/maven-surefire-plugin-2.12.pom
[WARNING] Unable to get resource 'org.apache.maven.plugins:maven-surefire-plugin:pom:2.12'
from repository central (http://repo1.maven.org/maven2): Error transferring file: Connection
timed out
Downloading: http://repo1.maven.org/maven2/org/apache/maven/plugins/maven-surefire-plugin/2.12/maven-surefire-plugin-2.12.pom
[WARNING] Unable to get resource 'org.apache.maven.plugins:maven-surefire-plugin:pom:2.12'
from repository central (http://repo1.maven.org/maven2): Error transferring file: Connection
timed out
[JENKINS] Archiving <https://builds.apache.org/job/CXF-2.5-deploy/ws/cxf-2.5.x-fixes/common/common/pom.xml>
to /home/hudson/hudson/jobs/CXF-2.5-deploy/modules/org.apache.cxf$cxf-common-utilities/builds/2012-02-17_06-17-28/archive/org.apache.cxf/cxf-common-utilities/2.5.3-SNAPSHOT/cxf-common-utilities-2.5.3-SNAPSHOT.pom
[INFO] ------------------------------------------------------------------------
[ERROR] BUILD ERROR
[INFO] ------------------------------------------------------------------------
[INFO] Failed to resolve artifact.

GroupId: org.apache.maven.plugins
ArtifactId: maven-surefire-plugin
Version: 2.12

Reason: Unable to download the artifact from any repository

  org.apache.maven.plugins:maven-surefire-plugin:pom:2.12

from the specified remote repositories:
  central (http://repo1.maven.org/maven2),
  Nexus (http://repository.apache.org/snapshots)



[INFO] ------------------------------------------------------------------------
[INFO] Trace
org.apache.maven.lifecycle.LifecycleExecutionException: Unable to build project for plugin
'org.apache.maven.plugins:maven-surefire-plugin': POM 'org.apache.maven.plugins:maven-surefire-plugin'
not found in repository: Unable to download the artifact from any repository

  org.apache.maven.plugins:maven-surefire-plugin:pom:2.12

from the specified remote repositories:
  central (http://repo1.maven.org/maven2),
  Nexus (http://repository.apache.org/snapshots)

 for project org.apache.maven.plugins:maven-surefire-plugin
	at org.apache.maven.lifecycle.DefaultLifecycleExecutor.verifyPlugin(DefaultLifecycleExecutor.java:1557)
	at org.apache.maven.lifecycle.DefaultLifecycleExecutor.getMojoDescriptor(DefaultLifecycleExecutor.java:1851)
	at org.apache.maven.lifecycle.DefaultLifecycleExecutor.bindLifecycleForPackaging(DefaultLifecycleExecutor.java:1311)
	at org.apache.maven.lifecycle.DefaultLifecycleExecutor.constructLifecycleMappings(DefaultLifecycleExecutor.java:1275)
	at org.apache.maven.lifecycle.DefaultLifecycleExecutor.executeGoal(DefaultLifecycleExecutor.java:534)
	at org.apache.maven.lifecycle.DefaultLifecycleExecutor.executeGoalAndHandleFailures(DefaultLifecycleExecutor.java:387)
	at org.apache.maven.lifecycle.DefaultLifecycleExecutor.executeTaskSegments(DefaultLifecycleExecutor.java:348)
	at org.apache.maven.lifecycle.DefaultLifecycleExecutor.execute(DefaultLifecycleExecutor.java:180)
	at org.apache.maven.lifecycle.LifecycleExecutorInterceptor.execute(LifecycleExecutorInterceptor.java:65)
	at org.apache.maven.DefaultMaven.doExecute(DefaultMaven.java:328)
	at org.apache.maven.DefaultMaven.execute(DefaultMaven.java:138)
	at org.apache.maven.cli.MavenCli.main(MavenCli.java:362)
	at sun.reflect.NativeMethodAccessorImpl.invoke0(Native Method)
	at sun.reflect.NativeMethodAccessorImpl.invoke(NativeMethodAccessorImpl.java:39)
	at sun.reflect.DelegatingMethodAccessorImpl.invoke(DelegatingMethodAccessorImpl.java:25)
	at java.lang.reflect.Method.invoke(Method.java:592)
	at org.codehaus.classworlds.Launcher.launchEnhanced(Launcher.java:315)
	at org.codehaus.classworlds.Launcher.launch(Launcher.java:255)
	at hudson.maven.agent.Main.launch(Main.java:185)
	at hudson.maven.MavenBuilder.call(MavenBuilder.java:151)
	at hudson.maven.Maven2Builder.call(Maven2Builder.java:77)
	at hudson.maven.Maven2Builder.call(Maven2Builder.java:53)
	at hudson.remoting.UserRequest.perform(UserRequest.java:118)
	at hudson.remoting.UserRequest.perform(UserRequest.java:48)
	at hudson.remoting.Request$2.run(Request.java:287)
	at hudson.remoting.InterceptingExecutorService$1.call(InterceptingExecutorService.java:72)
	at java.util.concurrent.FutureTask$Sync.innerRun(FutureTask.java:269)
	at java.util.concurrent.FutureTask.run(FutureTask.java:123)
	at java.util.concurrent.ThreadPoolExecutor$Worker.runTask(ThreadPoolExecutor.java:651)
	at java.util.concurrent.ThreadPoolExecutor$Worker.run(ThreadPoolExecutor.java:676)
	at java.lang.Thread.run(Thread.java:595)
Caused by: org.apache.maven.plugin.InvalidPluginException: Unable to build project for plugin
'org.apache.maven.plugins:maven-surefire-plugin': POM 'org.apache.maven.plugins:maven-surefire-plugin'
not found in repository: Unable to download the artifact from any repository

  org.apache.maven.plugins:maven-surefire-plugin:pom:2.12

from the specified remote repositories:
  central (http://repo1.maven.org/maven2),
  Nexus (http://repository.apache.org/snapshots)

 for project org.apache.maven.plugins:maven-surefire-plugin
	at org.apache.maven.plugin.DefaultPluginManager.checkRequiredMavenVersion(DefaultPluginManager.java:293)
	at org.apache.maven.plugin.DefaultPluginManager.verifyVersionedPlugin(DefaultPluginManager.java:205)
	at org.apache.maven.plugin.DefaultPluginManager.verifyPlugin(DefaultPluginManager.java:184)
	at org.apache.maven.plugin.DefaultPluginManager.loadPluginDescriptor(DefaultPluginManager.java:1642)
	at org.apache.maven.lifecycle.DefaultLifecycleExecutor.verifyPlugin(DefaultLifecycleExecutor.java:1540)
	... 30 more
Caused by: org.apache.maven.project.ProjectBuildingException: POM 'org.apache.maven.plugins:maven-surefire-plugin'
not found in repository: Unable to download the artifact from any repository

  org.apache.maven.plugins:maven-surefire-plugin:pom:2.12

from the specified remote repositories:
  central (http://repo1.maven.org/maven2),
  Nexus (http://repository.apache.org/snapshots)

 for project org.apache.maven.plugins:maven-surefire-plugin
	at org.apache.maven.project.DefaultMavenProjectBuilder.findModelFromRepository(DefaultMavenProjectBuilder.java:605)
	at org.apache.maven.project.DefaultMavenProjectBuilder.buildFromRepository(DefaultMavenProjectBuilder.java:251)
	at org.apache.maven.plugin.DefaultPluginManager.checkRequiredMavenVersion(DefaultPluginManager.java:277)
	... 34 more
Caused by: org.apache.maven.artifact.resolver.ArtifactNotFoundException: Unable to download
the artifact from any repository

  org.apache.maven.plugins:maven-surefire-plugin:pom:2.12

from the specified remote repositories:
  central (http://repo1.maven.org/maven2),
  Nexus (http://repository.apache.org/snapshots)


	at org.apache.maven.artifact.resolver.DefaultArtifactResolver.resolve(DefaultArtifactResolver.java:228)
	at org.apache.maven.artifact.resolver.DefaultArtifactResolver.resolve(DefaultArtifactResolver.java:90)
	at org.apache.maven.project.DefaultMavenProjectBuilder.findModelFromRepository(DefaultMavenProjectBuilder.java:558)
	... 36 more
Caused by: org.apache.maven.wagon.ResourceDoesNotExistException: Unable to download the artifact
from any repository
	at org.apache.maven.artifact.manager.DefaultWagonManager.getArtifact(DefaultWagonManager.java:404)
	at org.apache.maven.artifact.resolver.DefaultArtifactResolver.resolve(DefaultArtifactResolver.java:216)
	... 38 more
[INFO] ------------------------------------------------------------------------
[INFO] Total time: 1 minute 20 seconds
[INFO] Finished at: Fri Feb 17 06:19:08 UTC 2012
[INFO] Final Memory: 71M/169M
[INFO] ------------------------------------------------------------------------
channel stopped
[locks-and-latches] Releasing all the locks
[locks-and-latches] All the locks released


Mime
View raw message