cxf-notifications mailing list archives

Site index · List index
Message view « Date » · « Thread »
Top « Date » · « Thread »
From Apache Jenkins Server <jenk...@builds.apache.org>
Subject Build failed in Jenkins: CXF-trunk-deploy #775
Date Mon, 06 Feb 2012 07:36:52 GMT
See <https://builds.apache.org/job/CXF-trunk-deploy/775/changes>

Changes:

[ffang] [CXF-4085]use SystemPropertyAction.getProperty but not System.getProperty

------------------------------------------
[...truncated 31104 lines...]
[debug] execute contextualize
[INFO] [resources:testResources {execution: default-testResources}]
[INFO] Using 'UTF-8' encoding to copy filtered resources.
[INFO] Copying 0 resource
[INFO] Copying 26 resources
[INFO] Copying 3 resources
[INFO] [compiler:testCompile {execution: default-testCompile}]
[INFO] Compiling 13 source files to <https://builds.apache.org/job/CXF-trunk-deploy/ws/trunk/systests/ws-security-examples/target/test-classes>
[INFO] [surefire:test {execution: default-test}]
[INFO] Tests are skipped.
[INFO] [jar:jar {execution: default-jar}]
[INFO] Building jar: <https://builds.apache.org/job/CXF-trunk-deploy/ws/trunk/systests/ws-security-examples/target/cxf-systests-ws-security-examples-2.6.0-SNAPSHOT.jar>
[INFO] [source:jar-no-fork {execution: attach-sources}]
[INFO] META-INF already added, skipping
[INFO] META-INF/LICENSE already added, skipping
[INFO] META-INF/DEPENDENCIES already added, skipping
[INFO] META-INF/NOTICE already added, skipping
[INFO] Building jar: <https://builds.apache.org/job/CXF-trunk-deploy/ws/trunk/systests/ws-security-examples/target/cxf-systests-ws-security-examples-2.6.0-SNAPSHOT-sources.jar>
[INFO] META-INF already added, skipping
[INFO] META-INF/LICENSE already added, skipping
[INFO] META-INF/DEPENDENCIES already added, skipping
[INFO] META-INF/NOTICE already added, skipping
[INFO] [javadoc:jar {execution: attach-javadocs}]
[INFO] Building jar: <https://builds.apache.org/job/CXF-trunk-deploy/ws/trunk/systests/ws-security-examples/target/cxf-systests-ws-security-examples-2.6.0-SNAPSHOT-javadoc.jar>
[INFO] [jar:test-jar {execution: attach-sources}]
[INFO] Building jar: <https://builds.apache.org/job/CXF-trunk-deploy/ws/trunk/systests/ws-security-examples/target/cxf-systests-ws-security-examples-2.6.0-SNAPSHOT-tests.jar>
[INFO] [install:install {execution: default-install}]
[INFO] Installing <https://builds.apache.org/job/CXF-trunk-deploy/ws/trunk/systests/ws-security-examples/target/cxf-systests-ws-security-examples-2.6.0-SNAPSHOT.jar>
to <https://builds.apache.org/job/CXF-trunk-deploy/ws/.repository/org/apache/cxf/systests/cxf-systests-ws-security-examples/2.6.0-SNAPSHOT/cxf-systests-ws-security-examples-2.6.0-SNAPSHOT.jar>
[INFO] Installing <https://builds.apache.org/job/CXF-trunk-deploy/ws/trunk/systests/ws-security-examples/target/cxf-systests-ws-security-examples-2.6.0-SNAPSHOT-sources.jar>
to <https://builds.apache.org/job/CXF-trunk-deploy/ws/.repository/org/apache/cxf/systests/cxf-systests-ws-security-examples/2.6.0-SNAPSHOT/cxf-systests-ws-security-examples-2.6.0-SNAPSHOT-sources.jar>
[INFO] Installing <https://builds.apache.org/job/CXF-trunk-deploy/ws/trunk/systests/ws-security-examples/target/cxf-systests-ws-security-examples-2.6.0-SNAPSHOT-javadoc.jar>
to <https://builds.apache.org/job/CXF-trunk-deploy/ws/.repository/org/apache/cxf/systests/cxf-systests-ws-security-examples/2.6.0-SNAPSHOT/cxf-systests-ws-security-examples-2.6.0-SNAPSHOT-javadoc.jar>
[INFO] Installing <https://builds.apache.org/job/CXF-trunk-deploy/ws/trunk/systests/ws-security-examples/target/cxf-systests-ws-security-examples-2.6.0-SNAPSHOT-tests.jar>
to <https://builds.apache.org/job/CXF-trunk-deploy/ws/.repository/org/apache/cxf/systests/cxf-systests-ws-security-examples/2.6.0-SNAPSHOT/cxf-systests-ws-security-examples-2.6.0-SNAPSHOT-tests.jar>
[INFO] [deploy:deploy {execution: default-deploy}]
[INFO] Retrieving previous build number from apache.snapshots.https
Uploading: https://repository.apache.org/content/repositories/snapshots/org/apache/cxf/systests/cxf-systests-ws-security-examples/2.6.0-SNAPSHOT/cxf-systests-ws-security-examples-2.6.0-20120206.061056-19.jar
15K uploaded  (cxf-systests-ws-security-examples-2.6.0-20120206.061056-19.jar)
[INFO] Retrieving previous metadata from apache.snapshots.https
[INFO] Uploading repository metadata for: 'snapshot org.apache.cxf.systests:cxf-systests-ws-security-examples:2.6.0-SNAPSHOT'
[INFO] Uploading project information for cxf-systests-ws-security-examples 2.6.0-20120206.061056-19
[INFO] Retrieving previous metadata from apache.snapshots.https
[INFO] Uploading repository metadata for: 'artifact org.apache.cxf.systests:cxf-systests-ws-security-examples'
[INFO] Retrieving previous build number from apache.snapshots.https
Uploading: https://repository.apache.org/content/repositories/snapshots/org/apache/cxf/systests/cxf-systests-ws-security-examples/2.6.0-SNAPSHOT/cxf-systests-ws-security-examples-2.6.0-20120206.061056-19-sources.jar
11K uploaded  (cxf-systests-ws-security-examples-2.6.0-20120206.061056-19-sources.jar)
[INFO] Retrieving previous build number from apache.snapshots.https
Uploading: https://repository.apache.org/content/repositories/snapshots/org/apache/cxf/systests/cxf-systests-ws-security-examples/2.6.0-SNAPSHOT/cxf-systests-ws-security-examples-2.6.0-20120206.061056-19-javadoc.jar
52K uploaded  (cxf-systests-ws-security-examples-2.6.0-20120206.061056-19-javadoc.jar)
[INFO] Retrieving previous build number from apache.snapshots.https
Uploading: https://repository.apache.org/content/repositories/snapshots/org/apache/cxf/systests/cxf-systests-ws-security-examples/2.6.0-SNAPSHOT/cxf-systests-ws-security-examples-2.6.0-20120206.061056-19-tests.jar
70K uploaded  (cxf-systests-ws-security-examples-2.6.0-20120206.061056-19-tests.jar)
[JENKINS] Archiving <https://builds.apache.org/job/CXF-trunk-deploy/ws/trunk/systests/ws-security-examples/pom.xml>
to /home/hudson/hudson/jobs/CXF-trunk-deploy/modules/org.apache.cxf.systests$cxf-systests-ws-security-examples/builds/2012-02-06_06-06-49/archive/org.apache.cxf.systests/cxf-systests-ws-security-examples/2.6.0-SNAPSHOT/cxf-systests-ws-security-examples-2.6.0-SNAPSHOT.pom
[JENKINS] Archiving <https://builds.apache.org/job/CXF-trunk-deploy/ws/trunk/systests/ws-security-examples/target/cxf-systests-ws-security-examples-2.6.0-SNAPSHOT.jar>
to /home/hudson/hudson/jobs/CXF-trunk-deploy/modules/org.apache.cxf.systests$cxf-systests-ws-security-examples/builds/2012-02-06_06-06-49/archive/org.apache.cxf.systests/cxf-systests-ws-security-examples/2.6.0-20120206.061056-19/cxf-systests-ws-security-examples-2.6.0-20120206.061056-19.jar
[JENKINS] Archiving <https://builds.apache.org/job/CXF-trunk-deploy/ws/trunk/systests/ws-security-examples/target/cxf-systests-ws-security-examples-2.6.0-SNAPSHOT-sources.jar>
to /home/hudson/hudson/jobs/CXF-trunk-deploy/modules/org.apache.cxf.systests$cxf-systests-ws-security-examples/builds/2012-02-06_06-06-49/archive/org.apache.cxf.systests/cxf-systests-ws-security-examples/2.6.0-20120206.061056-19/cxf-systests-ws-security-examples-2.6.0-20120206.061056-19-sources.jar
[JENKINS] Archiving <https://builds.apache.org/job/CXF-trunk-deploy/ws/trunk/systests/ws-security-examples/target/cxf-systests-ws-security-examples-2.6.0-SNAPSHOT-javadoc.jar>
to /home/hudson/hudson/jobs/CXF-trunk-deploy/modules/org.apache.cxf.systests$cxf-systests-ws-security-examples/builds/2012-02-06_06-06-49/archive/org.apache.cxf.systests/cxf-systests-ws-security-examples/2.6.0-20120206.061056-19/cxf-systests-ws-security-examples-2.6.0-20120206.061056-19-javadoc.jar
[JENKINS] Archiving <https://builds.apache.org/job/CXF-trunk-deploy/ws/trunk/systests/ws-security-examples/target/cxf-systests-ws-security-examples-2.6.0-SNAPSHOT-tests.jar>
to /home/hudson/hudson/jobs/CXF-trunk-deploy/modules/org.apache.cxf.systests$cxf-systests-ws-security-examples/builds/2012-02-06_06-06-49/archive/org.apache.cxf.systests/cxf-systests-ws-security-examples/2.6.0-20120206.061056-19/cxf-systests-ws-security-examples-2.6.0-20120206.061056-19-tests.jar
[INFO] ------------------------------------------------------------------------
[INFO] Building Apache CXF JAX-RS System Advanced Security Tests
[INFO]    task-segment: [clean, deploy]
[INFO] ------------------------------------------------------------------------
[INFO] [clean:clean {execution: default-clean}]
[INFO] [bundle:cleanVersions {execution: versions}]
[INFO] [dependency:copy {execution: create-endorsed-dir}]
[INFO] Configured Artifact: xerces:xercesImpl:?:jar
[INFO] Configured Artifact: xml-apis:xml-apis:1.3.04:jar
[INFO] Copying xercesImpl-2.9.1.jar to <https://builds.apache.org/job/CXF-trunk-deploy/ws/trunk/systests/rs-security/target/endorsed/xercesImpl-2.9.1.jar>
[INFO] Copying xml-apis-1.3.04.jar to <https://builds.apache.org/job/CXF-trunk-deploy/ws/trunk/systests/rs-security/target/endorsed/xml-apis-1.3.04.jar>
[INFO] [cxf-xml2fastinfoset:xml2fastinfoset {execution: xml2fastinfoset}]
[INFO] [remote-resources:process {execution: default}]
[INFO] snapshot org.apache.cxf:cxf-rt-rs-security-oauth-test:2.6.0-SNAPSHOT: checking for
updates from oauth
[WARNING] repository metadata for: 'snapshot org.apache.cxf:cxf-rt-rs-security-oauth-test:2.6.0-SNAPSHOT'
could not be retrieved from repository: oauth due to an error: Error transferring file: Server
returned HTTP response code: 502 for URL: http://oauth.googlecode.com/svn/code/maven/org/apache/cxf/cxf-rt-rs-security-oauth-test/2.6.0-SNAPSHOT/maven-metadata.xml
[INFO] Repository 'oauth' will be blacklisted
[INFO] snapshot org.apache.cxf:cxf-rt-rs-security-oauth-test:2.6.0-SNAPSHOT: checking for
updates from apache.snapshots
Downloading: http://repository.apache.org/snapshots/org/apache/cxf/cxf-rt-rs-security-oauth-test/2.6.0-SNAPSHOT/cxf-rt-rs-security-oauth-test-2.6.0-20120127.060831-17.pom
1K downloaded  (cxf-rt-rs-security-oauth-test-2.6.0-20120127.060831-17.pom)
Downloading: http://repo1.maven.org/maven2/net/oauth/core/oauth-consumer/20100527/oauth-consumer-20100527.pom
[INFO] Unable to find resource 'net.oauth.core:oauth-consumer:pom:20100527' in repository
central (http://repo1.maven.org/maven2)
Downloading: http://repository.apache.org/snapshots/org/apache/cxf/cxf-rt-rs-security-oauth-test/2.6.0-SNAPSHOT/cxf-rt-rs-security-oauth-test-2.6.0-20120127.060831-17.jar
Downloading: http://repo1.maven.org/maven2/net/oauth/core/oauth-consumer/20100527/oauth-consumer-20100527.jar
[INFO] Unable to find resource 'net.oauth.core:oauth-consumer:jar:20100527' in repository
central (http://repo1.maven.org/maven2)
14K downloaded  (cxf-rt-rs-security-oauth-test-2.6.0-20120127.060831-17.jar)
[JENKINS] Archiving <https://builds.apache.org/job/CXF-trunk-deploy/ws/trunk/systests/rs-security/pom.xml>
to /home/hudson/hudson/jobs/CXF-trunk-deploy/modules/org.apache.cxf.systests$cxf-systests-rs-security/builds/2012-02-06_06-06-49/archive/org.apache.cxf.systests/cxf-systests-rs-security/2.6.0-SNAPSHOT/cxf-systests-rs-security-2.6.0-SNAPSHOT.pom
[INFO] ------------------------------------------------------------------------
[ERROR] BUILD ERROR
[INFO] ------------------------------------------------------------------------
[INFO] Failed to resolve artifact.

Missing:
----------
1) net.oauth.core:oauth-consumer:jar:20100527

  Try downloading the file manually from the project website.

  Then, install it using the command: 
      mvn install:install-file -DgroupId=net.oauth.core -DartifactId=oauth-consumer -Dversion=20100527
-Dpackaging=jar -Dfile=/path/to/file

  Alternatively, if you host your own repository you can deploy the file there: 
      mvn deploy:deploy-file -DgroupId=net.oauth.core -DartifactId=oauth-consumer -Dversion=20100527
-Dpackaging=jar -Dfile=/path/to/file -Durl=[url] -DrepositoryId=[id]

  Path to dependency: 
  	1) org.apache.cxf.systests:cxf-systests-rs-security:jar:2.6.0-SNAPSHOT
  	2) net.oauth.core:oauth-consumer:jar:20100527

----------
1 required artifact is missing.

for artifact: 
  org.apache.cxf.systests:cxf-systests-rs-security:jar:2.6.0-SNAPSHOT

from the specified remote repositories:
  central (http://repo1.maven.org/maven2),
  Nexus (http://repository.apache.org/snapshots),
  oauth (http://oauth.googlecode.com/svn/code/maven/)



[INFO] ------------------------------------------------------------------------
[INFO] Trace
org.apache.maven.lifecycle.LifecycleExecutionException: Failed to resolve dependencies for
one or more projects in the reactor. Reason: Missing:
----------
1) net.oauth.core:oauth-consumer:jar:20100527

  Try downloading the file manually from the project website.

  Then, install it using the command: 
      mvn install:install-file -DgroupId=net.oauth.core -DartifactId=oauth-consumer -Dversion=20100527
-Dpackaging=jar -Dfile=/path/to/file

  Alternatively, if you host your own repository you can deploy the file there: 
      mvn deploy:deploy-file -DgroupId=net.oauth.core -DartifactId=oauth-consumer -Dversion=20100527
-Dpackaging=jar -Dfile=/path/to/file -Durl=[url] -DrepositoryId=[id]

  Path to dependency: 
  	1) org.apache.cxf.systests:cxf-systests-rs-security:jar:2.6.0-SNAPSHOT
  	2) net.oauth.core:oauth-consumer:jar:20100527

----------
1 required artifact is missing.

for artifact: 
  org.apache.cxf.systests:cxf-systests-rs-security:jar:2.6.0-SNAPSHOT

from the specified remote repositories:
  central (http://repo1.maven.org/maven2),
  Nexus (http://repository.apache.org/snapshots),
  oauth (http://oauth.googlecode.com/svn/code/maven/)


	at org.apache.maven.lifecycle.DefaultLifecycleExecutor.executeGoals(DefaultLifecycleExecutor.java:719)
	at org.apache.maven.lifecycle.DefaultLifecycleExecutor.executeGoalWithLifecycle(DefaultLifecycleExecutor.java:556)
	at org.apache.maven.lifecycle.DefaultLifecycleExecutor.executeGoal(DefaultLifecycleExecutor.java:535)
	at org.apache.maven.lifecycle.DefaultLifecycleExecutor.executeGoalAndHandleFailures(DefaultLifecycleExecutor.java:387)
	at org.apache.maven.lifecycle.DefaultLifecycleExecutor.executeTaskSegments(DefaultLifecycleExecutor.java:348)
	at org.apache.maven.lifecycle.DefaultLifecycleExecutor.execute(DefaultLifecycleExecutor.java:180)
	at org.apache.maven.lifecycle.LifecycleExecutorInterceptor.execute(LifecycleExecutorInterceptor.java:65)
	at org.apache.maven.DefaultMaven.doExecute(DefaultMaven.java:328)
	at org.apache.maven.DefaultMaven.execute(DefaultMaven.java:138)
	at org.apache.maven.cli.MavenCli.main(MavenCli.java:362)
	at sun.reflect.NativeMethodAccessorImpl.invoke0(Native Method)
	at sun.reflect.NativeMethodAccessorImpl.invoke(NativeMethodAccessorImpl.java:39)
	at sun.reflect.DelegatingMethodAccessorImpl.invoke(DelegatingMethodAccessorImpl.java:25)
	at java.lang.reflect.Method.invoke(Method.java:592)
	at org.codehaus.classworlds.Launcher.launchEnhanced(Launcher.java:315)
	at org.codehaus.classworlds.Launcher.launch(Launcher.java:255)
	at hudson.maven.agent.Main.launch(Main.java:185)
	at hudson.maven.MavenBuilder.call(MavenBuilder.java:151)
	at hudson.maven.Maven2Builder.call(Maven2Builder.java:77)
	at hudson.maven.Maven2Builder.call(Maven2Builder.java:53)
	at hudson.remoting.UserRequest.perform(UserRequest.java:118)
	at hudson.remoting.UserRequest.perform(UserRequest.java:48)
	at hudson.remoting.Request$2.run(Request.java:287)
	at java.util.concurrent.Executors$RunnableAdapter.call(Executors.java:417)
	at java.util.concurrent.FutureTask$Sync.innerRun(FutureTask.java:269)
	at java.util.concurrent.FutureTask.run(FutureTask.java:123)
	at java.util.concurrent.ThreadPoolExecutor$Worker.runTask(ThreadPoolExecutor.java:651)
	at java.util.concurrent.ThreadPoolExecutor$Worker.run(ThreadPoolExecutor.java:676)
	at java.lang.Thread.run(Thread.java:595)
Caused by: org.apache.maven.plugin.MojoExecutionException: Failed to resolve dependencies
for one or more projects in the reactor. Reason: Missing:
----------
1) net.oauth.core:oauth-consumer:jar:20100527

  Try downloading the file manually from the project website.

  Then, install it using the command: 
      mvn install:install-file -DgroupId=net.oauth.core -DartifactId=oauth-consumer -Dversion=20100527
-Dpackaging=jar -Dfile=/path/to/file

  Alternatively, if you host your own repository you can deploy the file there: 
      mvn deploy:deploy-file -DgroupId=net.oauth.core -DartifactId=oauth-consumer -Dversion=20100527
-Dpackaging=jar -Dfile=/path/to/file -Durl=[url] -DrepositoryId=[id]

  Path to dependency: 
  	1) org.apache.cxf.systests:cxf-systests-rs-security:jar:2.6.0-SNAPSHOT
  	2) net.oauth.core:oauth-consumer:jar:20100527

----------
1 required artifact is missing.

for artifact: 
  org.apache.cxf.systests:cxf-systests-rs-security:jar:2.6.0-SNAPSHOT

from the specified remote repositories:
  central (http://repo1.maven.org/maven2),
  Nexus (http://repository.apache.org/snapshots),
  oauth (http://oauth.googlecode.com/svn/code/maven/)


	at org.apache.maven.plugin.resources.remote.ProcessRemoteResourcesMojo.resolveProjectArtifacts(ProcessRemoteResourcesMojo.java:721)
	at org.apache.maven.plugin.resources.remote.ProcessRemoteResourcesMojo.getProjects(ProcessRemoteResourcesMojo.java:621)
	at org.apache.maven.plugin.resources.remote.ProcessRemoteResourcesMojo.configureVelocityContext(ProcessRemoteResourcesMojo.java:988)
	at org.apache.maven.plugin.resources.remote.ProcessRemoteResourcesMojo.execute(ProcessRemoteResourcesMojo.java:511)
	at org.apache.maven.plugin.DefaultPluginManager.executeMojo(DefaultPluginManager.java:490)
	at hudson.maven.agent.PluginManagerInterceptor.executeMojo(PluginManagerInterceptor.java:182)
	at org.apache.maven.lifecycle.DefaultLifecycleExecutor.executeGoals(DefaultLifecycleExecutor.java:694)
	... 28 more
Caused by: org.apache.maven.artifact.resolver.MultipleArtifactsNotFoundException: Missing:
----------
1) net.oauth.core:oauth-consumer:jar:20100527

  Try downloading the file manually from the project website.

  Then, install it using the command: 
      mvn install:install-file -DgroupId=net.oauth.core -DartifactId=oauth-consumer -Dversion=20100527
-Dpackaging=jar -Dfile=/path/to/file

  Alternatively, if you host your own repository you can deploy the file there: 
      mvn deploy:deploy-file -DgroupId=net.oauth.core -DartifactId=oauth-consumer -Dversion=20100527
-Dpackaging=jar -Dfile=/path/to/file -Durl=[url] -DrepositoryId=[id]

  Path to dependency: 
  	1) org.apache.cxf.systests:cxf-systests-rs-security:jar:2.6.0-SNAPSHOT
  	2) net.oauth.core:oauth-consumer:jar:20100527

----------
1 required artifact is missing.

for artifact: 
  org.apache.cxf.systests:cxf-systests-rs-security:jar:2.6.0-SNAPSHOT

from the specified remote repositories:
  central (http://repo1.maven.org/maven2),
  Nexus (http://repository.apache.org/snapshots),
  oauth (http://oauth.googlecode.com/svn/code/maven/)


	at org.apache.maven.artifact.resolver.DefaultArtifactResolver.resolveTransitively(DefaultArtifactResolver.java:360)
	at org.apache.maven.artifact.resolver.DefaultArtifactResolver.resolveTransitively(DefaultArtifactResolver.java:304)
	at org.apache.maven.shared.artifact.resolver.DefaultProjectDependenciesResolver.resolve(DefaultProjectDependenciesResolver.java:140)
	at org.apache.maven.shared.artifact.resolver.DefaultProjectDependenciesResolver.resolve(DefaultProjectDependenciesResolver.java:187)
	at org.apache.maven.plugin.resources.remote.ProcessRemoteResourcesMojo.resolveProjectArtifacts(ProcessRemoteResourcesMojo.java:716)
	... 34 more
[INFO] ------------------------------------------------------------------------
[INFO] Total time: 89 minutes 17 seconds
[INFO] Finished at: Mon Feb 06 07:36:38 UTC 2012
[INFO] Final Memory: 350M/453M
[INFO] ------------------------------------------------------------------------
channel stopped


Mime
View raw message