cxf-notifications mailing list archives

Site index · List index
Message view « Date » · « Thread »
Top « Date » · « Thread »
From Apache Jenkins Server <jenk...@builds.apache.org>
Subject Build failed in Jenkins: CXF-trunk-deploy #764
Date Mon, 23 Jan 2012 06:43:15 GMT
See <https://builds.apache.org/job/CXF-trunk-deploy/764/changes>

Changes:

[sergeyb] [CXF-4051] Fixes to do with supporting OAuth scopes

------------------------------------------
[...truncated 15173 lines...]
[INFO] Tests are skipped.
[INFO] [jar:jar {execution: default-jar}]
[INFO] Building jar: <https://builds.apache.org/job/CXF-trunk-deploy/ws/trunk/distribution/src/main/release/samples/jax_rs/basic_https/target/jax_rs_basic_https-2.6.0-SNAPSHOT.jar>
[INFO] [install:install {execution: default-install}]
[INFO] Installing <https://builds.apache.org/job/CXF-trunk-deploy/ws/trunk/distribution/src/main/release/samples/jax_rs/basic_https/target/jax_rs_basic_https-2.6.0-SNAPSHOT.jar>
to <https://builds.apache.org/job/CXF-trunk-deploy/ws/.repository/org/apache/cxf/samples/jax_rs_basic_https/2.6.0-SNAPSHOT/jax_rs_basic_https-2.6.0-SNAPSHOT.jar>
[INFO] [deploy:deploy {execution: default-deploy}]
[INFO]  skipping artifact deployement 
[JENKINS] Archiving <https://builds.apache.org/job/CXF-trunk-deploy/ws/trunk/distribution/src/main/release/samples/jax_rs/basic_https/pom.xml>
to /home/hudson/hudson/jobs/CXF-trunk-deploy/modules/org.apache.cxf.samples$jax_rs_basic_https/builds/2012-01-23_06-03-17/archive/org.apache.cxf.samples/jax_rs_basic_https/2.6.0-SNAPSHOT/jax_rs_basic_https-2.6.0-SNAPSHOT.pom
[JENKINS] Archiving <https://builds.apache.org/job/CXF-trunk-deploy/ws/trunk/distribution/src/main/release/samples/jax_rs/basic_https/target/jax_rs_basic_https-2.6.0-SNAPSHOT.jar>
to /home/hudson/hudson/jobs/CXF-trunk-deploy/modules/org.apache.cxf.samples$jax_rs_basic_https/builds/2012-01-23_06-03-17/archive/org.apache.cxf.samples/jax_rs_basic_https/2.6.0-SNAPSHOT/jax_rs_basic_https-2.6.0-SNAPSHOT.jar
[INFO] ------------------------------------------------------------------------
[INFO] Building JAX-RS Basic Demo
[INFO]    task-segment: [clean, deploy]
[INFO] ------------------------------------------------------------------------
[INFO] [clean:clean {execution: default-clean}]
[INFO] Deleting directory <https://builds.apache.org/job/CXF-trunk-deploy/ws/trunk/distribution/src/main/release/samples/jax_rs/basic/target>
[INFO] [antrun:run {execution: copyxmlfiles}]
project.artifactId
[INFO] Executing tasks
     [copy] Copying 1 file to <https://builds.apache.org/job/CXF-trunk-deploy/ws/trunk/distribution/src/main/release/samples/jax_rs/basic/target/classes/demo/jaxrs/client>
     [copy] Copying 1 file to <https://builds.apache.org/job/CXF-trunk-deploy/ws/trunk/distribution/src/main/release/samples/jax_rs/basic/target/classes/demo/jaxrs/client>
[INFO] Executed tasks
[INFO] [resources:resources {execution: default-resources}]
[INFO] Using 'UTF-8' encoding to copy filtered resources.
[INFO] skip non existing resourceDirectory <https://builds.apache.org/job/CXF-trunk-deploy/ws/trunk/distribution/src/main/release/samples/jax_rs/basic/src/main/resources>
[INFO] [compiler:compile {execution: default-compile}]
[INFO] Compiling 6 source files to <https://builds.apache.org/job/CXF-trunk-deploy/ws/trunk/distribution/src/main/release/samples/jax_rs/basic/target/classes>
[INFO] [resources:testResources {execution: default-testResources}]
[INFO] Using 'UTF-8' encoding to copy filtered resources.
[INFO] skip non existing resourceDirectory <https://builds.apache.org/job/CXF-trunk-deploy/ws/trunk/distribution/src/main/release/samples/jax_rs/basic/src/test/resources>
[INFO] [compiler:testCompile {execution: default-testCompile}]
[INFO] No sources to compile
[INFO] [surefire:test {execution: default-test}]
[INFO] Tests are skipped.
[INFO] [jar:jar {execution: default-jar}]
[INFO] Building jar: <https://builds.apache.org/job/CXF-trunk-deploy/ws/trunk/distribution/src/main/release/samples/jax_rs/basic/target/jax_rs_basic-2.6.0-SNAPSHOT.jar>
[INFO] [install:install {execution: default-install}]
[INFO] Installing <https://builds.apache.org/job/CXF-trunk-deploy/ws/trunk/distribution/src/main/release/samples/jax_rs/basic/target/jax_rs_basic-2.6.0-SNAPSHOT.jar>
to <https://builds.apache.org/job/CXF-trunk-deploy/ws/.repository/org/apache/cxf/samples/jax_rs_basic/2.6.0-SNAPSHOT/jax_rs_basic-2.6.0-SNAPSHOT.jar>
[INFO] [deploy:deploy {execution: default-deploy}]
[INFO]  skipping artifact deployement 
[JENKINS] Archiving <https://builds.apache.org/job/CXF-trunk-deploy/ws/trunk/distribution/src/main/release/samples/jax_rs/basic/pom.xml>
to /home/hudson/hudson/jobs/CXF-trunk-deploy/modules/org.apache.cxf.samples$jax_rs_basic/builds/2012-01-23_06-03-17/archive/org.apache.cxf.samples/jax_rs_basic/2.6.0-SNAPSHOT/jax_rs_basic-2.6.0-SNAPSHOT.pom
[JENKINS] Archiving <https://builds.apache.org/job/CXF-trunk-deploy/ws/trunk/distribution/src/main/release/samples/jax_rs/basic/target/jax_rs_basic-2.6.0-SNAPSHOT.jar>
to /home/hudson/hudson/jobs/CXF-trunk-deploy/modules/org.apache.cxf.samples$jax_rs_basic/builds/2012-01-23_06-03-17/archive/org.apache.cxf.samples/jax_rs_basic/2.6.0-SNAPSHOT/jax_rs_basic-2.6.0-SNAPSHOT.jar
[INFO] ------------------------------------------------------------------------
[INFO] Building CXF sample using a callbak object
[INFO]    task-segment: [clean, deploy]
[INFO] ------------------------------------------------------------------------
[INFO] [clean:clean {execution: default-clean}]
[INFO] Deleting directory <https://builds.apache.org/job/CXF-trunk-deploy/ws/trunk/distribution/src/main/release/samples/callback/target>
[INFO] [cxf-codegen:wsdl2java {execution: generate-CallbackService}]
[INFO] [cxf-codegen:wsdl2java {execution: generate-SOAPService}]
[INFO] [antrun:run {execution: prepare-transform}]
project.artifactId
[INFO] Executing tasks
     [copy] Copying 1 file to <https://builds.apache.org/job/CXF-trunk-deploy/ws/trunk/distribution/src/main/release/samples/callback/target/classes/demo/callback/client>
[INFO] Executed tasks
[INFO] [resources:resources {execution: default-resources}]
[INFO] Using 'UTF-8' encoding to copy filtered resources.
[INFO] skip non existing resourceDirectory <https://builds.apache.org/job/CXF-trunk-deploy/ws/trunk/distribution/src/main/release/samples/callback/src/main/resources>
[INFO] [compiler:compile {execution: default-compile}]
[INFO] Compiling 9 source files to <https://builds.apache.org/job/CXF-trunk-deploy/ws/trunk/distribution/src/main/release/samples/callback/target/classes>
[INFO] [resources:testResources {execution: default-testResources}]
[INFO] Using 'UTF-8' encoding to copy filtered resources.
[INFO] skip non existing resourceDirectory <https://builds.apache.org/job/CXF-trunk-deploy/ws/trunk/distribution/src/main/release/samples/callback/src/test/resources>
[INFO] [compiler:testCompile {execution: default-testCompile}]
[INFO] No sources to compile
[INFO] [surefire:test {execution: default-test}]
[INFO] Tests are skipped.
[INFO] [jar:jar {execution: default-jar}]
[INFO] Building jar: <https://builds.apache.org/job/CXF-trunk-deploy/ws/trunk/distribution/src/main/release/samples/callback/target/callback-2.6.0-SNAPSHOT.jar>
[INFO] [install:install {execution: default-install}]
[INFO] Installing <https://builds.apache.org/job/CXF-trunk-deploy/ws/trunk/distribution/src/main/release/samples/callback/target/callback-2.6.0-SNAPSHOT.jar>
to <https://builds.apache.org/job/CXF-trunk-deploy/ws/.repository/org/apache/cxf/samples/callback/2.6.0-SNAPSHOT/callback-2.6.0-SNAPSHOT.jar>
[INFO] [deploy:deploy {execution: default-deploy}]
[INFO]  skipping artifact deployement 
[JENKINS] Archiving <https://builds.apache.org/job/CXF-trunk-deploy/ws/trunk/distribution/src/main/release/samples/callback/pom.xml>
to /home/hudson/hudson/jobs/CXF-trunk-deploy/modules/org.apache.cxf.samples$callback/builds/2012-01-23_06-03-17/archive/org.apache.cxf.samples/callback/2.6.0-SNAPSHOT/callback-2.6.0-SNAPSHOT.pom
[JENKINS] Archiving <https://builds.apache.org/job/CXF-trunk-deploy/ws/trunk/distribution/src/main/release/samples/callback/target/callback-2.6.0-SNAPSHOT.jar>
to /home/hudson/hudson/jobs/CXF-trunk-deploy/modules/org.apache.cxf.samples$callback/builds/2012-01-23_06-03-17/archive/org.apache.cxf.samples/callback/2.6.0-SNAPSHOT/callback-2.6.0-SNAPSHOT.jar
[INFO] ------------------------------------------------------------------------
[INFO] Building WSDL first demo using BARE Style in XML Binding (pure XML over HTTP)
[INFO]    task-segment: [clean, deploy]
[INFO] ------------------------------------------------------------------------
[INFO] [clean:clean {execution: default-clean}]
[INFO] Deleting directory <https://builds.apache.org/job/CXF-trunk-deploy/ws/trunk/distribution/src/main/release/samples/wsdl_first_pure_xml/target>
[INFO] [cxf-codegen:wsdl2java {execution: generate-sources}]
[INFO] [resources:resources {execution: default-resources}]
[INFO] Using 'UTF-8' encoding to copy filtered resources.
[INFO] skip non existing resourceDirectory <https://builds.apache.org/job/CXF-trunk-deploy/ws/trunk/distribution/src/main/release/samples/wsdl_first_pure_xml/src/main/resources>
[INFO] [compiler:compile {execution: default-compile}]
[INFO] Compiling 9 source files to <https://builds.apache.org/job/CXF-trunk-deploy/ws/trunk/distribution/src/main/release/samples/wsdl_first_pure_xml/target/classes>
[INFO] [resources:testResources {execution: default-testResources}]
[INFO] Using 'UTF-8' encoding to copy filtered resources.
[INFO] skip non existing resourceDirectory <https://builds.apache.org/job/CXF-trunk-deploy/ws/trunk/distribution/src/main/release/samples/wsdl_first_pure_xml/src/test/resources>
[INFO] [compiler:testCompile {execution: default-testCompile}]
[INFO] No sources to compile
[INFO] [surefire:test {execution: default-test}]
[INFO] Tests are skipped.
[INFO] [jar:jar {execution: default-jar}]
[INFO] Building jar: <https://builds.apache.org/job/CXF-trunk-deploy/ws/trunk/distribution/src/main/release/samples/wsdl_first_pure_xml/target/wsdl_first_pure_xml-2.6.0-SNAPSHOT.jar>
[INFO] [install:install {execution: default-install}]
[INFO] Installing <https://builds.apache.org/job/CXF-trunk-deploy/ws/trunk/distribution/src/main/release/samples/wsdl_first_pure_xml/target/wsdl_first_pure_xml-2.6.0-SNAPSHOT.jar>
to <https://builds.apache.org/job/CXF-trunk-deploy/ws/.repository/org/apache/cxf/samples/wsdl_first_pure_xml/2.6.0-SNAPSHOT/wsdl_first_pure_xml-2.6.0-SNAPSHOT.jar>
[INFO] [deploy:deploy {execution: default-deploy}]
[INFO]  skipping artifact deployement 
[JENKINS] Archiving <https://builds.apache.org/job/CXF-trunk-deploy/ws/trunk/distribution/src/main/release/samples/wsdl_first_pure_xml/pom.xml>
to /home/hudson/hudson/jobs/CXF-trunk-deploy/modules/org.apache.cxf.samples$wsdl_first_pure_xml/builds/2012-01-23_06-03-17/archive/org.apache.cxf.samples/wsdl_first_pure_xml/2.6.0-SNAPSHOT/wsdl_first_pure_xml-2.6.0-SNAPSHOT.pom
[JENKINS] Archiving <https://builds.apache.org/job/CXF-trunk-deploy/ws/trunk/distribution/src/main/release/samples/wsdl_first_pure_xml/target/wsdl_first_pure_xml-2.6.0-SNAPSHOT.jar>
to /home/hudson/hudson/jobs/CXF-trunk-deploy/modules/org.apache.cxf.samples$wsdl_first_pure_xml/builds/2012-01-23_06-03-17/archive/org.apache.cxf.samples/wsdl_first_pure_xml/2.6.0-SNAPSHOT/wsdl_first_pure_xml-2.6.0-SNAPSHOT.jar
[INFO] ------------------------------------------------------------------------
[INFO] Building JAX-WS Dispatch/Provider Demo
[INFO]    task-segment: [clean, deploy]
[INFO] ------------------------------------------------------------------------
[INFO] [clean:clean {execution: default-clean}]
[INFO] Deleting directory <https://builds.apache.org/job/CXF-trunk-deploy/ws/trunk/distribution/src/main/release/samples/jaxws_dispatch_provider/target>
[INFO] [cxf-codegen:wsdl2java {execution: generate-SOAPService1}]
[INFO] [cxf-codegen:wsdl2java {execution: generate-SOAPService2}]
[INFO] [cxf-codegen:wsdl2java {execution: generate-SOAPService3}]
[INFO] [antrun:run {execution: copyxmlfiles}]
project.artifactId
[INFO] Executing tasks
     [copy] Copying 1 file to <https://builds.apache.org/job/CXF-trunk-deploy/ws/trunk/distribution/src/main/release/samples/jaxws_dispatch_provider/target/classes/demo/hwDispatch/client>
     [copy] Copying 1 file to <https://builds.apache.org/job/CXF-trunk-deploy/ws/trunk/distribution/src/main/release/samples/jaxws_dispatch_provider/target/classes/demo/hwDispatch/client>
     [copy] Copying 1 file to <https://builds.apache.org/job/CXF-trunk-deploy/ws/trunk/distribution/src/main/release/samples/jaxws_dispatch_provider/target/classes/demo/hwDispatch/client>
     [copy] Copying 1 file to <https://builds.apache.org/job/CXF-trunk-deploy/ws/trunk/distribution/src/main/release/samples/jaxws_dispatch_provider/target/classes/demo/hwDispatch/server>
     [copy] Copying 1 file to <https://builds.apache.org/job/CXF-trunk-deploy/ws/trunk/distribution/src/main/release/samples/jaxws_dispatch_provider/target/classes/demo/hwDispatch/server>
     [copy] Copying 1 file to <https://builds.apache.org/job/CXF-trunk-deploy/ws/trunk/distribution/src/main/release/samples/jaxws_dispatch_provider/target/classes/demo/hwDispatch/server>
[INFO] Executed tasks
[INFO] [resources:resources {execution: default-resources}]
[INFO] Using 'UTF-8' encoding to copy filtered resources.
[INFO] skip non existing resourceDirectory <https://builds.apache.org/job/CXF-trunk-deploy/ws/trunk/distribution/src/main/release/samples/jaxws_dispatch_provider/src/main/resources>
[INFO] [compiler:compile {execution: default-compile}]
[INFO] Compiling 19 source files to <https://builds.apache.org/job/CXF-trunk-deploy/ws/trunk/distribution/src/main/release/samples/jaxws_dispatch_provider/target/classes>
[INFO] [resources:testResources {execution: default-testResources}]
[INFO] Using 'UTF-8' encoding to copy filtered resources.
[INFO] skip non existing resourceDirectory <https://builds.apache.org/job/CXF-trunk-deploy/ws/trunk/distribution/src/main/release/samples/jaxws_dispatch_provider/src/test/resources>
[INFO] [compiler:testCompile {execution: default-testCompile}]
[INFO] No sources to compile
[INFO] [surefire:test {execution: default-test}]
[INFO] Tests are skipped.
[INFO] [jar:jar {execution: default-jar}]
[INFO] Building jar: <https://builds.apache.org/job/CXF-trunk-deploy/ws/trunk/distribution/src/main/release/samples/jaxws_dispatch_provider/target/jaxws_dispatch_provider-2.6.0-SNAPSHOT.jar>
[INFO] [install:install {execution: default-install}]
[INFO] Installing <https://builds.apache.org/job/CXF-trunk-deploy/ws/trunk/distribution/src/main/release/samples/jaxws_dispatch_provider/target/jaxws_dispatch_provider-2.6.0-SNAPSHOT.jar>
to <https://builds.apache.org/job/CXF-trunk-deploy/ws/.repository/org/apache/cxf/samples/jaxws_dispatch_provider/2.6.0-SNAPSHOT/jaxws_dispatch_provider-2.6.0-SNAPSHOT.jar>
[INFO] [deploy:deploy {execution: default-deploy}]
[INFO]  skipping artifact deployement 
[JENKINS] Archiving <https://builds.apache.org/job/CXF-trunk-deploy/ws/trunk/distribution/src/main/release/samples/jaxws_dispatch_provider/pom.xml>
to /home/hudson/hudson/jobs/CXF-trunk-deploy/modules/org.apache.cxf.samples$jaxws_dispatch_provider/builds/2012-01-23_06-03-17/archive/org.apache.cxf.samples/jaxws_dispatch_provider/2.6.0-SNAPSHOT/jaxws_dispatch_provider-2.6.0-SNAPSHOT.pom
[JENKINS] Archiving <https://builds.apache.org/job/CXF-trunk-deploy/ws/trunk/distribution/src/main/release/samples/jaxws_dispatch_provider/target/jaxws_dispatch_provider-2.6.0-SNAPSHOT.jar>
to /home/hudson/hudson/jobs/CXF-trunk-deploy/modules/org.apache.cxf.samples$jaxws_dispatch_provider/builds/2012-01-23_06-03-17/archive/org.apache.cxf.samples/jaxws_dispatch_provider/2.6.0-SNAPSHOT/jaxws_dispatch_provider-2.6.0-SNAPSHOT.jar
[INFO] ------------------------------------------------------------------------
[INFO] Building WSDL first demo using Document/Literal Style and XMLBeans DataBinding
[INFO]    task-segment: [clean, deploy]
[INFO] ------------------------------------------------------------------------
[INFO] [clean:clean {execution: default-clean}]
[INFO] Deleting directory <https://builds.apache.org/job/CXF-trunk-deploy/ws/trunk/distribution/src/main/release/samples/wsdl_first_xmlbeans/target>
[INFO] [cxf-codegen:wsdl2java {execution: generate-sources}]
[INFO] [resources:resources {execution: default-resources}]
[INFO] Using 'UTF-8' encoding to copy filtered resources.
[INFO] Copying 54 resources to schemaorg_apache_xmlbeans
[INFO] [compiler:compile {execution: default-compile}]
[INFO] Compiling 27 source files to <https://builds.apache.org/job/CXF-trunk-deploy/ws/trunk/distribution/src/main/release/samples/wsdl_first_xmlbeans/target/classes>
[INFO] -------------------------------------------------------------
[ERROR] COMPILATION ERROR : 
[INFO] -------------------------------------------------------------
[ERROR] <https://builds.apache.org/job/CXF-trunk-deploy/ws/trunk/distribution/src/main/release/samples/wsdl_first_xmlbeans/src/main/java/demo/hw/client/SpringClient.java>:[29,43]
package org.springframework.context.support does not exist

[ERROR] <https://builds.apache.org/job/CXF-trunk-deploy/ws/trunk/distribution/src/main/release/samples/wsdl_first_xmlbeans/src/main/java/demo/hw/server/SpringServer.java>:[22,43]
package org.springframework.context.support does not exist

[ERROR] <https://builds.apache.org/job/CXF-trunk-deploy/ws/trunk/distribution/src/main/release/samples/wsdl_first_xmlbeans/src/main/java/demo/hw/client/SpringClient.java>:[39,8]
cannot find symbol
symbol  : class ClassPathXmlApplicationContext
location: class demo.hw.client.SpringClient

[ERROR] <https://builds.apache.org/job/CXF-trunk-deploy/ws/trunk/distribution/src/main/release/samples/wsdl_first_xmlbeans/src/main/java/demo/hw/client/SpringClient.java>:[40,18]
cannot find symbol
symbol  : class ClassPathXmlApplicationContext
location: class demo.hw.client.SpringClient

[ERROR] <https://builds.apache.org/job/CXF-trunk-deploy/ws/trunk/distribution/src/main/release/samples/wsdl_first_xmlbeans/src/main/java/demo/hw/server/SpringServer.java>:[28,8]
cannot find symbol
symbol  : class ClassPathXmlApplicationContext
location: class demo.hw.server.SpringServer

[ERROR] <https://builds.apache.org/job/CXF-trunk-deploy/ws/trunk/distribution/src/main/release/samples/wsdl_first_xmlbeans/src/main/java/demo/hw/server/SpringServer.java>:[29,18]
cannot find symbol
symbol  : class ClassPathXmlApplicationContext
location: class demo.hw.server.SpringServer

[INFO] 6 errors 
[INFO] -------------------------------------------------------------
[JENKINS] Archiving <https://builds.apache.org/job/CXF-trunk-deploy/ws/trunk/distribution/src/main/release/samples/wsdl_first_xmlbeans/pom.xml>
to /home/hudson/hudson/jobs/CXF-trunk-deploy/modules/org.apache.cxf.samples$wsdl_first_xmlbeans/builds/2012-01-23_06-03-17/archive/org.apache.cxf.samples/wsdl_first_xmlbeans/2.6.0-SNAPSHOT/wsdl_first_xmlbeans-2.6.0-SNAPSHOT.pom
[INFO] ------------------------------------------------------------------------
[ERROR] BUILD FAILURE
[INFO] ------------------------------------------------------------------------
[INFO] Compilation failure

<https://builds.apache.org/job/CXF-trunk-deploy/ws/trunk/distribution/src/main/release/samples/wsdl_first_xmlbeans/src/main/java/demo/hw/client/SpringClient.java>:[29,43]
package org.springframework.context.support does not exist

<https://builds.apache.org/job/CXF-trunk-deploy/ws/trunk/distribution/src/main/release/samples/wsdl_first_xmlbeans/src/main/java/demo/hw/server/SpringServer.java>:[22,43]
package org.springframework.context.support does not exist

<https://builds.apache.org/job/CXF-trunk-deploy/ws/trunk/distribution/src/main/release/samples/wsdl_first_xmlbeans/src/main/java/demo/hw/client/SpringClient.java>:[39,8]
cannot find symbol
symbol  : class ClassPathXmlApplicationContext
location: class demo.hw.client.SpringClient

<https://builds.apache.org/job/CXF-trunk-deploy/ws/trunk/distribution/src/main/release/samples/wsdl_first_xmlbeans/src/main/java/demo/hw/client/SpringClient.java>:[40,18]
cannot find symbol
symbol  : class ClassPathXmlApplicationContext
location: class demo.hw.client.SpringClient

<https://builds.apache.org/job/CXF-trunk-deploy/ws/trunk/distribution/src/main/release/samples/wsdl_first_xmlbeans/src/main/java/demo/hw/server/SpringServer.java>:[28,8]
cannot find symbol
symbol  : class ClassPathXmlApplicationContext
location: class demo.hw.server.SpringServer

<https://builds.apache.org/job/CXF-trunk-deploy/ws/trunk/distribution/src/main/release/samples/wsdl_first_xmlbeans/src/main/java/demo/hw/server/SpringServer.java>:[29,18]
cannot find symbol
symbol  : class ClassPathXmlApplicationContext
location: class demo.hw.server.SpringServer


[INFO] ------------------------------------------------------------------------
[INFO] Trace
org.apache.maven.BuildFailureException: Compilation failure
	at org.apache.maven.lifecycle.DefaultLifecycleExecutor.executeGoals(DefaultLifecycleExecutor.java:715)
	at org.apache.maven.lifecycle.DefaultLifecycleExecutor.executeGoalWithLifecycle(DefaultLifecycleExecutor.java:556)
	at org.apache.maven.lifecycle.DefaultLifecycleExecutor.executeGoal(DefaultLifecycleExecutor.java:535)
	at org.apache.maven.lifecycle.DefaultLifecycleExecutor.executeGoalAndHandleFailures(DefaultLifecycleExecutor.java:387)
	at org.apache.maven.lifecycle.DefaultLifecycleExecutor.executeTaskSegments(DefaultLifecycleExecutor.java:348)
	at org.apache.maven.lifecycle.DefaultLifecycleExecutor.execute(DefaultLifecycleExecutor.java:180)
	at org.apache.maven.lifecycle.LifecycleExecutorInterceptor.execute(LifecycleExecutorInterceptor.java:65)
	at org.apache.maven.DefaultMaven.doExecute(DefaultMaven.java:328)
	at org.apache.maven.DefaultMaven.execute(DefaultMaven.java:138)
	at org.apache.maven.cli.MavenCli.main(MavenCli.java:362)
	at sun.reflect.NativeMethodAccessorImpl.invoke0(Native Method)
	at sun.reflect.NativeMethodAccessorImpl.invoke(NativeMethodAccessorImpl.java:39)
	at sun.reflect.DelegatingMethodAccessorImpl.invoke(DelegatingMethodAccessorImpl.java:25)
	at java.lang.reflect.Method.invoke(Method.java:592)
	at org.codehaus.classworlds.Launcher.launchEnhanced(Launcher.java:315)
	at org.codehaus.classworlds.Launcher.launch(Launcher.java:255)
	at hudson.maven.agent.Main.launch(Main.java:185)
	at hudson.maven.MavenBuilder.call(MavenBuilder.java:151)
	at hudson.maven.Maven2Builder.call(Maven2Builder.java:77)
	at hudson.maven.Maven2Builder.call(Maven2Builder.java:53)
	at hudson.remoting.UserRequest.perform(UserRequest.java:118)
	at hudson.remoting.UserRequest.perform(UserRequest.java:48)
	at hudson.remoting.Request$2.run(Request.java:287)
	at java.util.concurrent.Executors$RunnableAdapter.call(Executors.java:417)
	at java.util.concurrent.FutureTask$Sync.innerRun(FutureTask.java:269)
	at java.util.concurrent.FutureTask.run(FutureTask.java:123)
	at java.util.concurrent.ThreadPoolExecutor$Worker.runTask(ThreadPoolExecutor.java:651)
	at java.util.concurrent.ThreadPoolExecutor$Worker.run(ThreadPoolExecutor.java:676)
	at java.lang.Thread.run(Thread.java:595)
Caused by: org.apache.maven.plugin.CompilationFailureException: Compilation failure
	at org.apache.maven.plugin.AbstractCompilerMojo.execute(AbstractCompilerMojo.java:656)
	at org.apache.maven.plugin.CompilerMojo.execute(CompilerMojo.java:128)
	at org.apache.maven.plugin.DefaultPluginManager.executeMojo(DefaultPluginManager.java:490)
	at hudson.maven.agent.PluginManagerInterceptor.executeMojo(PluginManagerInterceptor.java:182)
	at org.apache.maven.lifecycle.DefaultLifecycleExecutor.executeGoals(DefaultLifecycleExecutor.java:694)
	... 28 more
[INFO] ------------------------------------------------------------------------
[INFO] Total time: 39 minutes 22 seconds
[INFO] Finished at: Mon Jan 23 06:43:10 UTC 2012
[INFO] Final Memory: 378M/487M
[INFO] ------------------------------------------------------------------------
channel stopped


Mime
View raw message