cxf-notifications mailing list archives

Site index · List index
Message view « Date » · « Thread »
Top « Date » · « Thread »
From Apache Jenkins Server <jenk...@builds.apache.org>
Subject Build failed in Jenkins: CXF-trunk-deploy #749
Date Thu, 05 Jan 2012 06:51:07 GMT
See <https://builds.apache.org/job/CXF-trunk-deploy/749/changes>

Changes:

[ema] [CXF-3981]:WS-Addressing related faults do not contain addressing headers

[ema] [CXF-3989]:messageConetxt.setScope(MessageContext.HTTP_REQUEST_HEADERS, Scope.APPLICATION)
leads to java.lang.IllegalArgumentException

[ema] [Minor fix]: correct to add rmDevivery in InFaultInterceptors

[dkulp] [CXF-4008] Check the javax.net.ssl.keyStore* props

[dkulp] Use non-deprecated API

------------------------------------------
[...truncated 14388 lines...]
[INFO] Installing <https://builds.apache.org/job/CXF-trunk-deploy/ws/trunk/systests/wsdl_maven/java2ws/target/cxf-systests-java2ws-2.5.2-SNAPSHOT-javadoc.jar>
to <https://builds.apache.org/job/CXF-trunk-deploy/ws/.repository/org/apache/cxf/systests/wsdl_maven/cxf-systests-java2ws/2.5.2-SNAPSHOT/cxf-systests-java2ws-2.5.2-SNAPSHOT-javadoc.jar>
[INFO] [deploy:deploy {execution: default-deploy}]
[INFO] Retrieving previous build number from apache.snapshots.https
Uploading: https://repository.apache.org/content/repositories/snapshots/org/apache/cxf/systests/wsdl_maven/cxf-systests-java2ws/2.5.2-SNAPSHOT/cxf-systests-java2ws-2.5.2-20120105.060926-9.jar
9K uploaded  (cxf-systests-java2ws-2.5.2-20120105.060926-9.jar)
[INFO] Uploading project information for cxf-systests-java2ws 2.5.2-20120105.060926-9
[INFO] Retrieving previous metadata from apache.snapshots.https
[INFO] Uploading repository metadata for: 'artifact org.apache.cxf.systests.wsdl_maven:cxf-systests-java2ws'
[INFO] Retrieving previous metadata from apache.snapshots.https
[INFO] Uploading repository metadata for: 'snapshot org.apache.cxf.systests.wsdl_maven:cxf-systests-java2ws:2.5.2-SNAPSHOT'
[INFO] Retrieving previous build number from apache.snapshots.https
Uploading: https://repository.apache.org/content/repositories/snapshots/org/apache/cxf/systests/wsdl_maven/cxf-systests-java2ws/2.5.2-SNAPSHOT/cxf-systests-java2ws-2.5.2-20120105.060926-9.wsdl
2K uploaded  (cxf-systests-java2ws-2.5.2-20120105.060926-9.wsdl)
[INFO] Retrieving previous build number from apache.snapshots.https
Uploading: https://repository.apache.org/content/repositories/snapshots/org/apache/cxf/systests/wsdl_maven/cxf-systests-java2ws/2.5.2-SNAPSHOT/cxf-systests-java2ws-2.5.2-20120105.060926-9-sources.jar
8K uploaded  (cxf-systests-java2ws-2.5.2-20120105.060926-9-sources.jar)
[INFO] Retrieving previous build number from apache.snapshots.https
Uploading: https://repository.apache.org/content/repositories/snapshots/org/apache/cxf/systests/wsdl_maven/cxf-systests-java2ws/2.5.2-SNAPSHOT/cxf-systests-java2ws-2.5.2-20120105.060926-9-javadoc.jar
26K uploaded  (cxf-systests-java2ws-2.5.2-20120105.060926-9-javadoc.jar)
[JENKINS] Archiving <https://builds.apache.org/job/CXF-trunk-deploy/ws/trunk/systests/wsdl_maven/java2ws/pom.xml>
to /home/hudson/hudson/jobs/CXF-trunk-deploy/modules/org.apache.cxf.systests.wsdl_maven$cxf-systests-java2ws/builds/2012-01-05_06-08-15/archive/org.apache.cxf.systests.wsdl_maven/cxf-systests-java2ws/2.5.2-SNAPSHOT/cxf-systests-java2ws-2.5.2-SNAPSHOT.pom
[JENKINS] Archiving <https://builds.apache.org/job/CXF-trunk-deploy/ws/trunk/systests/wsdl_maven/java2ws/target/cxf-systests-java2ws-2.5.2-SNAPSHOT.jar>
to /home/hudson/hudson/jobs/CXF-trunk-deploy/modules/org.apache.cxf.systests.wsdl_maven$cxf-systests-java2ws/builds/2012-01-05_06-08-15/archive/org.apache.cxf.systests.wsdl_maven/cxf-systests-java2ws/2.5.2-20120105.060926-9/cxf-systests-java2ws-2.5.2-20120105.060926-9.jar
[JENKINS] Archiving <https://builds.apache.org/job/CXF-trunk-deploy/ws/trunk/systests/wsdl_maven/java2ws/target/generated/wsdl/HelloWorld.wsdl>
to /home/hudson/hudson/jobs/CXF-trunk-deploy/modules/org.apache.cxf.systests.wsdl_maven$cxf-systests-java2ws/builds/2012-01-05_06-08-15/archive/org.apache.cxf.systests.wsdl_maven/cxf-systests-java2ws/2.5.2-20120105.060926-9/cxf-systests-java2ws-2.5.2-20120105.060926-9.wsdl
[JENKINS] Archiving <https://builds.apache.org/job/CXF-trunk-deploy/ws/trunk/systests/wsdl_maven/java2ws/target/cxf-systests-java2ws-2.5.2-SNAPSHOT-sources.jar>
to /home/hudson/hudson/jobs/CXF-trunk-deploy/modules/org.apache.cxf.systests.wsdl_maven$cxf-systests-java2ws/builds/2012-01-05_06-08-15/archive/org.apache.cxf.systests.wsdl_maven/cxf-systests-java2ws/2.5.2-20120105.060926-9/cxf-systests-java2ws-2.5.2-20120105.060926-9-sources.jar
[JENKINS] Archiving <https://builds.apache.org/job/CXF-trunk-deploy/ws/trunk/systests/wsdl_maven/java2ws/target/cxf-systests-java2ws-2.5.2-SNAPSHOT-javadoc.jar>
to /home/hudson/hudson/jobs/CXF-trunk-deploy/modules/org.apache.cxf.systests.wsdl_maven$cxf-systests-java2ws/builds/2012-01-05_06-08-15/archive/org.apache.cxf.systests.wsdl_maven/cxf-systests-java2ws/2.5.2-20120105.060926-9/cxf-systests-java2ws-2.5.2-20120105.060926-9-javadoc.jar
[INFO] ------------------------------------------------------------------------
[INFO] Building Test for generating code from wsdl in repo
[INFO]    task-segment: [clean, deploy]
[INFO] ------------------------------------------------------------------------
Downloading: http://repo1.maven.org/maven2/org/apache/maven/plugins/maven-invoker-plugin/1.5/maven-invoker-plugin-1.5.pom

Downloading: http://repo1.maven.org/maven2/org/apache/maven/plugins/maven-plugins/14/maven-plugins-14.pom

Downloading: http://repo1.maven.org/maven2/org/apache/maven/plugins/maven-invoker-plugin/1.5/maven-invoker-plugin-1.5.jar

[INFO] [clean:clean {execution: default-clean}]
[INFO] Deleting <https://builds.apache.org/job/CXF-trunk-deploy/ws/trunk/systests/wsdl_maven/codegen/target>
[INFO] [cxf-xml2fastinfoset:xml2fastinfoset {execution: xml2fastinfoset}]
[INFO] [cxf-codegen:wsdl2java {execution: generate-java-sources}]
[INFO] Nothing to generate
[INFO] [cxf-codegen:wsdl2js {execution: generate-js-sources}]
[INFO] org.apache.cxf.systests.wsdl_maven:cxf-systests-java2ws:wsdl:2.5.2-SNAPSHOT:compile
resolved to <https://builds.apache.org/job/CXF-trunk-deploy/ws/trunk/systests/wsdl_maven/java2ws/target/generated/wsdl/HelloWorld.wsdl>
[INFO] Resolved WSDL artifact to file <https://builds.apache.org/job/CXF-trunk-deploy/ws/trunk/systests/wsdl_maven/java2ws/target/generated/wsdl/HelloWorld.wsdl>
[INFO] Running code generation in fork mode...
[INFO] Building jar: /tmp/cxf-tmp-191170/cxf-codegen1133558737043207277.jar
[INFO] [remote-resources:process {execution: default}]
[debug] execute contextualize
[INFO] [resources:resources {execution: default-resources}]
[INFO] Using 'UTF-8' encoding to copy filtered resources.
[INFO] skip non existing resourceDirectory <https://builds.apache.org/job/CXF-trunk-deploy/ws/trunk/systests/wsdl_maven/codegen/src/main/java>
[INFO] Copying 1 resource
[INFO] skip non existing resourceDirectory <https://builds.apache.org/job/CXF-trunk-deploy/ws/trunk/systests/wsdl_maven/codegen/src/main/resources-filtered>
[INFO] skip non existing resourceDirectory <https://builds.apache.org/job/CXF-trunk-deploy/ws/trunk/systests/wsdl_maven/codegen/target/generated/src/main/resources>
[INFO] Copying 3 resources
[INFO] [compiler:compile {execution: default-compile}]
[INFO] Nothing to compile - all classes are up to date
[debug] execute contextualize
[INFO] [resources:testResources {execution: default-testResources}]
[INFO] Using 'UTF-8' encoding to copy filtered resources.
[INFO] skip non existing resourceDirectory <https://builds.apache.org/job/CXF-trunk-deploy/ws/trunk/systests/wsdl_maven/codegen/src/test/java>
[INFO] skip non existing resourceDirectory <https://builds.apache.org/job/CXF-trunk-deploy/ws/trunk/systests/wsdl_maven/codegen/src/test/resources>
[INFO] skip non existing resourceDirectory <https://builds.apache.org/job/CXF-trunk-deploy/ws/trunk/systests/wsdl_maven/codegen/target/generated/src/test/resources>
[INFO] Copying 3 resources
[INFO] [compiler:testCompile {execution: default-testCompile}]
[INFO] No sources to compile
[INFO] [surefire:test {execution: default-test}]
[INFO] Tests are skipped.
[INFO] [jar:jar {execution: default-jar}]
[INFO] Building jar: <https://builds.apache.org/job/CXF-trunk-deploy/ws/trunk/systests/wsdl_maven/codegen/target/cxf-systests-codegen-2.5.2-SNAPSHOT.jar>
[INFO] [source:jar-no-fork {execution: attach-sources}]
[INFO] META-INF already added, skipping
[INFO] META-INF/NOTICE already added, skipping
[INFO] META-INF/LICENSE already added, skipping
[INFO] META-INF/DEPENDENCIES already added, skipping
[INFO] Building jar: <https://builds.apache.org/job/CXF-trunk-deploy/ws/trunk/systests/wsdl_maven/codegen/target/cxf-systests-codegen-2.5.2-SNAPSHOT-sources.jar>
[INFO] META-INF already added, skipping
[INFO] META-INF/NOTICE already added, skipping
[INFO] META-INF/LICENSE already added, skipping
[INFO] META-INF/DEPENDENCIES already added, skipping
[INFO] [javadoc:jar {execution: attach-javadocs}]
Downloading: http://repo1.maven.org/maven2/org/beanshell/bsh/2.0b4/bsh-2.0b4.pom

Downloading: http://repo1.maven.org/maven2/org/beanshell/beanshell/2.0b4/beanshell-2.0b4.pom

Downloading: http://repo1.maven.org/maven2/org/codehaus/groovy/groovy/1.5.6/groovy-1.5.6.pom

Downloading: http://repo1.maven.org/maven2/asm/asm/2.2/asm-2.2.pom

Downloading: http://repo1.maven.org/maven2/org/apache/ant/ant/1.7.0/ant-1.7.0.pom

Downloading: http://repo1.maven.org/maven2/org/apache/ant/ant-parent/1.7.0/ant-parent-1.7.0.pom

Downloading: http://repo1.maven.org/maven2/org/apache/ant/ant-launcher/1.7.0/ant-launcher-1.7.0.pom

Downloading: http://repo1.maven.org/maven2/asm/asm-util/2.2/asm-util-2.2.pom

Downloading: http://repo1.maven.org/maven2/asm/asm-analysis/2.2/asm-analysis-2.2.pom

Downloading: http://repo1.maven.org/maven2/asm/asm-tree/2.2/asm-tree-2.2.pom

Downloading: http://repo1.maven.org/maven2/jline/jline/0.9.94/jline-0.9.94.pom

Downloading: http://repo1.maven.org/maven2/org/apache/ant/ant/1.7.1/ant-1.7.1.pom

Downloading: http://repo1.maven.org/maven2/org/apache/ant/ant-parent/1.7.1/ant-parent-1.7.1.pom

Downloading: http://repo1.maven.org/maven2/org/codehaus/groovy/groovy/1.5.6/groovy-1.5.6.jar
Downloading: http://repo1.maven.org/maven2/asm/asm/2.2/asm-2.2.jar
Downloading: http://repo1.maven.org/maven2/jline/jline/0.9.94/jline-0.9.94.jar
Downloading: http://repo1.maven.org/maven2/org/apache/ant/ant/1.7.1/ant-1.7.1.jar
Downloading: http://repo1.maven.org/maven2/org/beanshell/bsh/2.0b4/bsh-2.0b4.jar





Downloading: http://repo1.maven.org/maven2/asm/asm-util/2.2/asm-util-2.2.jar
Downloading: http://repo1.maven.org/maven2/org/apache/ant/ant-launcher/1.7.0/ant-launcher-1.7.0.jar


Downloading: http://repo1.maven.org/maven2/asm/asm-analysis/2.2/asm-analysis-2.2.jar

Downloading: http://repo1.maven.org/maven2/asm/asm-tree/2.2/asm-tree-2.2.jar

[INFO] [invoker:install {execution: integration-test}]
[INFO] Installing <https://builds.apache.org/job/CXF-trunk-deploy/ws/trunk/systests/wsdl_maven/java2ws/pom.xml>
to <https://builds.apache.org/job/CXF-trunk-deploy/ws/trunk/systests/wsdl_maven/codegen/target/local-repo/org/apache/cxf/systests/wsdl_maven/cxf-systests-java2ws/2.5.2-SNAPSHOT/cxf-systests-java2ws-2.5.2-SNAPSHOT.pom>
[INFO] Installing <https://builds.apache.org/job/CXF-trunk-deploy/ws/trunk/systests/wsdl_maven/java2ws/target/cxf-systests-java2ws-2.5.2-SNAPSHOT.jar>
to <https://builds.apache.org/job/CXF-trunk-deploy/ws/trunk/systests/wsdl_maven/codegen/target/local-repo/org/apache/cxf/systests/wsdl_maven/cxf-systests-java2ws/2.5.2-SNAPSHOT/cxf-systests-java2ws-2.5.2-20120105.060926-9.jar>
[INFO] Installing <https://builds.apache.org/job/CXF-trunk-deploy/ws/trunk/systests/wsdl_maven/java2ws/target/generated/wsdl/HelloWorld.wsdl>
to <https://builds.apache.org/job/CXF-trunk-deploy/ws/trunk/systests/wsdl_maven/codegen/target/local-repo/org/apache/cxf/systests/wsdl_maven/cxf-systests-java2ws/2.5.2-SNAPSHOT/cxf-systests-java2ws-2.5.2-20120105.060926-9.wsdl>
[INFO] Installing <https://builds.apache.org/job/CXF-trunk-deploy/ws/trunk/systests/wsdl_maven/java2ws/target/cxf-systests-java2ws-2.5.2-SNAPSHOT-sources.jar>
to <https://builds.apache.org/job/CXF-trunk-deploy/ws/trunk/systests/wsdl_maven/codegen/target/local-repo/org/apache/cxf/systests/wsdl_maven/cxf-systests-java2ws/2.5.2-SNAPSHOT/cxf-systests-java2ws-2.5.2-20120105.060926-9-sources.jar>
[INFO] Installing <https://builds.apache.org/job/CXF-trunk-deploy/ws/trunk/systests/wsdl_maven/java2ws/target/cxf-systests-java2ws-2.5.2-SNAPSHOT-javadoc.jar>
to <https://builds.apache.org/job/CXF-trunk-deploy/ws/trunk/systests/wsdl_maven/codegen/target/local-repo/org/apache/cxf/systests/wsdl_maven/cxf-systests-java2ws/2.5.2-SNAPSHOT/cxf-systests-java2ws-2.5.2-20120105.060926-9-javadoc.jar>
[INFO] Installing <https://builds.apache.org/job/CXF-trunk-deploy/ws/trunk/parent/pom.xml>
to <https://builds.apache.org/job/CXF-trunk-deploy/ws/trunk/systests/wsdl_maven/codegen/target/local-repo/org/apache/cxf/cxf-parent/2.5.2-SNAPSHOT/cxf-parent-2.5.2-20120105.060926-13.pom>
[INFO] Installing <https://builds.apache.org/job/CXF-trunk-deploy/ws/trunk/pom.xml>
to <https://builds.apache.org/job/CXF-trunk-deploy/ws/trunk/systests/wsdl_maven/codegen/target/local-repo/org/apache/cxf/cxf/2.5.2-SNAPSHOT/cxf-2.5.2-20120105.060926-13.pom>
[INFO] Installing <https://builds.apache.org/job/CXF-trunk-deploy/ws/trunk/rt/frontend/jaxws/pom.xml>
to <https://builds.apache.org/job/CXF-trunk-deploy/ws/trunk/systests/wsdl_maven/codegen/target/local-repo/org/apache/cxf/cxf-rt-frontend-jaxws/2.5.2-SNAPSHOT/cxf-rt-frontend-jaxws-2.5.2-SNAPSHOT.pom>
[INFO] Installing <https://builds.apache.org/job/CXF-trunk-deploy/ws/trunk/rt/frontend/jaxws/target/cxf-rt-frontend-jaxws-2.5.2-SNAPSHOT.jar>
to <https://builds.apache.org/job/CXF-trunk-deploy/ws/trunk/systests/wsdl_maven/codegen/target/local-repo/org/apache/cxf/cxf-rt-frontend-jaxws/2.5.2-SNAPSHOT/cxf-rt-frontend-jaxws-2.5.2-20120105.060926-13.jar>
[INFO] Installing <https://builds.apache.org/job/CXF-trunk-deploy/ws/trunk/rt/frontend/jaxws/target/cxf-rt-frontend-jaxws-2.5.2-SNAPSHOT-sources.jar>
to <https://builds.apache.org/job/CXF-trunk-deploy/ws/trunk/systests/wsdl_maven/codegen/target/local-repo/org/apache/cxf/cxf-rt-frontend-jaxws/2.5.2-SNAPSHOT/cxf-rt-frontend-jaxws-2.5.2-20120105.060926-13-sources.jar>
[INFO] Installing <https://builds.apache.org/job/CXF-trunk-deploy/ws/trunk/rt/frontend/jaxws/target/cxf-rt-frontend-jaxws-2.5.2-SNAPSHOT-javadoc.jar>
to <https://builds.apache.org/job/CXF-trunk-deploy/ws/trunk/systests/wsdl_maven/codegen/target/local-repo/org/apache/cxf/cxf-rt-frontend-jaxws/2.5.2-SNAPSHOT/cxf-rt-frontend-jaxws-2.5.2-20120105.060926-13-javadoc.jar>
[INFO] Installing <https://builds.apache.org/job/CXF-trunk-deploy/ws/trunk/api/pom.xml>
to <https://builds.apache.org/job/CXF-trunk-deploy/ws/trunk/systests/wsdl_maven/codegen/target/local-repo/org/apache/cxf/cxf-api/2.5.2-SNAPSHOT/cxf-api-2.5.2-SNAPSHOT.pom>
[INFO] Installing <https://builds.apache.org/job/CXF-trunk-deploy/ws/trunk/api/target/cxf-api-2.5.2-SNAPSHOT.jar>
to <https://builds.apache.org/job/CXF-trunk-deploy/ws/trunk/systests/wsdl_maven/codegen/target/local-repo/org/apache/cxf/cxf-api/2.5.2-SNAPSHOT/cxf-api-2.5.2-20120105.060926-13.jar>
[INFO] Installing <https://builds.apache.org/job/CXF-trunk-deploy/ws/trunk/api/target/cxf-api-2.5.2-SNAPSHOT-sources.jar>
to <https://builds.apache.org/job/CXF-trunk-deploy/ws/trunk/systests/wsdl_maven/codegen/target/local-repo/org/apache/cxf/cxf-api/2.5.2-SNAPSHOT/cxf-api-2.5.2-20120105.060926-13-sources.jar>
[INFO] Installing <https://builds.apache.org/job/CXF-trunk-deploy/ws/trunk/api/target/cxf-api-2.5.2-SNAPSHOT-javadoc.jar>
to <https://builds.apache.org/job/CXF-trunk-deploy/ws/trunk/systests/wsdl_maven/codegen/target/local-repo/org/apache/cxf/cxf-api/2.5.2-SNAPSHOT/cxf-api-2.5.2-20120105.060926-13-javadoc.jar>
[INFO] Installing <https://builds.apache.org/job/CXF-trunk-deploy/ws/trunk/common/common/pom.xml>
to <https://builds.apache.org/job/CXF-trunk-deploy/ws/trunk/systests/wsdl_maven/codegen/target/local-repo/org/apache/cxf/cxf-common-utilities/2.5.2-SNAPSHOT/cxf-common-utilities-2.5.2-SNAPSHOT.pom>
[INFO] Installing <https://builds.apache.org/job/CXF-trunk-deploy/ws/trunk/common/common/target/cxf-common-utilities-2.5.2-SNAPSHOT.jar>
to <https://builds.apache.org/job/CXF-trunk-deploy/ws/trunk/systests/wsdl_maven/codegen/target/local-repo/org/apache/cxf/cxf-common-utilities/2.5.2-SNAPSHOT/cxf-common-utilities-2.5.2-20120105.060926-13.jar>
[INFO] Installing <https://builds.apache.org/job/CXF-trunk-deploy/ws/trunk/common/common/target/cxf-common-utilities-2.5.2-SNAPSHOT-sources.jar>
to <https://builds.apache.org/job/CXF-trunk-deploy/ws/trunk/systests/wsdl_maven/codegen/target/local-repo/org/apache/cxf/cxf-common-utilities/2.5.2-SNAPSHOT/cxf-common-utilities-2.5.2-20120105.060926-13-sources.jar>
[INFO] Installing <https://builds.apache.org/job/CXF-trunk-deploy/ws/trunk/common/common/target/cxf-common-utilities-2.5.2-SNAPSHOT-javadoc.jar>
to <https://builds.apache.org/job/CXF-trunk-deploy/ws/trunk/systests/wsdl_maven/codegen/target/local-repo/org/apache/cxf/cxf-common-utilities/2.5.2-SNAPSHOT/cxf-common-utilities-2.5.2-20120105.060926-13-javadoc.jar>
[INFO] Installing <https://builds.apache.org/job/CXF-trunk-deploy/ws/trunk/rt/core/pom.xml>
to <https://builds.apache.org/job/CXF-trunk-deploy/ws/trunk/systests/wsdl_maven/codegen/target/local-repo/org/apache/cxf/cxf-rt-core/2.5.2-SNAPSHOT/cxf-rt-core-2.5.2-SNAPSHOT.pom>
[INFO] Installing <https://builds.apache.org/job/CXF-trunk-deploy/ws/trunk/rt/core/target/cxf-rt-core-2.5.2-SNAPSHOT.jar>
to <https://builds.apache.org/job/CXF-trunk-deploy/ws/trunk/systests/wsdl_maven/codegen/target/local-repo/org/apache/cxf/cxf-rt-core/2.5.2-SNAPSHOT/cxf-rt-core-2.5.2-20120105.060926-13.jar>
[INFO] Installing <https://builds.apache.org/job/CXF-trunk-deploy/ws/trunk/rt/core/target/cxf-rt-core-2.5.2-SNAPSHOT-sources.jar>
to <https://builds.apache.org/job/CXF-trunk-deploy/ws/trunk/systests/wsdl_maven/codegen/target/local-repo/org/apache/cxf/cxf-rt-core/2.5.2-SNAPSHOT/cxf-rt-core-2.5.2-20120105.060926-13-sources.jar>
[INFO] Installing <https://builds.apache.org/job/CXF-trunk-deploy/ws/trunk/rt/core/target/cxf-rt-core-2.5.2-SNAPSHOT-javadoc.jar>
to <https://builds.apache.org/job/CXF-trunk-deploy/ws/trunk/systests/wsdl_maven/codegen/target/local-repo/org/apache/cxf/cxf-rt-core/2.5.2-SNAPSHOT/cxf-rt-core-2.5.2-20120105.060926-13-javadoc.jar>
[INFO] Installing <https://builds.apache.org/job/CXF-trunk-deploy/ws/trunk/rt/bindings/soap/pom.xml>
to <https://builds.apache.org/job/CXF-trunk-deploy/ws/trunk/systests/wsdl_maven/codegen/target/local-repo/org/apache/cxf/cxf-rt-bindings-soap/2.5.2-SNAPSHOT/cxf-rt-bindings-soap-2.5.2-SNAPSHOT.pom>
[INFO] Installing <https://builds.apache.org/job/CXF-trunk-deploy/ws/trunk/rt/bindings/soap/target/cxf-rt-bindings-soap-2.5.2-SNAPSHOT.jar>
to <https://builds.apache.org/job/CXF-trunk-deploy/ws/trunk/systests/wsdl_maven/codegen/target/local-repo/org/apache/cxf/cxf-rt-bindings-soap/2.5.2-SNAPSHOT/cxf-rt-bindings-soap-2.5.2-20120105.060926-13.jar>
[INFO] Installing <https://builds.apache.org/job/CXF-trunk-deploy/ws/trunk/rt/bindings/soap/target/cxf-rt-bindings-soap-2.5.2-SNAPSHOT-sources.jar>
to <https://builds.apache.org/job/CXF-trunk-deploy/ws/trunk/systests/wsdl_maven/codegen/target/local-repo/org/apache/cxf/cxf-rt-bindings-soap/2.5.2-SNAPSHOT/cxf-rt-bindings-soap-2.5.2-20120105.060926-13-sources.jar>
[INFO] Installing <https://builds.apache.org/job/CXF-trunk-deploy/ws/trunk/rt/bindings/soap/target/cxf-rt-bindings-soap-2.5.2-SNAPSHOT-javadoc.jar>
to <https://builds.apache.org/job/CXF-trunk-deploy/ws/trunk/systests/wsdl_maven/codegen/target/local-repo/org/apache/cxf/cxf-rt-bindings-soap/2.5.2-SNAPSHOT/cxf-rt-bindings-soap-2.5.2-20120105.060926-13-javadoc.jar>
[INFO] Installing <https://builds.apache.org/job/CXF-trunk-deploy/ws/trunk/tools/common/pom.xml>
to <https://builds.apache.org/job/CXF-trunk-deploy/ws/trunk/systests/wsdl_maven/codegen/target/local-repo/org/apache/cxf/cxf-tools-common/2.5.2-SNAPSHOT/cxf-tools-common-2.5.2-SNAPSHOT.pom>
[INFO] Installing <https://builds.apache.org/job/CXF-trunk-deploy/ws/trunk/tools/common/target/cxf-tools-common-2.5.2-SNAPSHOT.jar>
to <https://builds.apache.org/job/CXF-trunk-deploy/ws/trunk/systests/wsdl_maven/codegen/target/local-repo/org/apache/cxf/cxf-tools-common/2.5.2-SNAPSHOT/cxf-tools-common-2.5.2-20120105.060926-13.jar>
[INFO] Installing <https://builds.apache.org/job/CXF-trunk-deploy/ws/trunk/tools/common/target/cxf-tools-common-2.5.2-SNAPSHOT-sources.jar>
to <https://builds.apache.org/job/CXF-trunk-deploy/ws/trunk/systests/wsdl_maven/codegen/target/local-repo/org/apache/cxf/cxf-tools-common/2.5.2-SNAPSHOT/cxf-tools-common-2.5.2-20120105.060926-13-sources.jar>
[INFO] Installing <https://builds.apache.org/job/CXF-trunk-deploy/ws/trunk/tools/common/target/cxf-tools-common-2.5.2-SNAPSHOT-javadoc.jar>
to <https://builds.apache.org/job/CXF-trunk-deploy/ws/trunk/systests/wsdl_maven/codegen/target/local-repo/org/apache/cxf/cxf-tools-common/2.5.2-SNAPSHOT/cxf-tools-common-2.5.2-20120105.060926-13-javadoc.jar>
[INFO] Installing <https://builds.apache.org/job/CXF-trunk-deploy/ws/trunk/rt/databinding/jaxb/pom.xml>
to <https://builds.apache.org/job/CXF-trunk-deploy/ws/trunk/systests/wsdl_maven/codegen/target/local-repo/org/apache/cxf/cxf-rt-databinding-jaxb/2.5.2-SNAPSHOT/cxf-rt-databinding-jaxb-2.5.2-SNAPSHOT.pom>
[INFO] Installing <https://builds.apache.org/job/CXF-trunk-deploy/ws/trunk/rt/databinding/jaxb/target/cxf-rt-databinding-jaxb-2.5.2-SNAPSHOT.jar>
to <https://builds.apache.org/job/CXF-trunk-deploy/ws/trunk/systests/wsdl_maven/codegen/target/local-repo/org/apache/cxf/cxf-rt-databinding-jaxb/2.5.2-SNAPSHOT/cxf-rt-databinding-jaxb-2.5.2-20120105.060926-13.jar>
[INFO] Installing <https://builds.apache.org/job/CXF-trunk-deploy/ws/trunk/rt/databinding/jaxb/target/cxf-rt-databinding-jaxb-2.5.2-SNAPSHOT-sources.jar>
to <https://builds.apache.org/job/CXF-trunk-deploy/ws/trunk/systests/wsdl_maven/codegen/target/local-repo/org/apache/cxf/cxf-rt-databinding-jaxb/2.5.2-SNAPSHOT/cxf-rt-databinding-jaxb-2.5.2-20120105.060926-13-sources.jar>
[INFO] Installing <https://builds.apache.org/job/CXF-trunk-deploy/ws/trunk/rt/databinding/jaxb/target/cxf-rt-databinding-jaxb-2.5.2-SNAPSHOT-javadoc.jar>
to <https://builds.apache.org/job/CXF-trunk-deploy/ws/trunk/systests/wsdl_maven/codegen/target/local-repo/org/apache/cxf/cxf-rt-databinding-jaxb/2.5.2-SNAPSHOT/cxf-rt-databinding-jaxb-2.5.2-20120105.060926-13-javadoc.jar>
[INFO] Installing <https://builds.apache.org/job/CXF-trunk-deploy/ws/trunk/rt/bindings/xml/pom.xml>
to <https://builds.apache.org/job/CXF-trunk-deploy/ws/trunk/systests/wsdl_maven/codegen/target/local-repo/org/apache/cxf/cxf-rt-bindings-xml/2.5.2-SNAPSHOT/cxf-rt-bindings-xml-2.5.2-SNAPSHOT.pom>
[INFO] Installing <https://builds.apache.org/job/CXF-trunk-deploy/ws/trunk/rt/bindings/xml/target/cxf-rt-bindings-xml-2.5.2-SNAPSHOT.jar>
to <https://builds.apache.org/job/CXF-trunk-deploy/ws/trunk/systests/wsdl_maven/codegen/target/local-repo/org/apache/cxf/cxf-rt-bindings-xml/2.5.2-SNAPSHOT/cxf-rt-bindings-xml-2.5.2-20120105.060926-13.jar>
[INFO] Installing <https://builds.apache.org/job/CXF-trunk-deploy/ws/trunk/rt/bindings/xml/target/cxf-rt-bindings-xml-2.5.2-SNAPSHOT-sources.jar>
to <https://builds.apache.org/job/CXF-trunk-deploy/ws/trunk/systests/wsdl_maven/codegen/target/local-repo/org/apache/cxf/cxf-rt-bindings-xml/2.5.2-SNAPSHOT/cxf-rt-bindings-xml-2.5.2-20120105.060926-13-sources.jar>
[INFO] Installing <https://builds.apache.org/job/CXF-trunk-deploy/ws/trunk/rt/bindings/xml/target/cxf-rt-bindings-xml-2.5.2-SNAPSHOT-javadoc.jar>
to <https://builds.apache.org/job/CXF-trunk-deploy/ws/trunk/systests/wsdl_maven/codegen/target/local-repo/org/apache/cxf/cxf-rt-bindings-xml/2.5.2-SNAPSHOT/cxf-rt-bindings-xml-2.5.2-20120105.060926-13-javadoc.jar>
[INFO] Installing <https://builds.apache.org/job/CXF-trunk-deploy/ws/trunk/rt/frontend/simple/pom.xml>
to <https://builds.apache.org/job/CXF-trunk-deploy/ws/trunk/systests/wsdl_maven/codegen/target/local-repo/org/apache/cxf/cxf-rt-frontend-simple/2.5.2-SNAPSHOT/cxf-rt-frontend-simple-2.5.2-SNAPSHOT.pom>
[INFO] Installing <https://builds.apache.org/job/CXF-trunk-deploy/ws/trunk/rt/frontend/simple/target/cxf-rt-frontend-simple-2.5.2-SNAPSHOT.jar>
to <https://builds.apache.org/job/CXF-trunk-deploy/ws/trunk/systests/wsdl_maven/codegen/target/local-repo/org/apache/cxf/cxf-rt-frontend-simple/2.5.2-SNAPSHOT/cxf-rt-frontend-simple-2.5.2-20120105.060926-13.jar>
[INFO] Installing <https://builds.apache.org/job/CXF-trunk-deploy/ws/trunk/rt/frontend/simple/target/cxf-rt-frontend-simple-2.5.2-SNAPSHOT-sources.jar>
to <https://builds.apache.org/job/CXF-trunk-deploy/ws/trunk/systests/wsdl_maven/codegen/target/local-repo/org/apache/cxf/cxf-rt-frontend-simple/2.5.2-SNAPSHOT/cxf-rt-frontend-simple-2.5.2-20120105.060926-13-sources.jar>
[INFO] Installing <https://builds.apache.org/job/CXF-trunk-deploy/ws/trunk/rt/frontend/simple/target/cxf-rt-frontend-simple-2.5.2-SNAPSHOT-javadoc.jar>
to <https://builds.apache.org/job/CXF-trunk-deploy/ws/trunk/systests/wsdl_maven/codegen/target/local-repo/org/apache/cxf/cxf-rt-frontend-simple/2.5.2-SNAPSHOT/cxf-rt-frontend-simple-2.5.2-20120105.060926-13-javadoc.jar>
[INFO] Installing <https://builds.apache.org/job/CXF-trunk-deploy/ws/trunk/rt/transports/http/pom.xml>
to <https://builds.apache.org/job/CXF-trunk-deploy/ws/trunk/systests/wsdl_maven/codegen/target/local-repo/org/apache/cxf/cxf-rt-transports-http/2.5.2-SNAPSHOT/cxf-rt-transports-http-2.5.2-SNAPSHOT.pom>
[INFO] Installing <https://builds.apache.org/job/CXF-trunk-deploy/ws/trunk/rt/transports/http/target/cxf-rt-transports-http-2.5.2-SNAPSHOT.jar>
to <https://builds.apache.org/job/CXF-trunk-deploy/ws/trunk/systests/wsdl_maven/codegen/target/local-repo/org/apache/cxf/cxf-rt-transports-http/2.5.2-SNAPSHOT/cxf-rt-transports-http-2.5.2-20120105.060926-13.jar>
[INFO] Installing <https://builds.apache.org/job/CXF-trunk-deploy/ws/trunk/rt/transports/http/target/cxf-rt-transports-http-2.5.2-SNAPSHOT-sources.jar>
to <https://builds.apache.org/job/CXF-trunk-deploy/ws/trunk/systests/wsdl_maven/codegen/target/local-repo/org/apache/cxf/cxf-rt-transports-http/2.5.2-SNAPSHOT/cxf-rt-transports-http-2.5.2-20120105.060926-13-sources.jar>
[INFO] Installing <https://builds.apache.org/job/CXF-trunk-deploy/ws/trunk/rt/transports/http/target/cxf-rt-transports-http-2.5.2-SNAPSHOT-javadoc.jar>
to <https://builds.apache.org/job/CXF-trunk-deploy/ws/trunk/systests/wsdl_maven/codegen/target/local-repo/org/apache/cxf/cxf-rt-transports-http/2.5.2-SNAPSHOT/cxf-rt-transports-http-2.5.2-20120105.060926-13-javadoc.jar>
[INFO] Installing <https://builds.apache.org/job/CXF-trunk-deploy/ws/trunk/rt/transports/common/pom.xml>
to <https://builds.apache.org/job/CXF-trunk-deploy/ws/trunk/systests/wsdl_maven/codegen/target/local-repo/org/apache/cxf/cxf-rt-transports-common/2.5.2-SNAPSHOT/cxf-rt-transports-common-2.5.2-SNAPSHOT.pom>
[INFO] Installing <https://builds.apache.org/job/CXF-trunk-deploy/ws/trunk/rt/transports/common/target/cxf-rt-transports-common-2.5.2-SNAPSHOT.jar>
to <https://builds.apache.org/job/CXF-trunk-deploy/ws/trunk/systests/wsdl_maven/codegen/target/local-repo/org/apache/cxf/cxf-rt-transports-common/2.5.2-SNAPSHOT/cxf-rt-transports-common-2.5.2-20120105.060926-13.jar>
[INFO] Installing <https://builds.apache.org/job/CXF-trunk-deploy/ws/trunk/rt/transports/common/target/cxf-rt-transports-common-2.5.2-SNAPSHOT-sources.jar>
to <https://builds.apache.org/job/CXF-trunk-deploy/ws/trunk/systests/wsdl_maven/codegen/target/local-repo/org/apache/cxf/cxf-rt-transports-common/2.5.2-SNAPSHOT/cxf-rt-transports-common-2.5.2-20120105.060926-13-sources.jar>
[INFO] Installing <https://builds.apache.org/job/CXF-trunk-deploy/ws/trunk/rt/transports/common/target/cxf-rt-transports-common-2.5.2-SNAPSHOT-javadoc.jar>
to <https://builds.apache.org/job/CXF-trunk-deploy/ws/trunk/systests/wsdl_maven/codegen/target/local-repo/org/apache/cxf/cxf-rt-transports-common/2.5.2-SNAPSHOT/cxf-rt-transports-common-2.5.2-20120105.060926-13-javadoc.jar>
[INFO] Installing <https://builds.apache.org/job/CXF-trunk-deploy/ws/trunk/rt/ws/addr/pom.xml>
to <https://builds.apache.org/job/CXF-trunk-deploy/ws/trunk/systests/wsdl_maven/codegen/target/local-repo/org/apache/cxf/cxf-rt-ws-addr/2.5.2-SNAPSHOT/cxf-rt-ws-addr-2.5.2-SNAPSHOT.pom>
[INFO] Installing <https://builds.apache.org/job/CXF-trunk-deploy/ws/trunk/rt/ws/addr/target/cxf-rt-ws-addr-2.5.2-SNAPSHOT.jar>
to <https://builds.apache.org/job/CXF-trunk-deploy/ws/trunk/systests/wsdl_maven/codegen/target/local-repo/org/apache/cxf/cxf-rt-ws-addr/2.5.2-SNAPSHOT/cxf-rt-ws-addr-2.5.2-20120105.060926-13.jar>
[INFO] Installing <https://builds.apache.org/job/CXF-trunk-deploy/ws/trunk/rt/ws/addr/target/cxf-rt-ws-addr-2.5.2-SNAPSHOT-sources.jar>
to <https://builds.apache.org/job/CXF-trunk-deploy/ws/trunk/systests/wsdl_maven/codegen/target/local-repo/org/apache/cxf/cxf-rt-ws-addr/2.5.2-SNAPSHOT/cxf-rt-ws-addr-2.5.2-20120105.060926-13-sources.jar>
[INFO] Installing <https://builds.apache.org/job/CXF-trunk-deploy/ws/trunk/rt/ws/addr/target/cxf-rt-ws-addr-2.5.2-SNAPSHOT-javadoc.jar>
to <https://builds.apache.org/job/CXF-trunk-deploy/ws/trunk/systests/wsdl_maven/codegen/target/local-repo/org/apache/cxf/cxf-rt-ws-addr/2.5.2-SNAPSHOT/cxf-rt-ws-addr-2.5.2-20120105.060926-13-javadoc.jar>
[INFO] Installing <https://builds.apache.org/job/CXF-trunk-deploy/ws/trunk/systests/wsdl_maven/codegen/pom.xml>
to <https://builds.apache.org/job/CXF-trunk-deploy/ws/trunk/systests/wsdl_maven/codegen/target/local-repo/org/apache/cxf/systests/wsdl_maven/cxf-systests-codegen/2.5.2-SNAPSHOT/cxf-systests-codegen-2.5.2-SNAPSHOT.pom>
[INFO] Installing <https://builds.apache.org/job/CXF-trunk-deploy/ws/trunk/systests/wsdl_maven/codegen/target/cxf-systests-codegen-2.5.2-SNAPSHOT.jar>
to <https://builds.apache.org/job/CXF-trunk-deploy/ws/trunk/systests/wsdl_maven/codegen/target/local-repo/org/apache/cxf/systests/wsdl_maven/cxf-systests-codegen/2.5.2-SNAPSHOT/cxf-systests-codegen-2.5.2-SNAPSHOT.jar>
[INFO] Installing <https://builds.apache.org/job/CXF-trunk-deploy/ws/trunk/systests/wsdl_maven/codegen/target/cxf-systests-codegen-2.5.2-SNAPSHOT-sources.jar>
to <https://builds.apache.org/job/CXF-trunk-deploy/ws/trunk/systests/wsdl_maven/codegen/target/local-repo/org/apache/cxf/systests/wsdl_maven/cxf-systests-codegen/2.5.2-SNAPSHOT/cxf-systests-codegen-2.5.2-SNAPSHOT-sources.jar>
[INFO] [invoker:integration-test {execution: integration-test}]
[INFO] Building: it-parent/pom.xml
[INFO] ..SUCCESS (4.3 s)
[INFO] Building: cxf-4004/pom.xml
[INFO] ..FAILED (22.7 s)
[INFO]   The build exited with code 1. See <https://builds.apache.org/job/CXF-trunk-deploy/ws/trunk/systests/wsdl_maven/codegen/target/it/cxf-4004/build.log>
for details.
[INFO] [invoker:verify {execution: integration-test}]
[INFO] -------------------------------------------------
[INFO] Build Summary:
[INFO]   Passed: 1, Failed: 1, Errors: 0, Skipped: 0
[INFO] -------------------------------------------------
[ERROR] The following builds failed:
[ERROR] *  cxf-4004/pom.xml
[INFO] -------------------------------------------------
[JENKINS] Archiving <https://builds.apache.org/job/CXF-trunk-deploy/ws/trunk/systests/wsdl_maven/codegen/pom.xml>
to /home/hudson/hudson/jobs/CXF-trunk-deploy/modules/org.apache.cxf.systests.wsdl_maven$cxf-systests-codegen/builds/2012-01-05_06-08-15/archive/org.apache.cxf.systests.wsdl_maven/cxf-systests-codegen/2.5.2-SNAPSHOT/cxf-systests-codegen-2.5.2-SNAPSHOT.pom
[JENKINS] Archiving <https://builds.apache.org/job/CXF-trunk-deploy/ws/trunk/systests/wsdl_maven/codegen/target/cxf-systests-codegen-2.5.2-SNAPSHOT.jar>
to /home/hudson/hudson/jobs/CXF-trunk-deploy/modules/org.apache.cxf.systests.wsdl_maven$cxf-systests-codegen/builds/2012-01-05_06-08-15/archive/org.apache.cxf.systests.wsdl_maven/cxf-systests-codegen/2.5.2-SNAPSHOT/cxf-systests-codegen-2.5.2-SNAPSHOT.jar
[JENKINS] Archiving <https://builds.apache.org/job/CXF-trunk-deploy/ws/trunk/systests/wsdl_maven/codegen/target/cxf-systests-codegen-2.5.2-SNAPSHOT-sources.jar>
to /home/hudson/hudson/jobs/CXF-trunk-deploy/modules/org.apache.cxf.systests.wsdl_maven$cxf-systests-codegen/builds/2012-01-05_06-08-15/archive/org.apache.cxf.systests.wsdl_maven/cxf-systests-codegen/2.5.2-SNAPSHOT/cxf-systests-codegen-2.5.2-SNAPSHOT-sources.jar
[INFO] ------------------------------------------------------------------------
[ERROR] BUILD FAILURE
[INFO] ------------------------------------------------------------------------
[INFO] : org.apache.maven.plugin.invoker.InvokerSession@196014
1 build failed.
[INFO] ------------------------------------------------------------------------
[INFO] Trace
org.apache.maven.BuildFailureException: 1 build failed.
	at org.apache.maven.lifecycle.DefaultLifecycleExecutor.executeGoals(DefaultLifecycleExecutor.java:715)
	at org.apache.maven.lifecycle.DefaultLifecycleExecutor.executeGoalWithLifecycle(DefaultLifecycleExecutor.java:556)
	at org.apache.maven.lifecycle.DefaultLifecycleExecutor.executeGoal(DefaultLifecycleExecutor.java:535)
	at org.apache.maven.lifecycle.DefaultLifecycleExecutor.executeGoalAndHandleFailures(DefaultLifecycleExecutor.java:387)
	at org.apache.maven.lifecycle.DefaultLifecycleExecutor.executeTaskSegments(DefaultLifecycleExecutor.java:348)
	at org.apache.maven.lifecycle.DefaultLifecycleExecutor.execute(DefaultLifecycleExecutor.java:180)
	at org.apache.maven.lifecycle.LifecycleExecutorInterceptor.execute(LifecycleExecutorInterceptor.java:65)
	at org.apache.maven.DefaultMaven.doExecute(DefaultMaven.java:328)
	at org.apache.maven.DefaultMaven.execute(DefaultMaven.java:138)
	at org.apache.maven.cli.MavenCli.main(MavenCli.java:362)
	at sun.reflect.NativeMethodAccessorImpl.invoke0(Native Method)
	at sun.reflect.NativeMethodAccessorImpl.invoke(NativeMethodAccessorImpl.java:39)
	at sun.reflect.DelegatingMethodAccessorImpl.invoke(DelegatingMethodAccessorImpl.java:25)
	at java.lang.reflect.Method.invoke(Method.java:592)
	at org.codehaus.classworlds.Launcher.launchEnhanced(Launcher.java:315)
	at org.codehaus.classworlds.Launcher.launch(Launcher.java:255)
	at hudson.maven.agent.Main.launch(Main.java:185)
	at hudson.maven.MavenBuilder.call(MavenBuilder.java:151)
	at hudson.maven.Maven2Builder.call(Maven2Builder.java:77)
	at hudson.maven.Maven2Builder.call(Maven2Builder.java:53)
	at hudson.remoting.UserRequest.perform(UserRequest.java:118)
	at hudson.remoting.UserRequest.perform(UserRequest.java:48)
	at hudson.remoting.Request$2.run(Request.java:287)
	at java.util.concurrent.Executors$RunnableAdapter.call(Executors.java:417)
	at java.util.concurrent.FutureTask$Sync.innerRun(FutureTask.java:269)
	at java.util.concurrent.FutureTask.run(FutureTask.java:123)
	at java.util.concurrent.ThreadPoolExecutor$Worker.runTask(ThreadPoolExecutor.java:651)
	at java.util.concurrent.ThreadPoolExecutor$Worker.run(ThreadPoolExecutor.java:676)
	at java.lang.Thread.run(Thread.java:595)
Caused by: org.apache.maven.plugin.MojoFailureException: 1 build failed.
	at org.apache.maven.plugin.invoker.InvokerSession.handleFailures(InvokerSession.java:263)
	at org.apache.maven.plugin.invoker.VerifyMojo.execute(VerifyMojo.java:124)
	at org.apache.maven.plugin.DefaultPluginManager.executeMojo(DefaultPluginManager.java:490)
	at hudson.maven.agent.PluginManagerInterceptor.executeMojo(PluginManagerInterceptor.java:182)
	at org.apache.maven.lifecycle.DefaultLifecycleExecutor.executeGoals(DefaultLifecycleExecutor.java:694)
	... 28 more
[INFO] ------------------------------------------------------------------------
[INFO] Total time: 42 minutes 14 seconds
[INFO] Finished at: Thu Jan 05 06:51:01 UTC 2012
[INFO] Final Memory: 358M/432M
[INFO] ------------------------------------------------------------------------
channel stopped


Mime
View raw message