cxf-notifications mailing list archives

Site index · List index
Message view « Date » · « Thread »
Top « Date » · « Thread »
From Apache Jenkins Server <jenk...@builds.apache.org>
Subject Build failed in Jenkins: CXF-trunk-deploy #755
Date Wed, 11 Jan 2012 06:46:30 GMT
See <https://builds.apache.org/job/CXF-trunk-deploy/755/changes>

Changes:

[dkulp] Move some utility methods into similar class in common

[dkulp] Move tools split packages from api to appropriate place in tool.

[dkulp] CHange generated package name to not conflict with rt-core stuff

[dkulp] Remove spring requirement for WSPolicyFeature

[dkulp] [CXF-4018] Fix problems with providers not getting the proper
JAXWSMethodInvoker

[dkulp] Apparently the command line checkstyle is stricter than the in-eclipse
version.  Not sure why yet.

------------------------------------------
[...truncated 15811 lines...]
[INFO]    task-segment: [clean, deploy]
[INFO] ------------------------------------------------------------------------
[INFO] [clean:clean {execution: default-clean}]
[INFO] [cxf-codegen:wsdl2java {execution: generate-sources}]
[INFO] [antrun:run {execution: copyxmlfiles}]
project.artifactId
[INFO] Executing tasks
     [copy] Copying 1 file to <https://builds.apache.org/job/CXF-trunk-deploy/ws/trunk/distribution/src/main/release/samples/configuration_interceptor/target/classes/demo/stream/client>
     [copy] Copying 1 file to <https://builds.apache.org/job/CXF-trunk-deploy/ws/trunk/distribution/src/main/release/samples/configuration_interceptor/target/classes/demo/stream/server>
     [copy] Copying 1 file to <https://builds.apache.org/job/CXF-trunk-deploy/ws/trunk/distribution/src/main/release/samples/configuration_interceptor/target/classes/demo/stream/client>
[INFO] Executed tasks
[INFO] [resources:resources {execution: default-resources}]
[INFO] Using 'UTF-8' encoding to copy filtered resources.
[INFO] skip non existing resourceDirectory <https://builds.apache.org/job/CXF-trunk-deploy/ws/trunk/distribution/src/main/release/samples/configuration_interceptor/src/main/resources>
[INFO] [compiler:compile {execution: default-compile}]
[INFO] Compiling 18 source files to <https://builds.apache.org/job/CXF-trunk-deploy/ws/trunk/distribution/src/main/release/samples/configuration_interceptor/target/classes>
[INFO] [resources:testResources {execution: default-testResources}]
[INFO] Using 'UTF-8' encoding to copy filtered resources.
[INFO] skip non existing resourceDirectory <https://builds.apache.org/job/CXF-trunk-deploy/ws/trunk/distribution/src/main/release/samples/configuration_interceptor/src/test/resources>
[INFO] [compiler:testCompile {execution: default-testCompile}]
[INFO] No sources to compile
[INFO] [surefire:test {execution: default-test}]
[INFO] Tests are skipped.
[INFO] [jar:jar {execution: default-jar}]
[INFO] Building jar: <https://builds.apache.org/job/CXF-trunk-deploy/ws/trunk/distribution/src/main/release/samples/configuration_interceptor/target/configuration_interceptor-2.6.0-SNAPSHOT.jar>
[INFO] [install:install {execution: default-install}]
[INFO] Installing <https://builds.apache.org/job/CXF-trunk-deploy/ws/trunk/distribution/src/main/release/samples/configuration_interceptor/target/configuration_interceptor-2.6.0-SNAPSHOT.jar>
to <https://builds.apache.org/job/CXF-trunk-deploy/ws/.repository/org/apache/cxf/samples/configuration_interceptor/2.6.0-SNAPSHOT/configuration_interceptor-2.6.0-SNAPSHOT.jar>
[INFO] [deploy:deploy {execution: default-deploy}]
[INFO]  skipping artifact deployement 
[JENKINS] Archiving <https://builds.apache.org/job/CXF-trunk-deploy/ws/trunk/distribution/src/main/release/samples/configuration_interceptor/pom.xml>
to /home/hudson/hudson/jobs/CXF-trunk-deploy/modules/org.apache.cxf.samples$configuration_interceptor/builds/2012-01-11_06-02-13/archive/org.apache.cxf.samples/configuration_interceptor/2.6.0-SNAPSHOT/configuration_interceptor-2.6.0-SNAPSHOT.pom
[JENKINS] Archiving <https://builds.apache.org/job/CXF-trunk-deploy/ws/trunk/distribution/src/main/release/samples/configuration_interceptor/target/configuration_interceptor-2.6.0-SNAPSHOT.jar>
to /home/hudson/hudson/jobs/CXF-trunk-deploy/modules/org.apache.cxf.samples$configuration_interceptor/builds/2012-01-11_06-02-13/archive/org.apache.cxf.samples/configuration_interceptor/2.6.0-SNAPSHOT/configuration_interceptor-2.6.0-SNAPSHOT.jar
[INFO] ------------------------------------------------------------------------
[INFO] Building Spring HTTP Sample
[INFO]    task-segment: [clean, deploy]
[INFO] ------------------------------------------------------------------------
[INFO] [clean:clean {execution: default-clean}]
[INFO] [resources:resources {execution: default-resources}]
[INFO] Using 'UTF-8' encoding to copy filtered resources.
[INFO] Copying 1 resource
[INFO] [compiler:compile {execution: default-compile}]
[INFO] Compiling 4 source files to <https://builds.apache.org/job/CXF-trunk-deploy/ws/trunk/distribution/src/main/release/samples/java_first_spring_support/target/classes>
[INFO] [resources:testResources {execution: default-testResources}]
[INFO] Using 'UTF-8' encoding to copy filtered resources.
[INFO] skip non existing resourceDirectory <https://builds.apache.org/job/CXF-trunk-deploy/ws/trunk/distribution/src/main/release/samples/java_first_spring_support/src/test/resources>
[INFO] [compiler:testCompile {execution: default-testCompile}]
[INFO] No sources to compile
[INFO] [surefire:test {execution: default-test}]
[INFO] Tests are skipped.
[INFO] [war:war {execution: default-war}]
[INFO] Packaging webapp
[INFO] Assembling webapp [java_first_spring_support] in [<https://builds.apache.org/job/CXF-trunk-deploy/ws/trunk/distribution/src/main/release/samples/java_first_spring_support/target/JavaFirstSpringSupport]>
[INFO] Processing war project
[INFO] Copying webapp resources [<https://builds.apache.org/job/CXF-trunk-deploy/ws/trunk/distribution/src/main/release/samples/java_first_spring_support/src/main/webapp]>
[INFO] Webapp assembled in [72 msecs]
[INFO] Building war: <https://builds.apache.org/job/CXF-trunk-deploy/ws/trunk/distribution/src/main/release/samples/java_first_spring_support/target/JavaFirstSpringSupport.war>
[INFO] WEB-INF/web.xml already added, skipping
[INFO] [install:install {execution: default-install}]
[INFO] Installing <https://builds.apache.org/job/CXF-trunk-deploy/ws/trunk/distribution/src/main/release/samples/java_first_spring_support/target/JavaFirstSpringSupport.war>
to <https://builds.apache.org/job/CXF-trunk-deploy/ws/.repository/org/apache/cxf/samples/java_first_spring_support/2.6.0-SNAPSHOT/java_first_spring_support-2.6.0-SNAPSHOT.war>
[INFO] [deploy:deploy {execution: default-deploy}]
[INFO]  skipping artifact deployement 
[JENKINS] Archiving <https://builds.apache.org/job/CXF-trunk-deploy/ws/trunk/distribution/src/main/release/samples/java_first_spring_support/pom.xml>
to /home/hudson/hudson/jobs/CXF-trunk-deploy/modules/org.apache.cxf.samples$java_first_spring_support/builds/2012-01-11_06-02-13/archive/org.apache.cxf.samples/java_first_spring_support/2.6.0-SNAPSHOT/java_first_spring_support-2.6.0-SNAPSHOT.pom
[JENKINS] Archiving <https://builds.apache.org/job/CXF-trunk-deploy/ws/trunk/distribution/src/main/release/samples/java_first_spring_support/target/JavaFirstSpringSupport.war>
to /home/hudson/hudson/jobs/CXF-trunk-deploy/modules/org.apache.cxf.samples$java_first_spring_support/builds/2012-01-11_06-02-13/archive/org.apache.cxf.samples/java_first_spring_support/2.6.0-SNAPSHOT/java_first_spring_support-2.6.0-SNAPSHOT.war
[INFO] ------------------------------------------------------------------------
[INFO] Building Spring HTTP Servlet demo with ruby support
[INFO]    task-segment: [clean, deploy]
[INFO] ------------------------------------------------------------------------
[INFO] [clean:clean {execution: default-clean}]
[INFO] [resources:resources {execution: default-resources}]
[INFO] Using 'UTF-8' encoding to copy filtered resources.
[INFO] Copying 2 resources
Downloading: http://repo1.maven.org/maven2/org/jruby/jruby/1.5.5/jruby-1.5.5.pom
[WARNING] Unable to get resource 'org.jruby:jruby:pom:1.5.5' from repository central (http://repo1.maven.org/maven2):
Error transferring file: Connection timed out
Downloading: http://repo1.maven.org/maven2/cglib/cglib-nodep/2.1_3/cglib-nodep-2.1_3.pom
[WARNING] Unable to get resource 'cglib:cglib-nodep:pom:2.1_3' from repository central (http://repo1.maven.org/maven2):
Error transferring file: Connection timed out
Downloading: http://repo1.maven.org/maven2/org/jruby/jruby/1.5.5/jruby-1.5.5.jar
Downloading: http://repo1.maven.org/maven2/cglib/cglib-nodep/2.1_3/cglib-nodep-2.1_3.jar
[WARNING] Unable to get resource 'cglib:cglib-nodep:jar:2.1_3' from repository central (http://repo1.maven.org/maven2):
Error transferring file: Connection timed out
[WARNING] Unable to get resource 'org.jruby:jruby:jar:1.5.5' from repository central (http://repo1.maven.org/maven2):
Error transferring file: Connection timed out
[JENKINS] Archiving <https://builds.apache.org/job/CXF-trunk-deploy/ws/trunk/distribution/src/main/release/samples/ruby_spring_support/pom.xml>
to /home/hudson/hudson/jobs/CXF-trunk-deploy/modules/org.apache.cxf.samples$ruby_spring_support/builds/2012-01-11_06-02-13/archive/org.apache.cxf.samples/ruby_spring_support/2.6.0-SNAPSHOT/ruby_spring_support-2.6.0-SNAPSHOT.pom
[INFO] ------------------------------------------------------------------------
[ERROR] BUILD ERROR
[INFO] ------------------------------------------------------------------------
[INFO] Failed to resolve artifact.

Missing:
----------
1) cglib:cglib-nodep:jar:2.1_3

  Try downloading the file manually from the project website.

  Then, install it using the command: 
      mvn install:install-file -DgroupId=cglib -DartifactId=cglib-nodep -Dversion=2.1_3 -Dpackaging=jar
-Dfile=/path/to/file

  Alternatively, if you host your own repository you can deploy the file there: 
      mvn deploy:deploy-file -DgroupId=cglib -DartifactId=cglib-nodep -Dversion=2.1_3 -Dpackaging=jar
-Dfile=/path/to/file -Durl=[url] -DrepositoryId=[id]

  Path to dependency: 
  	1) org.apache.cxf.samples:ruby_spring_support:war:2.6.0-SNAPSHOT
  	2) cglib:cglib-nodep:jar:2.1_3

2) org.jruby:jruby:jar:1.5.5

  Try downloading the file manually from the project website.

  Then, install it using the command: 
      mvn install:install-file -DgroupId=org.jruby -DartifactId=jruby -Dversion=1.5.5 -Dpackaging=jar
-Dfile=/path/to/file

  Alternatively, if you host your own repository you can deploy the file there: 
      mvn deploy:deploy-file -DgroupId=org.jruby -DartifactId=jruby -Dversion=1.5.5 -Dpackaging=jar
-Dfile=/path/to/file -Durl=[url] -DrepositoryId=[id]

  Path to dependency: 
  	1) org.apache.cxf.samples:ruby_spring_support:war:2.6.0-SNAPSHOT
  	2) org.jruby:jruby:jar:1.5.5

----------
2 required artifacts are missing.

for artifact: 
  org.apache.cxf.samples:ruby_spring_support:war:2.6.0-SNAPSHOT

from the specified remote repositories:
  central (http://repo1.maven.org/maven2)



[INFO] ------------------------------------------------------------------------
[INFO] Trace
org.apache.maven.lifecycle.LifecycleExecutionException: Missing:
----------
1) cglib:cglib-nodep:jar:2.1_3

  Try downloading the file manually from the project website.

  Then, install it using the command: 
      mvn install:install-file -DgroupId=cglib -DartifactId=cglib-nodep -Dversion=2.1_3 -Dpackaging=jar
-Dfile=/path/to/file

  Alternatively, if you host your own repository you can deploy the file there: 
      mvn deploy:deploy-file -DgroupId=cglib -DartifactId=cglib-nodep -Dversion=2.1_3 -Dpackaging=jar
-Dfile=/path/to/file -Durl=[url] -DrepositoryId=[id]

  Path to dependency: 
  	1) org.apache.cxf.samples:ruby_spring_support:war:2.6.0-SNAPSHOT
  	2) cglib:cglib-nodep:jar:2.1_3

2) org.jruby:jruby:jar:1.5.5

  Try downloading the file manually from the project website.

  Then, install it using the command: 
      mvn install:install-file -DgroupId=org.jruby -DartifactId=jruby -Dversion=1.5.5 -Dpackaging=jar
-Dfile=/path/to/file

  Alternatively, if you host your own repository you can deploy the file there: 
      mvn deploy:deploy-file -DgroupId=org.jruby -DartifactId=jruby -Dversion=1.5.5 -Dpackaging=jar
-Dfile=/path/to/file -Durl=[url] -DrepositoryId=[id]

  Path to dependency: 
  	1) org.apache.cxf.samples:ruby_spring_support:war:2.6.0-SNAPSHOT
  	2) org.jruby:jruby:jar:1.5.5

----------
2 required artifacts are missing.

for artifact: 
  org.apache.cxf.samples:ruby_spring_support:war:2.6.0-SNAPSHOT

from the specified remote repositories:
  central (http://repo1.maven.org/maven2)


	at org.apache.maven.lifecycle.DefaultLifecycleExecutor.executeGoals(DefaultLifecycleExecutor.java:711)
	at org.apache.maven.lifecycle.DefaultLifecycleExecutor.executeGoalWithLifecycle(DefaultLifecycleExecutor.java:556)
	at org.apache.maven.lifecycle.DefaultLifecycleExecutor.executeGoal(DefaultLifecycleExecutor.java:535)
	at org.apache.maven.lifecycle.DefaultLifecycleExecutor.executeGoalAndHandleFailures(DefaultLifecycleExecutor.java:387)
	at org.apache.maven.lifecycle.DefaultLifecycleExecutor.executeTaskSegments(DefaultLifecycleExecutor.java:348)
	at org.apache.maven.lifecycle.DefaultLifecycleExecutor.execute(DefaultLifecycleExecutor.java:180)
	at org.apache.maven.lifecycle.LifecycleExecutorInterceptor.execute(LifecycleExecutorInterceptor.java:65)
	at org.apache.maven.DefaultMaven.doExecute(DefaultMaven.java:328)
	at org.apache.maven.DefaultMaven.execute(DefaultMaven.java:138)
	at org.apache.maven.cli.MavenCli.main(MavenCli.java:362)
	at sun.reflect.NativeMethodAccessorImpl.invoke0(Native Method)
	at sun.reflect.NativeMethodAccessorImpl.invoke(NativeMethodAccessorImpl.java:39)
	at sun.reflect.DelegatingMethodAccessorImpl.invoke(DelegatingMethodAccessorImpl.java:25)
	at java.lang.reflect.Method.invoke(Method.java:592)
	at org.codehaus.classworlds.Launcher.launchEnhanced(Launcher.java:315)
	at org.codehaus.classworlds.Launcher.launch(Launcher.java:255)
	at hudson.maven.agent.Main.launch(Main.java:185)
	at hudson.maven.MavenBuilder.call(MavenBuilder.java:151)
	at hudson.maven.Maven2Builder.call(Maven2Builder.java:77)
	at hudson.maven.Maven2Builder.call(Maven2Builder.java:53)
	at hudson.remoting.UserRequest.perform(UserRequest.java:118)
	at hudson.remoting.UserRequest.perform(UserRequest.java:48)
	at hudson.remoting.Request$2.run(Request.java:287)
	at java.util.concurrent.Executors$RunnableAdapter.call(Executors.java:417)
	at java.util.concurrent.FutureTask$Sync.innerRun(FutureTask.java:269)
	at java.util.concurrent.FutureTask.run(FutureTask.java:123)
	at java.util.concurrent.ThreadPoolExecutor$Worker.runTask(ThreadPoolExecutor.java:651)
	at java.util.concurrent.ThreadPoolExecutor$Worker.run(ThreadPoolExecutor.java:676)
	at java.lang.Thread.run(Thread.java:595)
Caused by: org.apache.maven.artifact.resolver.MultipleArtifactsNotFoundException: Missing:
----------
1) cglib:cglib-nodep:jar:2.1_3

  Try downloading the file manually from the project website.

  Then, install it using the command: 
      mvn install:install-file -DgroupId=cglib -DartifactId=cglib-nodep -Dversion=2.1_3 -Dpackaging=jar
-Dfile=/path/to/file

  Alternatively, if you host your own repository you can deploy the file there: 
      mvn deploy:deploy-file -DgroupId=cglib -DartifactId=cglib-nodep -Dversion=2.1_3 -Dpackaging=jar
-Dfile=/path/to/file -Durl=[url] -DrepositoryId=[id]

  Path to dependency: 
  	1) org.apache.cxf.samples:ruby_spring_support:war:2.6.0-SNAPSHOT
  	2) cglib:cglib-nodep:jar:2.1_3

2) org.jruby:jruby:jar:1.5.5

  Try downloading the file manually from the project website.

  Then, install it using the command: 
      mvn install:install-file -DgroupId=org.jruby -DartifactId=jruby -Dversion=1.5.5 -Dpackaging=jar
-Dfile=/path/to/file

  Alternatively, if you host your own repository you can deploy the file there: 
      mvn deploy:deploy-file -DgroupId=org.jruby -DartifactId=jruby -Dversion=1.5.5 -Dpackaging=jar
-Dfile=/path/to/file -Durl=[url] -DrepositoryId=[id]

  Path to dependency: 
  	1) org.apache.cxf.samples:ruby_spring_support:war:2.6.0-SNAPSHOT
  	2) org.jruby:jruby:jar:1.5.5

----------
2 required artifacts are missing.

for artifact: 
  org.apache.cxf.samples:ruby_spring_support:war:2.6.0-SNAPSHOT

from the specified remote repositories:
  central (http://repo1.maven.org/maven2)


	at org.apache.maven.artifact.resolver.DefaultArtifactResolver.resolveTransitively(DefaultArtifactResolver.java:360)
	at org.apache.maven.artifact.resolver.DefaultArtifactResolver.resolveTransitively(DefaultArtifactResolver.java:304)
	at org.apache.maven.plugin.DefaultPluginManager.resolveTransitiveDependencies(DefaultPluginManager.java:1499)
	at org.apache.maven.plugin.DefaultPluginManager.executeMojo(DefaultPluginManager.java:442)
	at hudson.maven.agent.PluginManagerInterceptor.executeMojo(PluginManagerInterceptor.java:182)
	at org.apache.maven.lifecycle.DefaultLifecycleExecutor.executeGoals(DefaultLifecycleExecutor.java:694)
	... 28 more
[INFO] ------------------------------------------------------------------------
[INFO] Total time: 43 minutes 40 seconds
[INFO] Finished at: Wed Jan 11 06:46:25 UTC 2012
[INFO] Final Memory: 369M/508M
[INFO] ------------------------------------------------------------------------
channel stopped


Mime
View raw message